{"text_format":"3","workbook":"xlsx","n_sheets":2,"sheets":["Urenstaat werknemer","Weekdag_Opzoeken"],"not_rendered":{"defined_names":27},"read":"whole","date_system":"1900"}

{"sheet":"Urenstaat werknemer","index":0,"n_rows":36,"n_cols":26,"rows_kept":36,"merged":[[0,1,2,4],[0,5,2,9],[0,10,2,14],[0,15,3,23],[0,24,3,24],[3,1,3,3],[3,5,3,9],[3,10,3,14],[4,1,6,3],[4,4,6,6],[5,14,7,14],[5,22,7,22],[5,23,7,23],[5,24,7,24],[21,1,21,6],[22,1,23,3],[22,4,23,6],[23,14,24,14],[23,22,24,22],[23,23,24,23],[23,24,24,24],[32,1,32,6],[32,24,33,24],[32,25,33,25],[33,1,33,6],[34,1,34,6],[35,1,35,3],[35,4,35,5],[35,6,35,7],[35,8,35,14],[35,15,35,16],[35,17,35,23]]}
[null,"URENSTAAT WERKNEMERS",{"$nulls":3},"Naam van werknemer",{"$nulls":9},"Selecteer Ja in cel rechts in geval van overuren \nautorisatie is vereist"]
[]
[]
[null,"Einddatum salarisadministratie",null,null,{"$f":"V7","v":"2025-06-14"},"Nummer van werknemer"]
[null,"NORMALE UREN:",null,null,"Datum:"]
[{"$nulls":14},"Totaal\nWeek 1\nNormaal",{"$nulls":7},"Totaal\nWeek 2\nNormaal","Totaal\nNormaal\nUur","Salarisadministratie\nGebruik alleen\nBetaalcode"]
[{"$nulls":7},"2025-06-01",{"$f":"Dag_Een+1","v":"2025-06-02"},{"$f":"Dag_Een+2","v":"2025-06-03"},{"$f":"Dag_Een+3","v":"2025-06-04"},{"$f":"Dag_Een+4","v":"2025-06-05"},{"$f":"Dag_Een+5","v":"2025-06-06"},{"$f":"Dag_Een+6","v":"2025-06-07"},null,{"$f":"Dag_Een+7","v":"2025-06-08"},{"$f":"Dag_Een+8","v":"2025-06-09"},{"$f":"Dag_Een+9","v":"2025-06-10"},{"$f":"Dag_Een+10","v":"2025-06-11"},{"$f":"Dag_Een+11","v":"2025-06-12"},{"$f":"Dag_Een+12","v":"2025-06-13"},{"$f":"Dag_Een+13","v":"2025-06-14"}]
[null,"Taak","Loc","WO-nr","Werkomschrijving","Functie","Functienummer",{"$f":"VLOOKUP(WEEKDAY(Dag_Een),'Weekdag_Opzoeken'!$B$2:$C$8,2)","v":"zo"},{"$f":"VLOOKUP(WEEKDAY(I7),'Weekdag_Opzoeken'!$B$2:$C$8,2)","v":"ma"},{"$f":"VLOOKUP(WEEKDAY(J7),'Weekdag_Opzoeken'!$B$2:$C$8,2)","v":"di"},{"$f":"VLOOKUP(WEEKDAY(K7),'Weekdag_Opzoeken'!$B$2:$C$8,2)","v":"wo"},{"$f":"VLOOKUP(WEEKDAY(L7),'Weekdag_Opzoeken'!$B$2:$C$8,2)","v":"do"},{"$f":"VLOOKUP(WEEKDAY(M7),'Weekdag_Opzoeken'!$B$2:$C$8,2)","v":"Vr"},{"$f":"VLOOKUP(WEEKDAY(N7),'Weekdag_Opzoeken'!$B$2:$C$8,2)","v":"za"},null,{"$f":"VLOOKUP(WEEKDAY(P7),'Weekdag_Opzoeken'!$B$2:$C$8,2)","v":"zo"},{"$f":"VLOOKUP(WEEKDAY(Q7),'Weekdag_Opzoeken'!$B$2:$C$8,2)","v":"ma"},{"$f":"VLOOKUP(WEEKDAY(R7),'Weekdag_Opzoeken'!$B$2:$C$8,2)","v":"di"},{"$f":"VLOOKUP(WEEKDAY(S7),'Weekdag_Opzoeken'!$B$2:$C$8,2)","v":"wo"},{"$f":"VLOOKUP(WEEKDAY(T7),'Weekdag_Opzoeken'!$B$2:$C$8,2)","v":"do"},{"$f":"VLOOKUP(WEEKDAY(U7),'Weekdag_Opzoeken'!$B$2:$C$8,2)","v":"Vr"},{"$f":"VLOOKUP(WEEKDAY(V7),'Weekdag_Opzoeken'!$B$2:$C$8,2)","v":"za"}]
[{"$nulls":14},{"$f":"SUM(H9:N9)","v":{"v":0,"d":"0.00"}},{"$nulls":7},{"$f":"SUM(P9:V9)","v":{"v":0,"d":"0.00"}},{"$f":"O9+W9","v":{"v":0,"d":"0.00"}}]
[{"$nulls":14},{"v":0,"d":"0.00"},{"$nulls":7},{"v":0,"d":"0.00"},{"v":0,"d":"0.00"}]
[{"$nulls":14},{"v":0,"d":"0.00"},{"$nulls":7},{"v":0,"d":"0.00"},{"v":0,"d":"0.00"}]
[{"$nulls":14},{"v":0,"d":"0.00"},{"$nulls":7},{"v":0,"d":"0.00"},{"v":0,"d":"0.00"}]
[{"$nulls":14},{"v":0,"d":"0.00"},{"$nulls":7},{"v":0,"d":"0.00"},{"v":0,"d":"0.00"}]
[{"$nulls":14},{"v":0,"d":"0.00"},{"$nulls":7},{"v":0,"d":"0.00"},{"v":0,"d":"0.00"}]
[{"$nulls":14},{"v":0,"d":"0.00"},{"$nulls":7},{"v":0,"d":"0.00"},{"v":0,"d":"0.00"}]
[{"$nulls":14},{"$f":"SUM(H16:N16)","v":{"v":0,"d":"0.00"}},{"$nulls":7},{"$f":"SUM(P16:V16)","v":{"v":0,"d":"0.00"}},{"$f":"O16+W16","v":{"v":0,"d":"0.00"}}]
[{"$nulls":14},{"v":0,"d":"0.00"},{"$nulls":7},{"v":0,"d":"0.00"},{"v":0,"d":"0.00"}]
[{"$nulls":14},{"v":0,"d":"0.00"},{"$nulls":7},{"v":0,"d":"0.00"},{"v":0,"d":"0.00"}]
[{"$nulls":14},{"v":0,"d":"0.00"},{"$nulls":7},{"v":0,"d":"0.00"},{"v":0,"d":"0.00"}]
[{"$nulls":14},{"v":0,"d":"0.00"},{"$nulls":7},{"v":0,"d":"0.00"},{"v":0,"d":"0.00"}]
[{"$nulls":14},{"v":0,"d":"0.00"},{"$nulls":7},{"v":0,"d":"0.00"},{"v":0,"d":"0.00"}]
[null,"Totaal normale uren   ",{"$nulls":5},{"$f":"SUM(H9:H21)","v":{"v":0,"d":"0.00"}},{"v":0,"d":"0.00"},{"v":0,"d":"0.00"},{"v":0,"d":"0.00"},{"v":0,"d":"0.00"},{"v":0,"d":"0.00"},{"v":0,"d":"0.00"},{"v":0,"d":"0.00"},{"v":0,"d":"0.00"},{"$f":"SUM(Q9:Q21)","v":{"v":0,"d":"0.00"}},{"v":0,"d":"0.00"},{"v":0,"d":"0.00"},{"v":0,"d":"0.00"},{"v":0,"d":"0.00"},{"v":0,"d":"0.00"},{"$f":"SUM(W9:W21)","v":{"v":0,"d":"0.00"}},{"$f":"SUM(X9:X21)","v":{"v":0,"d":"0.00"}}]
[null,"OVERUREN:",null,null,"Datum:"]
[{"$nulls":7},{"$f":"Dag_Een","v":"2025-06-01"},{"$f":"Dag_Een+1","v":"2025-06-02"},{"$f":"Dag_Een+2","v":"2025-06-03"},{"$f":"Dag_Een+3","v":"2025-06-04"},{"$f":"Dag_Een+4","v":"2025-06-05"},{"$f":"Dag_Een+5","v":"2025-06-06"},{"$f":"Dag_Een+6","v":"2025-06-07"},"Week 1 O/U",{"$f":"Dag_Een+7","v":"2025-06-08"},{"$f":"Dag_Een+8","v":"2025-06-09"},{"$f":"Dag_Een+9","v":"2025-06-10"},{"$f":"Dag_Een+10","v":"2025-06-11"},{"$f":"Dag_Een+11","v":"2025-06-12"},{"$f":"Dag_Een+12","v":"2025-06-13"},{"$f":"Dag_Een+13","v":"2025-06-14"},"Week 2 O/U","Totaal O/U","Overuren\nCode"]
[null,"Taak","Loc","WO-nr","Werkomschrijving","Functie","Functienummer",{"$f":"VLOOKUP(WEEKDAY(Dag_Een),'Weekdag_Opzoeken'!$B$2:$C$8,2)","v":"zo"},{"$f":"VLOOKUP(WEEKDAY(I24),'Weekdag_Opzoeken'!$B$2:$C$8,2)","v":"ma"},{"$f":"VLOOKUP(WEEKDAY(J24),'Weekdag_Opzoeken'!$B$2:$C$8,2)","v":"di"},{"$f":"VLOOKUP(WEEKDAY(K24),'Weekdag_Opzoeken'!$B$2:$C$8,2)","v":"wo"},{"$f":"VLOOKUP(WEEKDAY(L24),'Weekdag_Opzoeken'!$B$2:$C$8,2)","v":"do"},{"$f":"VLOOKUP(WEEKDAY(M24),'Weekdag_Opzoeken'!$B$2:$C$8,2)","v":"Vr"},{"$f":"VLOOKUP(WEEKDAY(N24),'Weekdag_Opzoeken'!$B$2:$C$8,2)","v":"za"},null,{"$f":"VLOOKUP(WEEKDAY(P24),'Weekdag_Opzoeken'!$B$2:$C$8,2)","v":"zo"},{"$f":"VLOOKUP(WEEKDAY(Q24),'Weekdag_Opzoeken'!$B$2:$C$8,2)","v":"ma"},{"$f":"VLOOKUP(WEEKDAY(R24),'Weekdag_Opzoeken'!$B$2:$C$8,2)","v":"di"},{"$f":"VLOOKUP(WEEKDAY(S24),'Weekdag_Opzoeken'!$B$2:$C$8,2)","v":"wo"},{"$f":"VLOOKUP(WEEKDAY(T24),'Weekdag_Opzoeken'!$B$2:$C$8,2)","v":"do"},{"$f":"VLOOKUP(WEEKDAY(U24),'Weekdag_Opzoeken'!$B$2:$C$8,2)","v":"Vr"},{"$f":"VLOOKUP(WEEKDAY(V24),'Weekdag_Opzoeken'!$B$2:$C$8,2)","v":"za"}]
[{"$nulls":14},{"$f":"SUM(H26:N26)","v":{"v":0,"d":"0.00"}},{"$nulls":7},{"$f":"SUM(P26:V26)","v":{"v":0,"d":"0.00"}},{"$f":"O26+W26","v":{"v":0,"d":"0.00"}}]
[{"$nulls":14},{"v":0,"d":"0.00"},{"$nulls":7},{"v":0,"d":"0.00"},{"v":0,"d":"0.00"}]
[{"$nulls":14},{"v":0,"d":"0.00"},{"$nulls":7},{"v":0,"d":"0.00"},{"v":0,"d":"0.00"}]
[{"$nulls":14},{"v":0,"d":"0.00"},{"$nulls":7},{"v":0,"d":"0.00"},{"v":0,"d":"0.00"}]
[{"$nulls":14},{"v":0,"d":"0.00"},{"$nulls":7},{"v":0,"d":"0.00"},{"v":0,"d":"0.00"}]
[{"$nulls":14},{"v":0,"d":"0.00"},{"$nulls":7},{"v":0,"d":"0.00"},{"v":0,"d":"0.00"}]
[{"$nulls":14},{"v":0,"d":"0.00"},{"$nulls":7},{"v":0,"d":"0.00"},{"v":0,"d":"0.00"}]
[null,"Totaal overuren     ",{"$nulls":5},{"$f":"SUM(H26:H32)","v":{"v":0,"d":"0.00"}},{"v":0,"d":"0.00"},{"v":0,"d":"0.00"},{"v":0,"d":"0.00"},{"v":0,"d":"0.00"},{"v":0,"d":"0.00"},{"v":0,"d":"0.00"},{"$f":"SUM(O26:O32)","v":{"v":0,"d":"0.00"}},{"v":0,"d":"0.00"},{"v":0,"d":"0.00"},{"v":0,"d":"0.00"},{"v":0,"d":"0.00"},{"v":0,"d":"0.00"},{"v":0,"d":"0.00"},{"v":0,"d":"0.00"},{"$f":"SUM(P33:V33)","v":{"v":0,"d":"0.00"}},{"$f":"SUM(X26:X32)","v":{"v":0,"d":"0.00"}},"Totaal\nUur\nGewerkt","Totaal\nUur\nBetaald"]
[null,"Compensatie overuren     ",{"$nulls":12},{"$f":"IF(SUM(H34:N34)<=O33,SUM(H34:N34),O33)","v":{"v":0,"d":"0.00"}},{"$nulls":7},{"$f":"IF(SUM(P34:V34)<=W33,SUM(P34:V34),W33)","v":{"v":0,"d":"0.00"}},{"$f":"IF(SUM(Q34:W34)<=X33,SUM(Q34:W34),X33)","v":{"v":0,"d":"0.00"}}]
[null,"Uitbetaalde overuren     ",{"$nulls":5},{"$f":"IF(H33>=H34,H33-H34,H33)","v":{"v":0,"d":"0.00"}},{"$f":"IF(I33>=I34,I33-I34,I33)","v":{"v":0,"d":"0.00"}},{"v":0,"d":"0.00"},{"v":0,"d":"0.00"},{"v":0,"d":"0.00"},{"v":0,"d":"0.00"},{"v":0,"d":"0.00"},{"v":0,"d":"0.00"},{"v":0,"d":"0.00"},{"v":0,"d":"0.00"},{"v":0,"d":"0.00"},{"v":0,"d":"0.00"},{"v":0,"d":"0.00"},{"v":0,"d":"0.00"},{"v":0,"d":"0.00"},{"$f":"IF(W33>=W34,W33-W34,W33)","v":{"v":0,"d":"0.00"}},{"$f":"IF(X33>=X34,X33-X34,X33)","v":{"v":0,"d":"0.00"}},{"$f":"$X$22+$X$33","v":{"v":0,"d":"0.00"}},{"$f":"X22+X35","v":{"v":0,"d":"0.00"}}]
[null,"Werknemer ",{"$nulls":4},"Supervisor ",{"$nulls":8},"Supervisor "]

{"sheet":"Weekdag_Opzoeken","index":1,"n_rows":8,"n_cols":3,"rows_kept":8}
[null,"Weekdag\nGeheel getal","Weekdag\nInitialen"]
[null,1,"zo"]
[null,2,"ma"]
[null,3,"di"]
[null,4,"wo"]
[null,5,"do"]
[null,6,"Vr"]
[null,7,"za"]