{"text_format":"3","workbook":"xlsx","n_sheets":4,"sheets":["Månedlig budsjettsammendrag","Inntekter","Personalutgifter","Driftsutgifter"],"not_rendered":{"charts":1,"defined_names":14},"read":"whole","date_system":"1900"}

{"sheet":"Månedlig budsjettsammendrag","index":0,"n_rows":17,"n_cols":5,"rows_kept":17,"merged":[[1,1,1,3],[1,4,1,5],[8,1,8,4]]}
[null,"FIRMANAVN"]
[null,"MÅNEDLIG BUDSJETT",null,null,"Dato"]
[]
[null,"BUDSJETT-TOTALER","ESTIMERT","FAKTISK","DIFFERANSE"]
[null,"Inntekter",{"$f":"Inntekter[[#Totals],[ESTIMERT]]","v":{"v":63300,"d":"63,300.00"}},{"$f":"Inntekter[[#Totals],[FAKTISK]]","v":{"v":57450,"d":"57,450.00"}},{"$f":"Totaler[[#This Row],[FAKTISK]]-Totaler[[#This Row],[ESTIMERT]]","v":{"v":-5850,"d":"-5,850.00 "}}]
[null,"Utgifter",{"$f":"Driftsutgifter[[#Totals],[ESTIMERT]]+Personalutgifter[[#Totals],[ESTIMERT]]","v":{"v":54500,"d":"54,500.00"}},{"$f":"Driftsutgifter[[#Totals],[FAKTISK]]+Personalutgifter[[#Totals],[FAKTISK]]","v":{"v":49630,"d":"49,630.00"}},{"$f":"Totaler[[#This Row],[FAKTISK]]-Totaler[[#This Row],[ESTIMERT]]","v":{"v":-4870,"d":"-4,870.00 "}}]
[null,"Saldo (inntekter minus utgifter)",{"$f":"C5-C6","v":{"v":8800,"d":"8,800.00"}},{"$f":"D5-D6","v":{"v":7820,"d":"7,820.00"}},{"$f":"Totaler[[#Totals],[FAKTISK]]-Totaler[[#Totals],[ESTIMERT]]","v":{"v":-980,"d":"-980.00 "}}]
[]
[null,"Diagrammet for budsjettoversikt vises i denne cellen. De fem største driftsutgiftene oppdateres automatisk i tabellen FemStørsteUtgifter nedenfor."]
[null,"HVA ER DE FEM STØRSTE DRIFTSUTGIFTENE?"]
[null,"UTGIFT","BELØP","% AV UTGIFTER","15 % REDUSERING"]
[null,{"$f":"INDEX(Driftsutgifter[],MATCH(DeFemStørsteUtgiftene[[#This Row],[BELØP]],Driftsutgifter[FEM STØRSTE BELØP],0),1)","v":"Vedlikehold og reparasjoner"},{"$f":"LARGE(Driftsutgifter[FEM STØRSTE BELØP],1)","v":{"v":4600.000024,"d":"4,600.00"}},{"$f":"DeFemStørsteUtgiftene[[#This Row],[BELØP]]/$D$6","v":{"v":0.09268587596211969,"d":"9.3 %"}},{"$f":"DeFemStørsteUtgiftene[[#This Row],[BELØP]]*0.15","v":{"v":690.0000036,"d":"690.00"}}]
[null,{"$f":"INDEX(Driftsutgifter[],MATCH(DeFemStørsteUtgiftene[[#This Row],[BELØP]],Driftsutgifter[FEM STØRSTE BELØP],0),1)","v":"Utstyr"},{"$f":"LARGE(Driftsutgifter[FEM STØRSTE BELØP],2)","v":{"v":4500.000023,"d":"4,500.00"}},{"$f":"DeFemStørsteUtgiftene[[#This Row],[BELØP]]/$D$6","v":{"v":0.09067096560548055,"d":"9.1 %"}},{"$f":"DeFemStørsteUtgiftene[[#This Row],[BELØP]]*0.15","v":{"v":675.0000034499999,"d":"675.00"}}]
[null,{"$f":"INDEX(Driftsutgifter[],MATCH(DeFemStørsteUtgiftene[[#This Row],[BELØP]],Driftsutgifter[FEM STØRSTE BELØP],0),1)","v":"Leie- eller lånekostnader"},{"$f":"LARGE(Driftsutgifter[FEM STØRSTE BELØP],3)","v":{"v":4500.000011,"d":"4,500.00"}},{"$f":"DeFemStørsteUtgiftene[[#This Row],[BELØP]]/$D$6","v":{"v":0.09067096536369132,"d":"9.1 %"}},{"$f":"DeFemStørsteUtgiftene[[#This Row],[BELØP]]*0.15","v":{"v":675.00000165,"d":"675.00"}}]
[null,{"$f":"INDEX(Driftsutgifter[],MATCH(DeFemStørsteUtgiftene[[#This Row],[BELØP]],Driftsutgifter[FEM STØRSTE BELØP],0),1)","v":"Skatter og avgifter"},{"$f":"LARGE(Driftsutgifter[FEM STØRSTE BELØP],4)","v":{"v":3200.000021,"d":"3,200.00"}},{"$f":"DeFemStørsteUtgiftene[[#This Row],[BELØP]]/$D$6","v":{"v":0.06447713119081201,"d":"6.4 %"}},{"$f":"DeFemStørsteUtgiftene[[#This Row],[BELØP]]*0.15","v":{"v":480.00000314999994,"d":"480.00"}}]
[null,{"$f":"INDEX(Driftsutgifter[],MATCH(DeFemStørsteUtgiftene[[#This Row],[BELØP]],Driftsutgifter[FEM STØRSTE BELØP],0),1)","v":"Annonsering"},{"$f":"LARGE(Driftsutgifter[FEM STØRSTE BELØP],5)","v":{"v":2500.000006,"d":"2,500.00"}},{"$f":"DeFemStørsteUtgiftene[[#This Row],[BELØP]]/$D$6","v":{"v":0.05037275853314528,"d":"5.0 %"}},{"$f":"DeFemStørsteUtgiftene[[#This Row],[BELØP]]*0.15","v":{"v":375.00000090000003,"d":"375.00"}}]
[null,"Totalt",{"$f":"SUBTOTAL(109,DeFemStørsteUtgiftene[BELØP])","v":{"v":19300.000085,"d":"19,300.00"}},{"$f":"SUBTOTAL(109,DeFemStørsteUtgiftene[% AV UTGIFTER])","v":{"v":0.38887769665524885,"d":"38.9 %"}},{"$f":"SUBTOTAL(109,DeFemStørsteUtgiftene[15 % REDUSERING])","v":{"v":2895.0000127499998,"d":"2,895.00"}}]

{"sheet":"Inntekter","index":1,"n_rows":8,"n_cols":6,"rows_kept":8,"merged":[[1,1,1,3]]}
[null,{"$f":"FIRMANAVN","v":"FIRMANAVN"}]
[null,{"$f":"BUDSJETT_Tittel","v":"MÅNEDLIG BUDSJETT"}]
[]
[null,"INNTEKTER","ESTIMERT","FAKTISK","FEM STØRSTE BELØP","DIFFERANSE"]
[null,"Nettosalg",{"v":60000,"d":"60,000.00"},{"v":54000,"d":"54,000.00"},{"$f":"Inntekter[[#This Row],[FAKTISK]]+(10^-6)*ROW(Inntekter[[#This Row],[FAKTISK]])","v":{"v":54000.000005,"d":"54,000.00"}},{"$f":"Inntekter[[#This Row],[FAKTISK]]-Inntekter[[#This Row],[ESTIMERT]]","v":{"v":-6000,"d":"-6,000.00 "}}]
[null,"Finansinntekter",{"v":3000,"d":"3,000.00"},{"v":3000,"d":"3,000.00"},{"$f":"Inntekter[[#This Row],[FAKTISK]]+(10^-6)*ROW(Inntekter[[#This Row],[FAKTISK]])","v":{"v":3000.000006,"d":"3,000.00"}},{"$f":"Inntekter[[#This Row],[FAKTISK]]-Inntekter[[#This Row],[ESTIMERT]]","v":{"v":0,"d":"0.00"}}]
[null,"Salg av aktiva (profitt/tap)",{"v":300,"d":"300.00"},{"v":450,"d":"450.00"},{"$f":"Inntekter[[#This Row],[FAKTISK]]+(10^-6)*ROW(Inntekter[[#This Row],[FAKTISK]])","v":{"v":450.000007,"d":"450.00"}},{"$f":"Inntekter[[#This Row],[FAKTISK]]-Inntekter[[#This Row],[ESTIMERT]]","v":{"v":150,"d":"150.00"}}]
[null,"Totale inntekter",{"$f":"SUBTOTAL(109,Inntekter[ESTIMERT])","v":{"v":63300,"d":"63,300.00"}},{"$f":"SUBTOTAL(109,Inntekter[FAKTISK])","v":{"v":57450,"d":"57,450.00"}},null,{"$f":"SUBTOTAL(109,Inntekter[DIFFERANSE])","v":{"v":-5850,"d":"-5,850.00 "}}]

{"sheet":"Personalutgifter","index":2,"n_rows":8,"n_cols":6,"rows_kept":8,"merged":[[1,1,1,3]]}
[null,{"$f":"FIRMANAVN","v":"FIRMANAVN"}]
[null,{"$f":"BUDSJETT_Tittel","v":"MÅNEDLIG BUDSJETT"}]
[]
[null,"PERSONALUTGIFTER","ESTIMERT","FAKTISK","FEM STØRSTE BELØP","DIFFERANSE"]
[null,"Lønn",{"v":9500,"d":"9,500.00"},{"v":9600,"d":"9,600.00"},{"$f":"Personalutgifter[[#This Row],[FAKTISK]]+(10^-6)*ROW(Personalutgifter[[#This Row],[FAKTISK]])","v":{"v":9600.000005,"d":"9,600.00"}},{"$f":"Personalutgifter[[#This Row],[ESTIMERT]]-Personalutgifter[[#This Row],[FAKTISK]]","v":{"v":-100,"d":"-100.00 "}}]
[null,"Frynsegoder",{"v":4000,"d":"4,000.00"},{"v":0,"d":"0.00"},{"$f":"Personalutgifter[[#This Row],[FAKTISK]]+(10^-6)*ROW(Personalutgifter[[#This Row],[FAKTISK]])","v":{"v":6e-06,"d":"0.00"}},{"$f":"Personalutgifter[[#This Row],[ESTIMERT]]-Personalutgifter[[#This Row],[FAKTISK]]","v":{"v":4000,"d":"4,000.00"}}]
[null,"Provisjon",{"v":5000,"d":"5,000.00"},{"v":4500,"d":"4,500.00"},{"$f":"Personalutgifter[[#This Row],[FAKTISK]]+(10^-6)*ROW(Personalutgifter[[#This Row],[FAKTISK]])","v":{"v":4500.000007,"d":"4,500.00"}},{"$f":"Personalutgifter[[#This Row],[ESTIMERT]]-Personalutgifter[[#This Row],[FAKTISK]]","v":{"v":500,"d":"500.00"}}]
[null,"Totale personalutgifter",{"$f":"SUBTOTAL(109,Personalutgifter[ESTIMERT])","v":{"v":18500,"d":"18,500.00"}},{"$f":"SUBTOTAL(109,Personalutgifter[FAKTISK])","v":{"v":14100,"d":"14,100.00"}},null,{"$f":"SUBTOTAL(109,Personalutgifter[DIFFERANSE])","v":{"v":4400,"d":"4,400.00"}}]

{"sheet":"Driftsutgifter","index":3,"n_rows":25,"n_cols":6,"rows_kept":25,"merged":[[1,1,1,3]]}
[null,{"$f":"FIRMANAVN","v":"FIRMANAVN"}]
[null,{"$f":"BUDSJETT_Tittel","v":"MÅNEDLIG BUDSJETT"}]
[]
[null,"DRIFTSUTGIFTER","ESTIMERT","FAKTISK","FEM STØRSTE BELØP","DIFFERANSE"]
[null,"Annet",{"v":1000,"d":"1,000.00"},{"v":750,"d":"750.00"},{"$f":"Driftsutgifter[[#This Row],[FAKTISK]]+(10^-6)*ROW(Driftsutgifter[[#This Row],[FAKTISK]])","v":{"v":750.000005,"d":"750.00"}},{"$f":"Driftsutgifter[[#This Row],[ESTIMERT]]-Driftsutgifter[[#This Row],[FAKTISK]]","v":{"v":250,"d":"250.00"}}]
[null,"Annonsering",{"v":3000,"d":"3,000.00"},{"v":2500,"d":"2,500.00"},{"$f":"Driftsutgifter[[#This Row],[FAKTISK]]+(10^-6)*ROW(Driftsutgifter[[#This Row],[FAKTISK]])","v":{"v":2500.000006,"d":"2,500.00"}},{"$f":"Driftsutgifter[[#This Row],[ESTIMERT]]-Driftsutgifter[[#This Row],[FAKTISK]]","v":{"v":500,"d":"500.00"}}]
[null,"Avskrivning",{"v":1000,"d":"1,000.00"},{"v":1000,"d":"1,000.00"},{"$f":"Driftsutgifter[[#This Row],[FAKTISK]]+(10^-6)*ROW(Driftsutgifter[[#This Row],[FAKTISK]])","v":{"v":1000.000007,"d":"1,000.00"}},{"$f":"Driftsutgifter[[#This Row],[ESTIMERT]]-Driftsutgifter[[#This Row],[FAKTISK]]","v":{"v":0,"d":"0.00"}}]
[null,"Forsikring",{"v":1300,"d":"1,300.00"},{"v":1275,"d":"1,275.00"},{"$f":"Driftsutgifter[[#This Row],[FAKTISK]]+(10^-6)*ROW(Driftsutgifter[[#This Row],[FAKTISK]])","v":{"v":1275.000008,"d":"1,275.00"}},{"$f":"Driftsutgifter[[#This Row],[ESTIMERT]]-Driftsutgifter[[#This Row],[FAKTISK]]","v":{"v":25,"d":"25.00"}}]
[null,"Juridisk og revisjon",{"v":1000,"d":"1,000.00"},{"v":800,"d":"800.00"},{"$f":"Driftsutgifter[[#This Row],[FAKTISK]]+(10^-6)*ROW(Driftsutgifter[[#This Row],[FAKTISK]])","v":{"v":800.000009,"d":"800.00"}},{"$f":"Driftsutgifter[[#This Row],[ESTIMERT]]-Driftsutgifter[[#This Row],[FAKTISK]]","v":{"v":200,"d":"200.00"}}]
[null,"Kontorutstyr",{"v":800,"d":"800.00"},{"v":750,"d":"750.00"},{"$f":"Driftsutgifter[[#This Row],[FAKTISK]]+(10^-6)*ROW(Driftsutgifter[[#This Row],[FAKTISK]])","v":{"v":750.00001,"d":"750.00"}},{"$f":"Driftsutgifter[[#This Row],[ESTIMERT]]-Driftsutgifter[[#This Row],[FAKTISK]]","v":{"v":50,"d":"50.00"}}]
[null,"Leie- eller lånekostnader",{"v":4100,"d":"4,100.00"},{"v":4500,"d":"4,500.00"},{"$f":"Driftsutgifter[[#This Row],[FAKTISK]]+(10^-6)*ROW(Driftsutgifter[[#This Row],[FAKTISK]])","v":{"v":4500.000011,"d":"4,500.00"}},{"$f":"Driftsutgifter[[#This Row],[ESTIMERT]]-Driftsutgifter[[#This Row],[FAKTISK]]","v":{"v":-400,"d":"-400.00 "}}]
[null,"Levering og lagring",{"v":900,"d":"900.00"},{"v":840,"d":"840.00"},{"$f":"Driftsutgifter[[#This Row],[FAKTISK]]+(10^-6)*ROW(Driftsutgifter[[#This Row],[FAKTISK]])","v":{"v":840.000012,"d":"840.00"}},{"$f":"Driftsutgifter[[#This Row],[ESTIMERT]]-Driftsutgifter[[#This Row],[FAKTISK]]","v":{"v":60,"d":"60.00"}}]
[null,"Leveringskostnader",{"v":2000,"d":"2,000.00"},{"v":1500,"d":"1,500.00"},{"$f":"Driftsutgifter[[#This Row],[FAKTISK]]+(10^-6)*ROW(Driftsutgifter[[#This Row],[FAKTISK]])","v":{"v":1500.000013,"d":"1,500.00"}},{"$f":"Driftsutgifter[[#This Row],[ESTIMERT]]-Driftsutgifter[[#This Row],[FAKTISK]]","v":{"v":500,"d":"500.00"}}]
[null,"Medlemsavgifter og abonnementer",{"v":500,"d":"500.00"},{"v":525,"d":"525.00"},{"$f":"Driftsutgifter[[#This Row],[FAKTISK]]+(10^-6)*ROW(Driftsutgifter[[#This Row],[FAKTISK]])","v":{"v":525.000014,"d":"525.00"}},{"$f":"Driftsutgifter[[#This Row],[ESTIMERT]]-Driftsutgifter[[#This Row],[FAKTISK]]","v":{"v":-25,"d":"-25.00 "}}]
[null,"Misligholdt gjeld",{"v":2000,"d":"2,000.00"},{"v":2000,"d":"2,000.00"},{"$f":"Driftsutgifter[[#This Row],[FAKTISK]]+(10^-6)*ROW(Driftsutgifter[[#This Row],[FAKTISK]])","v":{"v":2000.000015,"d":"2,000.00"}},{"$f":"Driftsutgifter[[#This Row],[ESTIMERT]]-Driftsutgifter[[#This Row],[FAKTISK]]","v":{"v":0,"d":"0.00"}}]
[null,"Offentlige tjenester",{"v":1400,"d":"1,400.00"},{"v":1385,"d":"1,385.00"},{"$f":"Driftsutgifter[[#This Row],[FAKTISK]]+(10^-6)*ROW(Driftsutgifter[[#This Row],[FAKTISK]])","v":{"v":1385.000016,"d":"1,385.00"}},{"$f":"Driftsutgifter[[#This Row],[ESTIMERT]]-Driftsutgifter[[#This Row],[FAKTISK]]","v":{"v":15,"d":"15.00"}}]
[null,"Porto",{"v":400,"d":"400.00"},{"v":350,"d":"350.00"},{"$f":"Driftsutgifter[[#This Row],[FAKTISK]]+(10^-6)*ROW(Driftsutgifter[[#This Row],[FAKTISK]])","v":{"v":350.000017,"d":"350.00"}},{"$f":"Driftsutgifter[[#This Row],[ESTIMERT]]-Driftsutgifter[[#This Row],[FAKTISK]]","v":{"v":50,"d":"50.00"}}]
[null,"Rabatter ved kontantbetaling",{"v":1500,"d":"1,500.00"},{"v":2175,"d":"2,175.00"},{"$f":"Driftsutgifter[[#This Row],[FAKTISK]]+(10^-6)*ROW(Driftsutgifter[[#This Row],[FAKTISK]])","v":{"v":2175.000018,"d":"2,175.00"}},{"$f":"Driftsutgifter[[#This Row],[ESTIMERT]]-Driftsutgifter[[#This Row],[FAKTISK]]","v":{"v":-675,"d":"-675.00 "}}]
[null,"Rente",{"v":2000,"d":"2,000.00"},{"v":2200,"d":"2,200.00"},{"$f":"Driftsutgifter[[#This Row],[FAKTISK]]+(10^-6)*ROW(Driftsutgifter[[#This Row],[FAKTISK]])","v":{"v":2200.000019,"d":"2,200.00"}},{"$f":"Driftsutgifter[[#This Row],[ESTIMERT]]-Driftsutgifter[[#This Row],[FAKTISK]]","v":{"v":-200,"d":"-200.00 "}}]
[null,"Salgsutgifter",{"v":350,"d":"350.00"},{"v":400,"d":"400.00"},{"$f":"Driftsutgifter[[#This Row],[FAKTISK]]+(10^-6)*ROW(Driftsutgifter[[#This Row],[FAKTISK]])","v":{"v":400.00002,"d":"400.00"}},{"$f":"Driftsutgifter[[#This Row],[ESTIMERT]]-Driftsutgifter[[#This Row],[FAKTISK]]","v":{"v":-50,"d":"-50.00 "}}]
[null,"Skatter og avgifter",{"v":3000,"d":"3,000.00"},{"v":3200,"d":"3,200.00"},{"$f":"Driftsutgifter[[#This Row],[FAKTISK]]+(10^-6)*ROW(Driftsutgifter[[#This Row],[FAKTISK]])","v":{"v":3200.000021,"d":"3,200.00"}},{"$f":"Driftsutgifter[[#This Row],[ESTIMERT]]-Driftsutgifter[[#This Row],[FAKTISK]]","v":{"v":-200,"d":"-200.00 "}}]
[null,"Telefon",{"v":250,"d":"250.00"},{"v":280,"d":"280.00"},{"$f":"Driftsutgifter[[#This Row],[FAKTISK]]+(10^-6)*ROW(Driftsutgifter[[#This Row],[FAKTISK]])","v":{"v":280.000022,"d":"280.00"}},{"$f":"Driftsutgifter[[#This Row],[ESTIMERT]]-Driftsutgifter[[#This Row],[FAKTISK]]","v":{"v":-30,"d":"-30.00 "}}]
[null,"Utstyr",{"v":5000,"d":"5,000.00"},{"v":4500,"d":"4,500.00"},{"$f":"Driftsutgifter[[#This Row],[FAKTISK]]+(10^-6)*ROW(Driftsutgifter[[#This Row],[FAKTISK]])","v":{"v":4500.000023,"d":"4,500.00"}},{"$f":"Driftsutgifter[[#This Row],[ESTIMERT]]-Driftsutgifter[[#This Row],[FAKTISK]]","v":{"v":500,"d":"500.00"}}]
[null,"Vedlikehold og reparasjoner",{"v":4500,"d":"4,500.00"},{"v":4600,"d":"4,600.00"},{"$f":"Driftsutgifter[[#This Row],[FAKTISK]]+(10^-6)*ROW(Driftsutgifter[[#This Row],[FAKTISK]])","v":{"v":4600.000024,"d":"4,600.00"}},{"$f":"Driftsutgifter[[#This Row],[ESTIMERT]]-Driftsutgifter[[#This Row],[FAKTISK]]","v":{"v":-100,"d":"-100.00 "}}]
[null,"Totale driftskostnader",{"$f":"SUBTOTAL(109,Driftsutgifter[ESTIMERT])","v":{"v":36000,"d":"36,000.00"}},{"$f":"SUBTOTAL(109,Driftsutgifter[FAKTISK])","v":{"v":35530,"d":"35,530.00"}},null,{"$f":"SUBTOTAL(109,Driftsutgifter[DIFFERANSE])","v":{"v":470,"d":"470.00"}}]