{"text_format":"3","workbook":"xlsx","n_sheets":4,"sheets":["Penjejak Markah","Prestasi Anda","Seting","Pengiraan"],"not_rendered":{"defined_names":3,"comments":1},"read":"whole","date_system":"1900"}

{"sheet":"Penjejak Markah","index":0,"n_rows":14,"n_cols":6,"rows_kept":14}
[null,"Masukkan Markah Anda Di Sini"]
[]
[null,null,"Kelas","Jenis","Perihalan","Markah"]
[null,null,"Bahasa Perancis Moden","Kerja rumah","Sejarah Perang Dunia ll",{"v":0.8,"d":"80%"}]
[null,null,"Pemprograman Lanjutan dalam Java","Separuh Penggal",null,{"v":0.75,"d":"75%"}]
[null,null,"Bahasa Sepanyol","Kerja rumah",null,{"v":0.5,"d":"50%"}]
[null,null,"Ilmu Fizik Teori","Kerja rumah",null,{"v":0.95,"d":"95%"}]
[null,null,"Bahasa Perancis Moden","Kerja rumah","Sejarah Perang Dunia l",{"v":0.9,"d":"90%"}]
[null,null,"Bahasa Perancis Moden","Kerja rumah","Halaman 30 - 41",{"v":0.8,"d":"80%"}]
[null,null,"Mengarang","Esei","Kertas pujukan",{"v":0.95,"d":"95%"}]
[null,null,"Matematik 1","Kerja rumah","Halaman 21 & 26",{"v":0.8,"d":"80%"}]
[null,null,"Matematik 2","Kerja rumah","Halaman 15 & 18",{"v":0.85,"d":"85%"}]
[null,null,"Matematik 1","Kerja rumah","Halaman 34 - 36",{"v":0.8,"d":"80%"}]
[null,null,"Matematik 2","Kuiz",null,{"v":0.95,"d":"95%"}]

{"sheet":"Prestasi Anda","index":1,"n_rows":31,"n_cols":8,"rows_kept":31}
[null,"Prestasi Anda"]
[]
[null,null,"Jumlah"]
[null,null,{"$f":"\"Waktu: \"&SUM(tblClasses[Jam Kredit])","v":"Waktu: 24"},{"$f":"AVERAGE(D7:D31)","v":{"v":0.8104761904761906,"d":"81%"}},{"$f":"AVERAGE(E7:E31)","v":{"v":2.7142857142857144,"d":"2.71"}},{"$f":"SUM(F7:F31)","v":{"v":2.625,"d":"2.63"}},{"$f":"IFERROR(HLOOKUP(D4,lstGPAMapping,2),\"\")","v":"B-"}]
[]
[null,null,"Kelas","%","GPA","wGPA","Huruf","Prestasi Keseluruhan"]
[null,null,{"$f":"Pengiraan!C6","v":"Bahasa Perancis Moden"},{"$f":"Pengiraan!AL6","v":{"v":0.8333333333333334,"d":"83%"}},{"$f":"Pengiraan!AM6","v":{"v":3,"d":"3.00"}},{"$f":"IFERROR(E7*Seting!D9/SUM(tblClasses[Jam Kredit]),\"\")","v":{"v":0.375,"d":"0.38"}},{"$f":"Pengiraan!AN6","v":"B"}]
[null,null,{"$f":"Pengiraan!C7","v":"Ilmu Fizik Teori"},{"$f":"Pengiraan!AL7","v":{"v":0.95,"d":"95%"}},{"$f":"Pengiraan!AM7","v":{"v":4,"d":"4.00"}},{"$f":"IFERROR(E8*Seting!D10/SUM(tblClasses[Jam Kredit]),\"\")","v":{"v":0.5,"d":"0.50"}},{"$f":"Pengiraan!AN7","v":"A"}]
[null,null,{"$f":"Pengiraan!C8","v":"Matematik 1"},{"$f":"Pengiraan!AL8","v":{"v":0.8000000000000002,"d":"80%"}},{"$f":"Pengiraan!AM8","v":2.67},{"$f":"IFERROR(E9*Seting!D11/SUM(tblClasses[Jam Kredit]),\"\")","v":{"v":0.445,"d":"0.45"}},{"$f":"Pengiraan!AN8","v":"B-"}]
[null,null,{"$f":"Pengiraan!C9","v":"Matematik 2"},{"$f":"Pengiraan!AL9","v":{"v":0.89,"d":"89%"}},{"$f":"Pengiraan!AM9","v":3.33},{"$f":"IFERROR(E10*Seting!D12/SUM(tblClasses[Jam Kredit]),\"\")","v":{"v":0.555,"d":"0.56"}},{"$f":"Pengiraan!AN9","v":"B+"}]
[null,null,{"$f":"Pengiraan!C10","v":"Pemprograman Lanjutan dalam Java"},{"$f":"Pengiraan!AL10","v":{"v":0.7500000000000001,"d":"75%"}},{"$f":"Pengiraan!AM10","v":{"v":2,"d":"2.00"}},{"$f":"IFERROR(E11*Seting!D13/SUM(tblClasses[Jam Kredit]),\"\")","v":{"v":0.4166666666666667,"d":"0.42"}},{"$f":"Pengiraan!AN10","v":"C"}]
[null,null,{"$f":"Pengiraan!C11","v":"Bahasa Sepanyol"},{"$f":"Pengiraan!AL11","v":{"v":0.5,"d":"50%"}},{"$f":"Pengiraan!AM11","v":{"v":0,"d":"0.00"}},{"$f":"IFERROR(E12*Seting!D14/SUM(tblClasses[Jam Kredit]),\"\")","v":{"v":0,"d":"0.00"}},{"$f":"Pengiraan!AN11","v":"F"}]
[null,null,{"$f":"Pengiraan!C12","v":"Mengarang"},{"$f":"Pengiraan!AL12","v":{"v":0.95,"d":"95%"}},{"$f":"Pengiraan!AM12","v":{"v":4,"d":"4.00"}},{"$f":"IFERROR(E13*Seting!D15/SUM(tblClasses[Jam Kredit]),\"\")","v":{"v":0.3333333333333333,"d":"0.33"}},{"$f":"Pengiraan!AN12","v":"A"}]
[null,null,{"$f":"Pengiraan!C13","v":""},{"$f":"Pengiraan!AL13","v":""},{"$f":"Pengiraan!AM13","v":""},{"$f":"IFERROR(E14*Seting!D16/SUM(tblClasses[Jam Kredit]),\"\")","v":""},{"$f":"Pengiraan!AN13","v":""}]
[null,null,{"$f":"Pengiraan!C14","v":""},{"$f":"Pengiraan!AL14","v":""},{"$f":"Pengiraan!AM14","v":""},{"$f":"IFERROR(E15*Seting!D17/SUM(tblClasses[Jam Kredit]),\"\")","v":""},{"$f":"Pengiraan!AN14","v":""}]
{"$rows_left_out":17}
{"sheet":"Seting","index":2,"n_rows":15,"n_cols":16,"rows_kept":15,"merged":[[5,2,5,15]]}
[null,"Seting"]
[null,null,"Markah dan pemetaan GPA"]
[null,null,"Peratusan",{"v":0,"d":"0%"},{"v":0.6,"d":"60%"},{"v":0.63,"d":"63%"},{"v":0.67,"d":"67%"},{"v":0.7,"d":"70%"},{"v":0.73,"d":"73%"},{"v":0.77,"d":"77%"},{"v":0.8,"d":"80%"},{"v":0.83,"d":"83%"},{"v":0.87,"d":"87%"},{"v":0.9,"d":"90%"},{"v":0.93,"d":"93%"},{"v":0.97,"d":"97%"}]
[null,null,"Gred Huruf","F","D-","D","D+","C-","C","C+","B-","B","B+","A-","A","A+"]
[null,null,"GPA",0,0.67,1,1.33,1.67,2,2.33,2.67,3,3.33,3.67,4,4]
[]
[null,null,"Markah berwajaran sehingga kepada 25 kelas"]
[null,null,"Kelas yang anda hadiri","Jam Kredit","Kerja rumah","Esei","Kuiz","Projek","Separuh Penggal","Peperiksaan Akhir","Lain","% Jumlah"]
[null,null,"Bahasa Perancis Moden",{"v":3,"d":"3.0"},{"v":0.1,"d":"10%"},{"v":0.15,"d":"15%"},{"v":0.15,"d":"15%"},{"v":0.1,"d":"10%"},{"v":0.2,"d":"20%"},{"v":0.3,"d":"30%"},null,{"$f":"SUM(tblClasses[[#This Row],[Kerja rumah]:[Lain]])","v":{"v":1,"d":"100%"}}]
[null,null,"Ilmu Fizik Teori",{"v":3,"d":"3.0"},{"v":0.15,"d":"15%"},{"v":0.15,"d":"15%"},{"v":0.1,"d":"10%"},{"v":0.1,"d":"10%"},{"v":0.15,"d":"15%"},{"v":0.3,"d":"30%"},{"v":0.05,"d":"5%"},{"$f":"SUM(tblClasses[[#This Row],[Kerja rumah]:[Lain]])","v":{"v":1,"d":"100%"}}]
[null,null,"Matematik 1",{"v":4,"d":"4.0"},{"v":0.1,"d":"10%"},{"v":0.15,"d":"15%"},{"v":0.15,"d":"15%"},{"v":0.1,"d":"10%"},{"v":0.2,"d":"20%"},{"v":0.3,"d":"30%"},null,{"$f":"SUM(tblClasses[[#This Row],[Kerja rumah]:[Lain]])","v":{"v":1,"d":"100%"}}]
[null,null,"Matematik 2",{"v":4,"d":"4.0"},{"v":0.15,"d":"15%"},{"v":0.15,"d":"15%"},{"v":0.1,"d":"10%"},{"v":0.1,"d":"10%"},{"v":0.15,"d":"15%"},{"v":0.3,"d":"30%"},{"v":0.05,"d":"5%"},{"$f":"SUM(tblClasses[[#This Row],[Kerja rumah]:[Lain]])","v":{"v":1,"d":"100%"}}]
[null,null,"Pemprograman Lanjutan dalam Java",{"v":5,"d":"5.0"},{"v":0.15,"d":"15%"},{"v":0.15,"d":"15%"},{"v":0.1,"d":"10%"},{"v":0.1,"d":"10%"},{"v":0.2,"d":"20%"},{"v":0.3,"d":"30%"},null,{"$f":"SUM(tblClasses[[#This Row],[Kerja rumah]:[Lain]])","v":{"v":1,"d":"100%"}}]
[null,null,"Bahasa Sepanyol",{"v":3,"d":"3.0"},{"v":0.1,"d":"10%"},{"v":0.15,"d":"15%"},{"v":0.17,"d":"17%"},{"v":0.13,"d":"13%"},{"v":0.2,"d":"20%"},{"v":0.2,"d":"20%"},{"v":0.05,"d":"5%"},{"$f":"SUM(tblClasses[[#This Row],[Kerja rumah]:[Lain]])","v":{"v":1,"d":"100%"}}]
[null,null,"Mengarang",{"v":2,"d":"2.0"},{"v":0.15,"d":"15%"},{"v":0.15,"d":"15%"},{"v":0.12,"d":"12%"},{"v":0.15,"d":"15%"},{"v":0.15,"d":"15%"},{"v":0.25,"d":"25%"},{"v":0.03,"d":"3%"},{"$f":"SUM(tblClasses[[#This Row],[Kerja rumah]:[Lain]])","v":{"v":1,"d":"100%"}}]
{"$rows_left_out":1}
{"sheet":"Pengiraan","index":3,"n_rows":657,"n_cols":40,"rows_kept":657,"hidden":true}
[null,"Pengiraan"]
[null,null,"Lembaran kerja ini menyediakan pengiraan untuk gred & GPA anda dan sepatutnya kekal tersembunyi. Sebarang perubahan terhadap helaian ini akan menyebabkan ralat."]
[]
[null,null,"Senarai Kelas Semasa","Markah (daripada 1)",{"$nulls":24},"Pengiraan Gred"]
[null,null,"Kelas",1,2,3,4,5,6,7,8,9,10,11,12,13,14,15,16,17,18,19,20,21,22,23,24,25,{"$f":"tblClasses[[#Headers],[Kerja rumah]]","v":"Kerja rumah"},{"$f":"tblClasses[[#Headers],[Esei]]","v":"Esei"},{"$f":"tblClasses[[#Headers],[Kuiz]]","v":"Kuiz"},{"$f":"tblClasses[[#Headers],[Projek]]","v":"Projek"},{"$f":"tblClasses[[#Headers],[Separuh Penggal]]","v":"Separuh Penggal"},{"$f":"tblClasses[[#Headers],[Peperiksaan Akhir]]","v":"Peperiksaan Akhir"},{"$f":"tblClasses[[#Headers],[Lain]]","v":"Lain"},"Jumlah","Jumlah Markah Mungkin","Jumlah %","Markah Gred","Gred Huruf"]
[null,null,{"$f":"IF(Seting!C9=\"\",\"\",Seting!C9)","v":"Bahasa Perancis Moden"},{"$f":"IFERROR(INDEX(tblClassScores[],MATCH($C6:$C30&D$5:AB$5,Pengiraan!$C$33:$C$657,0),4),\"\")","v":{"v":0.8,"d":"80%"}},{"v":0.9,"d":"90%"},{"v":0.8,"d":"80%"},"","","","","","","","","","","","","","","","","","","","","","",{"$f":"IFERROR(AVERAGEIFS(tblClassScores[Markah],tblClassScores[Kelas],Pengiraan!$C6,tblClassScores[Jenis],Pengiraan!AC$5)*Seting!E9,\"\")","v":0.08333333333333334},{"$f":"IFERROR(AVERAGEIFS(tblClassScores[Markah],tblClassScores[Kelas],Pengiraan!$C6,tblClassScores[Jenis],Pengiraan!AD$5)*Seting!F9,\"\")","v":""},{"$f":"IFERROR(AVERAGEIFS(tblClassScores[Markah],tblClassScores[Kelas],Pengiraan!$C6,tblClassScores[Jenis],Pengiraan!AE$5)*Seting!G9,\"\")","v":""},{"$f":"IFERROR(AVERAGEIFS(tblClassScores[Markah],tblClassScores[Kelas],Pengiraan!$C6,tblClassScores[Jenis],Pengiraan!AF$5)*Seting!H9,\"\")","v":""},{"$f":"IFERROR(AVERAGEIFS(tblClassScores[Markah],tblClassScores[Kelas],Pengiraan!$C6,tblClassScores[Jenis],Pengiraan!AG$5)*Seting!I9,\"\")","v":""},{"$f":"IFERROR(AVERAGEIFS(tblClassScores[Markah],tblClassScores[Kelas],Pengiraan!$C6,tblClassScores[Jenis],Pengiraan!AH$5)*Seting!J9,\"\")","v":""},{"$f":"IFERROR(AVERAGEIFS(tblClassScores[Markah],tblClassScores[Kelas],Pengiraan!$C6,tblClassScores[Jenis],Pengiraan!AI$5)*Seting!K9,\"\")","v":""},{"$f":"SUM(AC6:AI6)","v":0.08333333333333334},{"$f":"SUMIFS(Seting!E9:K9,Pengiraan!AC6:AI6,\">0\")","v":0.1},{"$f":"IFERROR(AJ6/AK6,\"\")","v":{"v":0.8333333333333334,"d":"83%"}},{"$f":"IFERROR(HLOOKUP(AL6,lstGPAMapping,3),\"\")","v":3},{"$f":"IFERROR(HLOOKUP(AL6,lstGPAMapping,2),\"\")","v":"B"}]
[null,null,{"$f":"IF(Seting!C10=\"\",\"\",Seting!C10)","v":"Ilmu Fizik Teori"},{"v":0.95,"d":"95%"},"","","","","","","","","","","","","","","","","","","","","","","","",{"$f":"IFERROR(AVERAGEIFS(tblClassScores[Markah],tblClassScores[Kelas],Pengiraan!$C7,tblClassScores[Jenis],Pengiraan!AC$5)*Seting!E10,\"\")","v":0.1425},{"$f":"IFERROR(AVERAGEIFS(tblClassScores[Markah],tblClassScores[Kelas],Pengiraan!$C7,tblClassScores[Jenis],Pengiraan!AD$5)*Seting!F10,\"\")","v":""},{"$f":"IFERROR(AVERAGEIFS(tblClassScores[Markah],tblClassScores[Kelas],Pengiraan!$C7,tblClassScores[Jenis],Pengiraan!AE$5)*Seting!G10,\"\")","v":""},{"$f":"IFERROR(AVERAGEIFS(tblClassScores[Markah],tblClassScores[Kelas],Pengiraan!$C7,tblClassScores[Jenis],Pengiraan!AF$5)*Seting!H10,\"\")","v":""},{"$f":"IFERROR(AVERAGEIFS(tblClassScores[Markah],tblClassScores[Kelas],Pengiraan!$C7,tblClassScores[Jenis],Pengiraan!AG$5)*Seting!I10,\"\")","v":""},{"$f":"IFERROR(AVERAGEIFS(tblClassScores[Markah],tblClassScores[Kelas],Pengiraan!$C7,tblClassScores[Jenis],Pengiraan!AH$5)*Seting!J10,\"\")","v":""},{"$f":"IFERROR(AVERAGEIFS(tblClassScores[Markah],tblClassScores[Kelas],Pengiraan!$C7,tblClassScores[Jenis],Pengiraan!AI$5)*Seting!K10,\"\")","v":""},{"$f":"SUM(AC7:AI7)","v":0.1425},{"$f":"SUMIFS(Seting!E10:K10,Pengiraan!AC7:AI7,\">0\")","v":0.15},{"$f":"IFERROR(AJ7/AK7,\"\")","v":{"v":0.95,"d":"95%"}},4,"A"]
[null,null,{"$f":"IF(Seting!C11=\"\",\"\",Seting!C11)","v":"Matematik 1"},{"v":0.8,"d":"80%"},{"v":0.8,"d":"80%"},"","","","","","","","","","","","","","","","","","","","","","","",{"$f":"IFERROR(AVERAGEIFS(tblClassScores[Markah],tblClassScores[Kelas],Pengiraan!$C8,tblClassScores[Jenis],Pengiraan!AC$5)*Seting!E11,\"\")","v":0.08000000000000002},{"$f":"IFERROR(AVERAGEIFS(tblClassScores[Markah],tblClassScores[Kelas],Pengiraan!$C8,tblClassScores[Jenis],Pengiraan!AD$5)*Seting!F11,\"\")","v":""},{"$f":"IFERROR(AVERAGEIFS(tblClassScores[Markah],tblClassScores[Kelas],Pengiraan!$C8,tblClassScores[Jenis],Pengiraan!AE$5)*Seting!G11,\"\")","v":""},{"$f":"IFERROR(AVERAGEIFS(tblClassScores[Markah],tblClassScores[Kelas],Pengiraan!$C8,tblClassScores[Jenis],Pengiraan!AF$5)*Seting!H11,\"\")","v":""},{"$f":"IFERROR(AVERAGEIFS(tblClassScores[Markah],tblClassScores[Kelas],Pengiraan!$C8,tblClassScores[Jenis],Pengiraan!AG$5)*Seting!I11,\"\")","v":""},{"$f":"IFERROR(AVERAGEIFS(tblClassScores[Markah],tblClassScores[Kelas],Pengiraan!$C8,tblClassScores[Jenis],Pengiraan!AH$5)*Seting!J11,\"\")","v":""},{"$f":"IFERROR(AVERAGEIFS(tblClassScores[Markah],tblClassScores[Kelas],Pengiraan!$C8,tblClassScores[Jenis],Pengiraan!AI$5)*Seting!K11,\"\")","v":""},0.08000000000000002,{"$f":"SUMIFS(Seting!E11:K11,Pengiraan!AC8:AI8,\">0\")","v":0.1},{"v":0.8000000000000002,"d":"80%"},2.67,"B-"]
[null,null,{"$f":"IF(Seting!C12=\"\",\"\",Seting!C12)","v":"Matematik 2"},{"v":0.85,"d":"85%"},{"v":0.95,"d":"95%"},"","","","","","","","","","","","","","","","","","","","","","","",{"$f":"IFERROR(AVERAGEIFS(tblClassScores[Markah],tblClassScores[Kelas],Pengiraan!$C9,tblClassScores[Jenis],Pengiraan!AC$5)*Seting!E12,\"\")","v":0.1275},{"$f":"IFERROR(AVERAGEIFS(tblClassScores[Markah],tblClassScores[Kelas],Pengiraan!$C9,tblClassScores[Jenis],Pengiraan!AD$5)*Seting!F12,\"\")","v":""},{"$f":"IFERROR(AVERAGEIFS(tblClassScores[Markah],tblClassScores[Kelas],Pengiraan!$C9,tblClassScores[Jenis],Pengiraan!AE$5)*Seting!G12,\"\")","v":0.095},{"$f":"IFERROR(AVERAGEIFS(tblClassScores[Markah],tblClassScores[Kelas],Pengiraan!$C9,tblClassScores[Jenis],Pengiraan!AF$5)*Seting!H12,\"\")","v":""},{"$f":"IFERROR(AVERAGEIFS(tblClassScores[Markah],tblClassScores[Kelas],Pengiraan!$C9,tblClassScores[Jenis],Pengiraan!AG$5)*Seting!I12,\"\")","v":""},{"$f":"IFERROR(AVERAGEIFS(tblClassScores[Markah],tblClassScores[Kelas],Pengiraan!$C9,tblClassScores[Jenis],Pengiraan!AH$5)*Seting!J12,\"\")","v":""},{"$f":"IFERROR(AVERAGEIFS(tblClassScores[Markah],tblClassScores[Kelas],Pengiraan!$C9,tblClassScores[Jenis],Pengiraan!AI$5)*Seting!K12,\"\")","v":""},0.2225,{"$f":"SUMIFS(Seting!E12:K12,Pengiraan!AC9:AI9,\">0\")","v":0.25},{"v":0.89,"d":"89%"},3.33,"B+"]
[null,null,{"$f":"IF(Seting!C13=\"\",\"\",Seting!C13)","v":"Pemprograman Lanjutan dalam Java"},{"v":0.75,"d":"75%"},"","","","","","","","","","","","","","","","","","","","","","","","",{"$f":"IFERROR(AVERAGEIFS(tblClassScores[Markah],tblClassScores[Kelas],Pengiraan!$C10,tblClassScores[Jenis],Pengiraan!AC$5)*Seting!E13,\"\")","v":""},{"$f":"IFERROR(AVERAGEIFS(tblClassScores[Markah],tblClassScores[Kelas],Pengiraan!$C10,tblClassScores[Jenis],Pengiraan!AD$5)*Seting!F13,\"\")","v":""},{"$f":"IFERROR(AVERAGEIFS(tblClassScores[Markah],tblClassScores[Kelas],Pengiraan!$C10,tblClassScores[Jenis],Pengiraan!AE$5)*Seting!G13,\"\")","v":""},{"$f":"IFERROR(AVERAGEIFS(tblClassScores[Markah],tblClassScores[Kelas],Pengiraan!$C10,tblClassScores[Jenis],Pengiraan!AF$5)*Seting!H13,\"\")","v":""},{"$f":"IFERROR(AVERAGEIFS(tblClassScores[Markah],tblClassScores[Kelas],Pengiraan!$C10,tblClassScores[Jenis],Pengiraan!AG$5)*Seting!I13,\"\")","v":0.15000000000000002},{"$f":"IFERROR(AVERAGEIFS(tblClassScores[Markah],tblClassScores[Kelas],Pengiraan!$C10,tblClassScores[Jenis],Pengiraan!AH$5)*Seting!J13,\"\")","v":""},{"$f":"IFERROR(AVERAGEIFS(tblClassScores[Markah],tblClassScores[Kelas],Pengiraan!$C10,tblClassScores[Jenis],Pengiraan!AI$5)*Seting!K13,\"\")","v":""},0.15000000000000002,{"$f":"SUMIFS(Seting!E13:K13,Pengiraan!AC10:AI10,\">0\")","v":0.2},{"v":0.7500000000000001,"d":"75%"},2,"C"]
[null,null,{"$f":"IF(Seting!C14=\"\",\"\",Seting!C14)","v":"Bahasa Sepanyol"},{"v":0.5,"d":"50%"},"","","","","","","","","","","","","","","","","","","","","","","","",{"$f":"IFERROR(AVERAGEIFS(tblClassScores[Markah],tblClassScores[Kelas],Pengiraan!$C11,tblClassScores[Jenis],Pengiraan!AC$5)*Seting!E14,\"\")","v":0.05},{"$f":"IFERROR(AVERAGEIFS(tblClassScores[Markah],tblClassScores[Kelas],Pengiraan!$C11,tblClassScores[Jenis],Pengiraan!AD$5)*Seting!F14,\"\")","v":""},{"$f":"IFERROR(AVERAGEIFS(tblClassScores[Markah],tblClassScores[Kelas],Pengiraan!$C11,tblClassScores[Jenis],Pengiraan!AE$5)*Seting!G14,\"\")","v":""},{"$f":"IFERROR(AVERAGEIFS(tblClassScores[Markah],tblClassScores[Kelas],Pengiraan!$C11,tblClassScores[Jenis],Pengiraan!AF$5)*Seting!H14,\"\")","v":""},{"$f":"IFERROR(AVERAGEIFS(tblClassScores[Markah],tblClassScores[Kelas],Pengiraan!$C11,tblClassScores[Jenis],Pengiraan!AG$5)*Seting!I14,\"\")","v":""},{"$f":"IFERROR(AVERAGEIFS(tblClassScores[Markah],tblClassScores[Kelas],Pengiraan!$C11,tblClassScores[Jenis],Pengiraan!AH$5)*Seting!J14,\"\")","v":""},{"$f":"IFERROR(AVERAGEIFS(tblClassScores[Markah],tblClassScores[Kelas],Pengiraan!$C11,tblClassScores[Jenis],Pengiraan!AI$5)*Seting!K14,\"\")","v":""},0.05,{"$f":"SUMIFS(Seting!E14:K14,Pengiraan!AC11:AI11,\">0\")","v":0.1},{"v":0.5,"d":"50%"},0,"F"]
[null,null,{"$f":"IF(Seting!C15=\"\",\"\",Seting!C15)","v":"Mengarang"},{"v":0.95,"d":"95%"},"","","","","","","","","","","","","","","","","","","","","","","","",{"$f":"IFERROR(AVERAGEIFS(tblClassScores[Markah],tblClassScores[Kelas],Pengiraan!$C12,tblClassScores[Jenis],Pengiraan!AC$5)*Seting!E15,\"\")","v":""},{"$f":"IFERROR(AVERAGEIFS(tblClassScores[Markah],tblClassScores[Kelas],Pengiraan!$C12,tblClassScores[Jenis],Pengiraan!AD$5)*Seting!F15,\"\")","v":0.1425},{"$f":"IFERROR(AVERAGEIFS(tblClassScores[Markah],tblClassScores[Kelas],Pengiraan!$C12,tblClassScores[Jenis],Pengiraan!AE$5)*Seting!G15,\"\")","v":""},{"$f":"IFERROR(AVERAGEIFS(tblClassScores[Markah],tblClassScores[Kelas],Pengiraan!$C12,tblClassScores[Jenis],Pengiraan!AF$5)*Seting!H15,\"\")","v":""},{"$f":"IFERROR(AVERAGEIFS(tblClassScores[Markah],tblClassScores[Kelas],Pengiraan!$C12,tblClassScores[Jenis],Pengiraan!AG$5)*Seting!I15,\"\")","v":""},{"$f":"IFERROR(AVERAGEIFS(tblClassScores[Markah],tblClassScores[Kelas],Pengiraan!$C12,tblClassScores[Jenis],Pengiraan!AH$5)*Seting!J15,\"\")","v":""},{"$f":"IFERROR(AVERAGEIFS(tblClassScores[Markah],tblClassScores[Kelas],Pengiraan!$C12,tblClassScores[Jenis],Pengiraan!AI$5)*Seting!K15,\"\")","v":""},0.1425,{"$f":"SUMIFS(Seting!E15:K15,Pengiraan!AC12:AI12,\">0\")","v":0.15},{"v":0.95,"d":"95%"},4,"A"]
[null,null,{"$f":"IF(Seting!C16=\"\",\"\",Seting!C16)","v":""},"","","","","","","","","","","","","","","","","","","","","","","","","",{"$f":"IFERROR(AVERAGEIFS(tblClassScores[Markah],tblClassScores[Kelas],Pengiraan!$C13,tblClassScores[Jenis],Pengiraan!AC$5)*Seting!#REF!,\"\")","v":""},{"$f":"IFERROR(AVERAGEIFS(tblClassScores[Markah],tblClassScores[Kelas],Pengiraan!$C13,tblClassScores[Jenis],Pengiraan!AD$5)*Seting!#REF!,\"\")","v":""},{"$f":"IFERROR(AVERAGEIFS(tblClassScores[Markah],tblClassScores[Kelas],Pengiraan!$C13,tblClassScores[Jenis],Pengiraan!AE$5)*Seting!#REF!,\"\")","v":""},{"$f":"IFERROR(AVERAGEIFS(tblClassScores[Markah],tblClassScores[Kelas],Pengiraan!$C13,tblClassScores[Jenis],Pengiraan!AF$5)*Seting!#REF!,\"\")","v":""},{"$f":"IFERROR(AVERAGEIFS(tblClassScores[Markah],tblClassScores[Kelas],Pengiraan!$C13,tblClassScores[Jenis],Pengiraan!AG$5)*Seting!#REF!,\"\")","v":""},{"$f":"IFERROR(AVERAGEIFS(tblClassScores[Markah],tblClassScores[Kelas],Pengiraan!$C13,tblClassScores[Jenis],Pengiraan!AH$5)*Seting!#REF!,\"\")","v":""},{"$f":"IFERROR(AVERAGEIFS(tblClassScores[Markah],tblClassScores[Kelas],Pengiraan!$C13,tblClassScores[Jenis],Pengiraan!AI$5)*Seting!#REF!,\"\")","v":""},0,{"$f":"SUMIFS(Seting!E16:K16,Pengiraan!AC13:AI13,\">0\")","v":0},"","",""]
[null,null,{"$f":"IF(Seting!C17=\"\",\"\",Seting!C17)","v":""},"","","","","","","","","","","","","","","","","","","","","","","","","",{"$f":"IFERROR(AVERAGEIFS(tblClassScores[Markah],tblClassScores[Kelas],Pengiraan!$C14,tblClassScores[Jenis],Pengiraan!AC$5)*Seting!#REF!,\"\")","v":""},{"$f":"IFERROR(AVERAGEIFS(tblClassScores[Markah],tblClassScores[Kelas],Pengiraan!$C14,tblClassScores[Jenis],Pengiraan!AD$5)*Seting!#REF!,\"\")","v":""},{"$f":"IFERROR(AVERAGEIFS(tblClassScores[Markah],tblClassScores[Kelas],Pengiraan!$C14,tblClassScores[Jenis],Pengiraan!AE$5)*Seting!#REF!,\"\")","v":""},{"$f":"IFERROR(AVERAGEIFS(tblClassScores[Markah],tblClassScores[Kelas],Pengiraan!$C14,tblClassScores[Jenis],Pengiraan!AF$5)*Seting!#REF!,\"\")","v":""},{"$f":"IFERROR(AVERAGEIFS(tblClassScores[Markah],tblClassScores[Kelas],Pengiraan!$C14,tblClassScores[Jenis],Pengiraan!AG$5)*Seting!#REF!,\"\")","v":""},{"$f":"IFERROR(AVERAGEIFS(tblClassScores[Markah],tblClassScores[Kelas],Pengiraan!$C14,tblClassScores[Jenis],Pengiraan!AH$5)*Seting!#REF!,\"\")","v":""},{"$f":"IFERROR(AVERAGEIFS(tblClassScores[Markah],tblClassScores[Kelas],Pengiraan!$C14,tblClassScores[Jenis],Pengiraan!AI$5)*Seting!#REF!,\"\")","v":""},0,{"$f":"SUMIFS(Seting!E17:K17,Pengiraan!AC14:AI14,\">0\")","v":0},"","",""]
[null,null,{"$f":"IF(Seting!C18=\"\",\"\",Seting!C18)","v":""},"","","","","","","","","","","","","","","","","","","","","","","","","",{"$f":"IFERROR(AVERAGEIFS(tblClassScores[Markah],tblClassScores[Kelas],Pengiraan!$C15,tblClassScores[Jenis],Pengiraan!AC$5)*Seting!#REF!,\"\")","v":""},{"$f":"IFERROR(AVERAGEIFS(tblClassScores[Markah],tblClassScores[Kelas],Pengiraan!$C15,tblClassScores[Jenis],Pengiraan!AD$5)*Seting!#REF!,\"\")","v":""},{"$f":"IFERROR(AVERAGEIFS(tblClassScores[Markah],tblClassScores[Kelas],Pengiraan!$C15,tblClassScores[Jenis],Pengiraan!AE$5)*Seting!#REF!,\"\")","v":""},{"$f":"IFERROR(AVERAGEIFS(tblClassScores[Markah],tblClassScores[Kelas],Pengiraan!$C15,tblClassScores[Jenis],Pengiraan!AF$5)*Seting!#REF!,\"\")","v":""},{"$f":"IFERROR(AVERAGEIFS(tblClassScores[Markah],tblClassScores[Kelas],Pengiraan!$C15,tblClassScores[Jenis],Pengiraan!AG$5)*Seting!#REF!,\"\")","v":""},{"$f":"IFERROR(AVERAGEIFS(tblClassScores[Markah],tblClassScores[Kelas],Pengiraan!$C15,tblClassScores[Jenis],Pengiraan!AH$5)*Seting!#REF!,\"\")","v":""},{"$f":"IFERROR(AVERAGEIFS(tblClassScores[Markah],tblClassScores[Kelas],Pengiraan!$C15,tblClassScores[Jenis],Pengiraan!AI$5)*Seting!#REF!,\"\")","v":""},0,{"$f":"SUMIFS(Seting!E18:K18,Pengiraan!AC15:AI15,\">0\")","v":0},"","",""]
{"$rows_left_out":642}