{"text_format":"3","workbook":"xlsx","n_sheets":6,"sheets":["Rumah","Butiran Peribadi","Butiran Pelancongan","Hotel dan Aktiviti","Sewa Kereta","Butiran Kecemasan"],"not_rendered":{"images":19,"defined_names":10},"read":"whole","date_system":"1900"}

{"sheet":"Rumah","index":0,"n_rows":34,"n_cols":22,"rows_kept":34,"merged":[[32,1,32,3],[32,6,32,8],[32,11,32,13],[32,16,32,18],[32,21,32,23],[33,1,33,3],[33,6,33,8],[33,11,33,13],[33,16,33,18],[33,21,33,23]]}
{"$rows_empty":32}
[null,{"$f":"PersonalEntry/PersonalCount","v":{"v":1,"d":"100%"}},{"$nulls":4},{"$f":"TravelEntry/TravelCount","v":{"v":0.65,"d":"65%"}},{"$nulls":4},{"$f":"HotelEntry/HotelCount","v":{"v":0.5384615384615384,"d":"54%"}},{"$nulls":4},{"$f":"IF('Sewa Kereta'!D4=\"Ya\",CarRentalEntry/CarRentalCount,1)","v":{"v":0.2857142857142857,"d":"29%"}},{"$nulls":4},{"$f":"EmergencyEntry/EmergencyCount","v":{"v":0.625,"d":"63%"}}]
[null,{"$f":"TEXT(B33,\"0% \"\"selesai\"\"\")","v":"100% selesai"},{"$nulls":4},{"$f":"TEXT(G33,\"0% \"\"selesai\"\"\")","v":"65% selesai"},{"$nulls":4},{"$f":"TEXT(L33,\"0% \"\"selesai\"\"\")","v":"54% selesai"},{"$nulls":4},{"$f":"TEXT(Q33,\"0% \"\"selesai\"\"\")","v":"29% selesai"},{"$nulls":4},{"$f":"TEXT(V33,\"0% \"\"selesai\"\"\")","v":"63% selesai"}]

{"sheet":"Butiran Peribadi","index":1,"n_rows":11,"n_cols":5,"rows_kept":11,"merged":[[4,2,5,2],[4,3,5,3],[4,4,5,4],[7,2,8,2],[7,3,8,3],[7,4,8,4],[17,1,17,4]]}
[]
[]
[{"$f":"IF(COUNTA(B4:B8)<1,\"*\",\"\")","v":""},"Nama Penuh & Nama Timangan",{"$f":"IF(E3=\"\",1,\"\")","v":""},"Alamat Rumah","987 North Fifth Street Columbus, TN 01234"]
[null,"Michael Alexander"]
[null,"Michelle Alexander",{"$f":"IF(E5=\"\",1,\"\")","v":""},"Telefon Rumah",3455550123]
[null,"Sean P. Alexander"]
[]
[null,null,{"$f":"IF((E8=0)+(E8=\"\"),1,\"\")","v":""},"Telefon Bimbit",3455550124]
[]
[]
[{"$f":"PersonalEntry","v":3},{"$f":"IF(A11<>PersonalCount,\"Kehilangan butiran penting\",\"Butiran penting selesai\")","v":"Butiran penting selesai"}]

{"sheet":"Butiran Pelancongan","index":2,"n_rows":18,"n_cols":6,"rows_kept":18,"merged":[[23,1,23,5]]}
[]
[]
[null,"Butiran Pelepasan",null,null,"Butiran Kenbali"]
[{"$f":"IF(C4=\"\",1,\"\")","v":""},"Tarikh",{"$f":"TODAY()+45","v":"2013-03-03"},{"$f":"IF(F4=\"\",1,\"\")","v":""},"Tarikh",{"$f":"TODAY()+51","v":"2013-03-09"}]
[{"$f":"IF(C5=\"\",1,\"\")","v":""},"Syarikat Penerbangan","Blue Yonder Airlines","","Syarikat Penerbangan","Blue Yonder Airlines"]
[{"$f":"IF(C6=\"\",1,\"\")","v":""},"Nombor Pesawat","WS192",1,"Nombor Pesawat"]
[{"$f":"IF(C7=\"\",1,\"\")","v":""},"Daripada","Columbus","","Daripada","Seattle"]
[{"$f":"IF(C8=\"\",1,\"\")","v":""},"Masa Berlepas","12:30:00",1,"Masa Berlepas"]
[null,"Terminal/Pintu Pelepasan",null,1,"Terminal/Pintu Pelepasan"]
[{"$f":"IF(C10=\"\",1,\"\")","v":""},"Kepada","Seattle",1,"Kepada"]
[{"$f":"IF(C11=\"\",1,\"\")","v":""},"Masa Tiba","12:32:00",1,"Masa Tiba"]
[null,"Tempoh Penerbangan","6 jam",null,"Tempoh Penerbangan"]
[{"$f":"IF(C13=\"\",1,\"\")","v":""},"Nombor Tempat Duduk","A1, A2,A3",{"$f":"IF(F13=\"\",1,\"\")","v":1},"Nombor Tempat Duduk"]
[{"$f":"IF(C14=\"\",1,\"\")","v":""},"Nombor Pengesahan","Sama",{"$f":"IF(F14=\"\",1,\"\")","v":1},"Nombor Pengesahan"]
[{"$f":"IF(C15=\"\",1,\"\")","v":""},"Makanan","Tiada pengehadan",null,"Makanan"]
[null,"Nombor Telefon Syarikat Penerbangan",1235550234,null,"Nombor Telefon Syarikat Penerbangan",1235550234]
[]
[{"$f":"TravelEntry","v":13},{"$f":"IF(A18<>TravelCount,\"Kehilangan butiran penting\",\"Butiran penting selesai\")","v":"Kehilangan butiran penting"}]

{"sheet":"Hotel dan Aktiviti","index":3,"n_rows":15,"n_cols":7,"rows_kept":15,"merged":[[21,1,21,6]]}
[]
[]
[null,"Butiran Penginapan",{"$nulls":3},"Butiran Aktiviti Percutian"]
[{"$f":"IF(C4=\"\",1,\"\")","v":""},"Tarikh Penempahan",{"$f":"TODAY()+45","v":"2013-03-03"},null,null,"Aktiviti 1","Berski"]
["","Nama Hotel","Alpine Ski House",null,{"$f":"IF(AND($G$4<>\"\",G5=\"\"),1,\"\")","v":1},"Tarikh/Masa"]
["","Alamat Hotel","789 Main Street",null,{"$f":"IF(AND($G$4<>\"\",G6=\"\"),1,\"\")","v":1},"Tarikh Penempahan"]
["","Nombor Telefon Hotel","Seattle",null,{"$f":"IF(AND($G$4<>\"\",G7=\"\"),1,\"\")","v":1},"Nombor Pengesahan"]
["","Hari/Masa Lapor Masuk",{"$f":"TODAY()+45.5","v":"2013-03-03T12:00:00"},null,null,"Aktiviti 2","Coho Vineyard & Winery"]
["","Hari/Masa Lapor Keluar",{"$f":"TODAY()+50.5","v":"2013-03-08T12:00:00"},null,{"$f":"IF(AND($G$8<>\"\",G9=\"\"),1,\"\")","v":1},"Tarikh/Masa"]
["","Nombor Pengesahan","CJ1234567",null,{"$f":"IF(AND($G$8<>\"\",G10=\"\"),1,\"\")","v":1},"Tarikh Penempahan"]
[{"$nulls":4},{"$f":"IF(AND($G$8<>\"\",G11=\"\"),1,\"\")","v":1},"Nombor Pengesahan"]
[{"$f":"HotelEntry","v":7},{"$f":"IF(A12<>HotelCount,\"Kehilangan butiran penting\",\"Butiran penting selesai\")","v":"Kehilangan butiran penting"},{"$nulls":3},"Aktiviti 3"]
[{"$nulls":4},{"$f":"IF(AND($G$12<>\"\",G13=\"\"),1,\"\")","v":""},"Tarikh/Masa"]
[{"$nulls":4},{"$f":"IF(AND($G$12<>\"\",G14=\"\"),1,\"\")","v":""},"Tarikh Penempahan"]
[{"$nulls":4},{"$f":"IF(AND($G$12<>\"\",G15=\"\"),1,\"\")","v":""},"Nombor Pengesahan"]

{"sheet":"Sewa Kereta","index":4,"n_rows":13,"n_cols":4,"rows_kept":13,"merged":[[18,0,18,4]]}
[]
[]
[null,null,"Maklumat Sewa Kereta"]
[null,null,"Menyewa kereta?","Ya"]
[null,{"$f":"IF(AND($D$4=\"Yes\",D5=\"\"),1,\"\")","v":""},"Tarikh Penempahan",{"$f":"TODAY()+45","v":"2013-03-03"}]
[null,"","Syarikat Sewa"]
[null,"","Hari/Masa Ambil"]
[null,"","Hari/Masa Pulang"]
[null,"","Nombor Pengesahan"]
[null,"","Jenis kenderaan","Ekonomi"]
[null,"","Nombor telefon"]
[]
[null,{"$f":"CarRentalEntry","v":2},{"$f":"IF(B13<>CarRentalCount,\"Kehilangan butiran penting\",\"Butiran penting selesai\")","v":"Kehilangan butiran penting"}]

{"sheet":"Butiran Kecemasan","index":5,"n_rows":11,"n_cols":6,"rows_kept":11,"merged":[[3,4,4,4],[3,5,4,5],[3,6,4,6],[5,4,6,4],[5,5,6,5],[5,6,6,6],[7,5,8,5],[7,6,8,6],[16,1,16,6]]}
[]
[]
[null,"Butiran Insurans",{"$nulls":3},"Butiran Hubungan Kecemasan"]
[{"$f":"IF(C4=\"\",1,\"\")","v":""},"Syarikat Insurans","Humongous Insurance",null,{"$f":"IF(G4=\"\",1,\"\")","v":1},"Nama / Perghubungan / Telefon"]
["","Nombor Telefon",1235550567]
["","Jenis Liputan","1900-01-05",null,{"$f":"IF(G6=\"\",1,\"\")","v":1},"Nama / Perghubungan / Telefon"]
["","Nombor Pengesahan","1900-01-05"]
["","Tarikh Beli",{"$f":"TODAY()","v":"2013-01-17"},null,null,"Nama / Perghubungan / Telefon"]
[1,"Tarikh Liputan"]
[]
[{"$f":"EmergencyEntry","v":5},{"$f":"IF(A11<>EmergencyCount,\"Kehilangan butiran penting\",\"Butiran penting selesai\")","v":"Kehilangan butiran penting"}]