{"text_format":"3","workbook":"xlsx","n_sheets":4,"sheets":["SĀKUMS","PROJEKTA PARAMETRI","INFORMĀCIJA PAR PROJEKTU","PROJEKTA KOPSUMMAS"],"not_rendered":{"charts":2,"defined_names":3,"pivot_tables":1},"read":"whole","date_system":"1900"}

{"sheet":"SĀKUMS","index":0,"n_rows":7,"n_cols":2,"rows_kept":7}
[null,"PAR ŠO VEIDNI"]
[null,"Izmantojiet šo pasākumu plānošanas žurnāla darbgrāmatu, lai sekotu līdzi projekta parametri, detalizētai informācija par projektu un projekta kopsummas."]
[null,"Ievadiet informāciju darblapā Projekta parametri, lai atjauninātu stabiņu diagrammu, un darblapā Detalizēta informācija par projektu. Rakurstabula projekta kopsummu darblapā tiek automātiski atjaunināta."]
[null,"Ievadiet uzņēmuma nosaukums darblapā Parametri un tas tiks automātiski atjaunināts citās darblapās."]
[null,"Piezīme.  "]
[null,"Papildu norādījumi ir sniegti kolonnā A katrā darbgrāmatas PASĀKUMA PLĀNOŠANAS ŽURNĀLS darblapā. Šis teksts ir paslēpts ar nolūku. Lai tekstu noņemtu, atlasiet kolonnu A, pēc tam atlasiet DZĒST. Lai parādītu slēpto tekstu, atlasiet kolonnu A, pēc tam nomainiet fonta krāsu."]
{"$rows_left_out":2}
{"sheet":"PROJEKTA PARAMETRI","index":1,"n_rows":24,"n_cols":9,"rows_kept":24,"merged":[[23,1,42,3]]}
["Šajā darblapā izveidojiet projekta parametri. Šūnā pa labi ievadiet uzņēmuma nosaukums. Šīs kolonnas šūnās ir noderīgi norādījumi. Bultiņa uz leju, lai sāktu darbu.","Uzņēmuma nosaukums"]
["Šīs darblapas nosaukums ir šūnā pa labi.","Pasākuma vadības projekta žurnāls"]
["Konfidencialitātes ziņojums ir šūnā pa labi.",{"$f":"B1&\" , konfidenciāli\"","v":"Uzņēmuma nosaukums , konfidenciāli"}]
["Šūnā pa labi ir padoms.","Ieēnotās šūnas ir aprēķinātas jūsu vietā. Nav nepieciešams tajās neko ievadīt."]
["Ievadiet detalizētu informāciju parametri tabulā, sākot no šūnas pa labi. Nākamais norādījums ir šūnā A12.","PROJEKTA VEIDS","KONTA PĀRVALDNIEKS","PROJEKTA VADĪTĀJS","STRATĒĢIJAS VADĪTĀJS","NOFORMĒJUMA SPECIĀLISTS","PASĀKUMA PERSONĀLS","ADMINISTRATĪVIE DARBINIEKI","Kopsumma"]
[null,"Pasākuma stratēģijas izstrāde",{"v":0.2,"d":"20%"},{"v":0.1,"d":"10%"},{"v":0.6,"d":"60%"},{"v":0,"d":"0%"},{"v":0,"d":"0%"},{"v":0.1,"d":"10%"},{"$f":"SUM(Parametri[[#This Row],[KONTA PĀRVALDNIEKS]:[ADMINISTRATĪVIE DARBINIEKI]])","v":{"v":1,"d":"100%"}}]
{"$rows_left_out":19}
{"sheet":"INFORMĀCIJA PAR PROJEKTU","index":2,"n_rows":10,"n_cols":23,"rows_kept":10}
["Šajā darblapā izveidojiet detalizētu informācija par projektu. Šūnā pa labi tiek automātiski atjaunināts uzņēmuma nosaukums Šīs kolonnas šūnās ir noderīgi norādījumi. Bultiņa uz leju, lai sāktu darbu.",{"$f":"'PROJEKTA PARAMETRI'!B1","v":"Uzņēmuma nosaukums"}]
["Šīs darblapas nosaukums ir šūnā pa labi.","Pasākuma vadības projekta žurnāls"]
["Konfidencialitātes ziņojums ir šūnā pa labi.",{"$f":"'PROJEKTA PARAMETRI'!B3","v":"Uzņēmuma nosaukums , konfidenciāli"}]
["Ievadiet informāciju tabulā Detalizēta informācija par projektu, sākot no šūnas pa labi.\nINFORMĀCIJA\nLai pievienotu rindu tabulas labajā pusē, atlasiet pašu pēdējo tabulas šūnu labajā pusē (nevis kopsummas rindu) un nospiediet tabulēšanas taustiņu, vai arī nospiediet taustiņu kombināciju SHIFT+F10, kur vēlaties ievietot rindu, un atlasiet Ievietot | Tabulas rindas Augstāk/Tabulas rinda zemāk.\nNodrošiniet, lai visas neizmantotās rindas būtu izdzēstas, jo projekta kopsummas rakurstabula izmanto visas tabulas šūnas un pretējā gadījumā rezultāti būtu kļūdaini.","PROJEKTA NOSAUKUMS","PROJEKTA VEIDS","PLĀNOTAIS SĀKUMS","PLĀNOTĀS BEIGAS","FAKTISKAIS SĀKUMS","FAKTISKĀS BEIGAS","PLĀNOTAIS DARBS","FAKTISKAIS DARBS","PLĀNOTAIS ILGUMS","FAKTISKAIS ILGUMS","KONTA PĀRVALDNIEKS","PROJEKTA VADĪTĀJS","STRATĒĢIJAS VADĪTĀJS","NOFORMĒJUMA SPECIĀLISTS","PASĀKUMA PERSONĀLS","ADMINISTRATĪVIE DARBINIEKI","KONTA PĀRVALDNIEKS ","PROJEKTA VADĪTĀJS ","STRATĒĢIJAS VADĪTĀJS ","NOFORMĒJUMA SPECIĀLISTS ","PASĀKUMA PERSONĀLS ","ADMINISTRATĪVIE DARBINIEKI "]
[null,"1. projekts","Pasākuma stratēģijas izstrāde",{"$f":"DATE(YEAR(TODAY()),6,9)","v":"2019-06-09"},{"$f":"DATE(YEAR(TODAY()),8,7)","v":"2019-08-07"},{"$f":"DATE(YEAR(TODAY()),6,29)","v":"2019-06-29"},{"$f":"DATE(YEAR(TODAY()),9,3)","v":"2019-09-03"},200,220,{"$f":"DAYS360(DetalizētaInformācijaParProjektu[[#This Row],[PLĀNOTAIS SĀKUMS]],DetalizētaInformācijaParProjektu[[#This Row],[PLĀNOTĀS BEIGAS]],FALSE)","v":58},{"$f":"DAYS360(DetalizētaInformācijaParProjektu[[#This Row],[FAKTISKAIS SĀKUMS]],DetalizētaInformācijaParProjektu[[#This Row],[FAKTISKĀS BEIGAS]],FALSE)","v":64},{"$f":"INDEX(Parametri[],MATCH(DetalizētaInformācijaParProjektu[[#This Row],[PROJEKTA VEIDS]],Parametri[PROJEKTA VEIDS],0),MATCH(DetalizētaInformācijaParProjektu[[#Headers],[KONTA PĀRVALDNIEKS]],Parametri[#Headers],0))*INDEX('PROJEKTA PARAMETRI'!$B$12:$H$12,1,MATCH(DetalizētaInformācijaParProjektu[[#Headers],[KONTA PĀRVALDNIEKS]],Parametri[#Headers],0))*DetalizētaInformācijaParProjektu[[#This Row],[PLĀNOTAIS DARBS]]","v":{"v":7200,"d":"7,200 EUR"}},{"$f":"INDEX(Parametri[],MATCH(DetalizētaInformācijaParProjektu[[#This Row],[PROJEKTA VEIDS]],Parametri[PROJEKTA VEIDS],0),MATCH(DetalizētaInformācijaParProjektu[[#Headers],[PROJEKTA VADĪTĀJS]],Parametri[#Headers],0))*INDEX('PROJEKTA PARAMETRI'!$B$12:$H$12,1,MATCH(DetalizētaInformācijaParProjektu[[#Headers],[PROJEKTA VADĪTĀJS]],Parametri[#Headers],0))*DetalizētaInformācijaParProjektu[[#This Row],[PLĀNOTAIS DARBS]]","v":{"v":2400,"d":"2,400 EUR"}},{"$f":"INDEX(Parametri[],MATCH(DetalizētaInformācijaParProjektu[[#This Row],[PROJEKTA VEIDS]],Parametri[PROJEKTA VEIDS],0),MATCH(DetalizētaInformācijaParProjektu[[#Headers],[STRATĒĢIJAS VADĪTĀJS]],Parametri[#Headers],0))*INDEX('PROJEKTA PARAMETRI'!$B$12:$H$12,1,MATCH(DetalizētaInformācijaParProjektu[[#Headers],[STRATĒĢIJAS VADĪTĀJS]],Parametri[#Headers],0))*DetalizētaInformācijaParProjektu[[#This Row],[PLĀNOTAIS DARBS]]","v":{"v":18000,"d":"18,000 EUR"}},{"$f":"INDEX(Parametri[],MATCH(DetalizētaInformācijaParProjektu[[#This Row],[PROJEKTA VEIDS]],Parametri[PROJEKTA VEIDS],0),MATCH(DetalizētaInformācijaParProjektu[[#Headers],[NOFORMĒJUMA SPECIĀLISTS]],Parametri[#Headers],0))*INDEX('PROJEKTA PARAMETRI'!$B$12:$H$12,1,MATCH(DetalizētaInformācijaParProjektu[[#Headers],[NOFORMĒJUMA SPECIĀLISTS]],Parametri[#Headers],0))*DetalizētaInformācijaParProjektu[[#This Row],[PLĀNOTAIS DARBS]]","v":{"v":0,"d":"0 EUR"}},{"$f":"INDEX(Parametri[],MATCH(DetalizētaInformācijaParProjektu[[#This Row],[PROJEKTA VEIDS]],Parametri[PROJEKTA VEIDS],0),MATCH(DetalizētaInformācijaParProjektu[[#Headers],[PASĀKUMA PERSONĀLS]],Parametri[#Headers],0))*INDEX('PROJEKTA PARAMETRI'!$B$12:$H$12,1,MATCH(DetalizētaInformācijaParProjektu[[#Headers],[PASĀKUMA PERSONĀLS]],Parametri[#Headers],0))*DetalizētaInformācijaParProjektu[[#This Row],[PLĀNOTAIS DARBS]]","v":{"v":0,"d":"0 EUR"}},{"$f":"INDEX(Parametri[],MATCH(DetalizētaInformācijaParProjektu[[#This Row],[PROJEKTA VEIDS]],Parametri[PROJEKTA VEIDS],0),MATCH(DetalizētaInformācijaParProjektu[[#Headers],[ADMINISTRATĪVIE DARBINIEKI]],Parametri[#Headers],0))*INDEX('PROJEKTA PARAMETRI'!$B$12:$H$12,1,MATCH(DetalizētaInformācijaParProjektu[[#Headers],[ADMINISTRATĪVIE DARBINIEKI]],Parametri[#Headers],0))*DetalizētaInformācijaParProjektu[[#This Row],[PLĀNOTAIS DARBS]]","v":{"v":1200,"d":"1,200 EUR"}},{"$f":"INDEX(Parametri[],MATCH(DetalizētaInformācijaParProjektu[[#This Row],[PROJEKTA VEIDS]],Parametri[PROJEKTA VEIDS],0),MATCH(DetalizētaInformācijaParProjektu[[#Headers],[KONTA PĀRVALDNIEKS]],Parametri[#Headers],0))*INDEX('PROJEKTA PARAMETRI'!$B$12:$H$12,1,MATCH(DetalizētaInformācijaParProjektu[[#Headers],[KONTA PĀRVALDNIEKS]],Parametri[#Headers],0))*DetalizētaInformācijaParProjektu[[#This Row],[FAKTISKAIS DARBS]]","v":{"v":7920,"d":"7,920 EUR"}},{"$f":"INDEX(Parametri[],MATCH(DetalizētaInformācijaParProjektu[[#This Row],[PROJEKTA VEIDS]],Parametri[PROJEKTA VEIDS],0),MATCH(DetalizētaInformācijaParProjektu[[#Headers],[PROJEKTA VADĪTĀJS]],Parametri[#Headers],0))*INDEX('PROJEKTA PARAMETRI'!$B$12:$H$12,1,MATCH(DetalizētaInformācijaParProjektu[[#Headers],[PROJEKTA VADĪTĀJS]],Parametri[#Headers],0))*DetalizētaInformācijaParProjektu[[#This Row],[FAKTISKAIS DARBS]]","v":{"v":2640,"d":"2,640 EUR"}},{"$f":"INDEX(Parametri[],MATCH(DetalizētaInformācijaParProjektu[[#This Row],[PROJEKTA VEIDS]],Parametri[PROJEKTA VEIDS],0),MATCH(DetalizētaInformācijaParProjektu[[#Headers],[STRATĒĢIJAS VADĪTĀJS]],Parametri[#Headers],0))*INDEX('PROJEKTA PARAMETRI'!$B$12:$H$12,1,MATCH(DetalizētaInformācijaParProjektu[[#Headers],[STRATĒĢIJAS VADĪTĀJS]],Parametri[#Headers],0))*DetalizētaInformācijaParProjektu[[#This Row],[FAKTISKAIS DARBS]]","v":{"v":19800,"d":"19,800 EUR"}},{"$f":"INDEX(Parametri[],MATCH(DetalizētaInformācijaParProjektu[[#This Row],[PROJEKTA VEIDS]],Parametri[PROJEKTA VEIDS],0),MATCH(DetalizētaInformācijaParProjektu[[#Headers],[NOFORMĒJUMA SPECIĀLISTS]],Parametri[#Headers],0))*INDEX('PROJEKTA PARAMETRI'!$B$12:$H$12,1,MATCH(DetalizētaInformācijaParProjektu[[#Headers],[NOFORMĒJUMA SPECIĀLISTS]],Parametri[#Headers],0))*DetalizētaInformācijaParProjektu[[#This Row],[FAKTISKAIS DARBS]]","v":{"v":0,"d":"0 EUR"}},{"$f":"INDEX(Parametri[],MATCH(DetalizētaInformācijaParProjektu[[#This Row],[PROJEKTA VEIDS]],Parametri[PROJEKTA VEIDS],0),MATCH(DetalizētaInformācijaParProjektu[[#Headers],[PASĀKUMA PERSONĀLS]],Parametri[#Headers],0))*INDEX('PROJEKTA PARAMETRI'!$B$12:$H$12,1,MATCH(DetalizētaInformācijaParProjektu[[#Headers],[PASĀKUMA PERSONĀLS]],Parametri[#Headers],0))*DetalizētaInformācijaParProjektu[[#This Row],[FAKTISKAIS DARBS]]","v":{"v":0,"d":"0 EUR"}},{"$f":"INDEX(Parametri[],MATCH(DetalizētaInformācijaParProjektu[[#This Row],[PROJEKTA VEIDS]],Parametri[PROJEKTA VEIDS],0),MATCH(DetalizētaInformācijaParProjektu[[#Headers],[ADMINISTRATĪVIE DARBINIEKI]],Parametri[#Headers],0))*INDEX('PROJEKTA PARAMETRI'!$B$12:$H$12,1,MATCH(DetalizētaInformācijaParProjektu[[#Headers],[ADMINISTRATĪVIE DARBINIEKI]],Parametri[#Headers],0))*DetalizētaInformācijaParProjektu[[#This Row],[FAKTISKAIS DARBS]]","v":{"v":1320,"d":"1,320 EUR"}}]
[null,"2. projekts","Pasākumu plānošana",{"$f":"DATE(YEAR(TODAY())+1,6,25)","v":"2020-06-25"},{"$f":"DATE(YEAR(TODAY())+1,7,27)","v":"2020-07-27"},{"$f":"DATE(YEAR(TODAY()),7,15)","v":"2019-07-15"},{"$f":"DATE(YEAR(TODAY())+1,8,25)","v":"2020-08-25"},400,390,{"$f":"DAYS360(DetalizētaInformācijaParProjektu[[#This Row],[PLĀNOTAIS SĀKUMS]],DetalizētaInformācijaParProjektu[[#This Row],[PLĀNOTĀS BEIGAS]],FALSE)","v":32},{"$f":"DAYS360(DetalizētaInformācijaParProjektu[[#This Row],[FAKTISKAIS SĀKUMS]],DetalizētaInformācijaParProjektu[[#This Row],[FAKTISKĀS BEIGAS]],FALSE)","v":400},{"$f":"INDEX(Parametri[],MATCH(DetalizētaInformācijaParProjektu[[#This Row],[PROJEKTA VEIDS]],Parametri[PROJEKTA VEIDS],0),MATCH(DetalizētaInformācijaParProjektu[[#Headers],[KONTA PĀRVALDNIEKS]],Parametri[#Headers],0))*INDEX('PROJEKTA PARAMETRI'!$B$12:$H$12,1,MATCH(DetalizētaInformācijaParProjektu[[#Headers],[KONTA PĀRVALDNIEKS]],Parametri[#Headers],0))*DetalizētaInformācijaParProjektu[[#This Row],[PLĀNOTAIS DARBS]]","v":{"v":14400,"d":"14,400 EUR"}},{"$f":"INDEX(Parametri[],MATCH(DetalizētaInformācijaParProjektu[[#This Row],[PROJEKTA VEIDS]],Parametri[PROJEKTA VEIDS],0),MATCH(DetalizētaInformācijaParProjektu[[#Headers],[PROJEKTA VADĪTĀJS]],Parametri[#Headers],0))*INDEX('PROJEKTA PARAMETRI'!$B$12:$H$12,1,MATCH(DetalizētaInformācijaParProjektu[[#Headers],[PROJEKTA VADĪTĀJS]],Parametri[#Headers],0))*DetalizētaInformācijaParProjektu[[#This Row],[PLĀNOTAIS DARBS]]","v":{"v":24000,"d":"24,000 EUR"}},{"$f":"INDEX(Parametri[],MATCH(DetalizētaInformācijaParProjektu[[#This Row],[PROJEKTA VEIDS]],Parametri[PROJEKTA VEIDS],0),MATCH(DetalizētaInformācijaParProjektu[[#Headers],[STRATĒĢIJAS VADĪTĀJS]],Parametri[#Headers],0))*INDEX('PROJEKTA PARAMETRI'!$B$12:$H$12,1,MATCH(DetalizētaInformācijaParProjektu[[#Headers],[STRATĒĢIJAS VADĪTĀJS]],Parametri[#Headers],0))*DetalizētaInformācijaParProjektu[[#This Row],[PLĀNOTAIS DARBS]]","v":{"v":6000,"d":"6,000 EUR"}},{"$f":"INDEX(Parametri[],MATCH(DetalizētaInformācijaParProjektu[[#This Row],[PROJEKTA VEIDS]],Parametri[PROJEKTA VEIDS],0),MATCH(DetalizētaInformācijaParProjektu[[#Headers],[NOFORMĒJUMA SPECIĀLISTS]],Parametri[#Headers],0))*INDEX('PROJEKTA PARAMETRI'!$B$12:$H$12,1,MATCH(DetalizētaInformācijaParProjektu[[#Headers],[NOFORMĒJUMA SPECIĀLISTS]],Parametri[#Headers],0))*DetalizētaInformācijaParProjektu[[#This Row],[PLĀNOTAIS DARBS]]","v":{"v":4000,"d":"4,000 EUR"}},{"$f":"INDEX(Parametri[],MATCH(DetalizētaInformācijaParProjektu[[#This Row],[PROJEKTA VEIDS]],Parametri[PROJEKTA VEIDS],0),MATCH(DetalizētaInformācijaParProjektu[[#Headers],[PASĀKUMA PERSONĀLS]],Parametri[#Headers],0))*INDEX('PROJEKTA PARAMETRI'!$B$12:$H$12,1,MATCH(DetalizētaInformācijaParProjektu[[#Headers],[PASĀKUMA PERSONĀLS]],Parametri[#Headers],0))*DetalizētaInformācijaParProjektu[[#This Row],[PLĀNOTAIS DARBS]]","v":{"v":0,"d":"0 EUR"}},{"$f":"INDEX(Parametri[],MATCH(DetalizētaInformācijaParProjektu[[#This Row],[PROJEKTA VEIDS]],Parametri[PROJEKTA VEIDS],0),MATCH(DetalizētaInformācijaParProjektu[[#Headers],[ADMINISTRATĪVIE DARBINIEKI]],Parametri[#Headers],0))*INDEX('PROJEKTA PARAMETRI'!$B$12:$H$12,1,MATCH(DetalizētaInformācijaParProjektu[[#Headers],[ADMINISTRATĪVIE DARBINIEKI]],Parametri[#Headers],0))*DetalizētaInformācijaParProjektu[[#This Row],[PLĀNOTAIS DARBS]]","v":{"v":2400,"d":"2,400 EUR"}},{"$f":"INDEX(Parametri[],MATCH(DetalizētaInformācijaParProjektu[[#This Row],[PROJEKTA VEIDS]],Parametri[PROJEKTA VEIDS],0),MATCH(DetalizētaInformācijaParProjektu[[#Headers],[KONTA PĀRVALDNIEKS]],Parametri[#Headers],0))*INDEX('PROJEKTA PARAMETRI'!$B$12:$H$12,1,MATCH(DetalizētaInformācijaParProjektu[[#Headers],[KONTA PĀRVALDNIEKS]],Parametri[#Headers],0))*DetalizētaInformācijaParProjektu[[#This Row],[FAKTISKAIS DARBS]]","v":{"v":14040,"d":"14,040 EUR"}},{"$f":"INDEX(Parametri[],MATCH(DetalizētaInformācijaParProjektu[[#This Row],[PROJEKTA VEIDS]],Parametri[PROJEKTA VEIDS],0),MATCH(DetalizētaInformācijaParProjektu[[#Headers],[PROJEKTA VADĪTĀJS]],Parametri[#Headers],0))*INDEX('PROJEKTA PARAMETRI'!$B$12:$H$12,1,MATCH(DetalizētaInformācijaParProjektu[[#Headers],[PROJEKTA VADĪTĀJS]],Parametri[#Headers],0))*DetalizētaInformācijaParProjektu[[#This Row],[FAKTISKAIS DARBS]]","v":{"v":23400,"d":"23,400 EUR"}},{"$f":"INDEX(Parametri[],MATCH(DetalizētaInformācijaParProjektu[[#This Row],[PROJEKTA VEIDS]],Parametri[PROJEKTA VEIDS],0),MATCH(DetalizētaInformācijaParProjektu[[#Headers],[STRATĒĢIJAS VADĪTĀJS]],Parametri[#Headers],0))*INDEX('PROJEKTA PARAMETRI'!$B$12:$H$12,1,MATCH(DetalizētaInformācijaParProjektu[[#Headers],[STRATĒĢIJAS VADĪTĀJS]],Parametri[#Headers],0))*DetalizētaInformācijaParProjektu[[#This Row],[FAKTISKAIS DARBS]]","v":{"v":5850,"d":"5,850 EUR"}},{"$f":"INDEX(Parametri[],MATCH(DetalizētaInformācijaParProjektu[[#This Row],[PROJEKTA VEIDS]],Parametri[PROJEKTA VEIDS],0),MATCH(DetalizētaInformācijaParProjektu[[#Headers],[NOFORMĒJUMA SPECIĀLISTS]],Parametri[#Headers],0))*INDEX('PROJEKTA PARAMETRI'!$B$12:$H$12,1,MATCH(DetalizētaInformācijaParProjektu[[#Headers],[NOFORMĒJUMA SPECIĀLISTS]],Parametri[#Headers],0))*DetalizētaInformācijaParProjektu[[#This Row],[FAKTISKAIS DARBS]]","v":{"v":3900,"d":"3,900 EUR"}},{"$f":"INDEX(Parametri[],MATCH(DetalizētaInformācijaParProjektu[[#This Row],[PROJEKTA VEIDS]],Parametri[PROJEKTA VEIDS],0),MATCH(DetalizētaInformācijaParProjektu[[#Headers],[PASĀKUMA PERSONĀLS]],Parametri[#Headers],0))*INDEX('PROJEKTA PARAMETRI'!$B$12:$H$12,1,MATCH(DetalizētaInformācijaParProjektu[[#Headers],[PASĀKUMA PERSONĀLS]],Parametri[#Headers],0))*DetalizētaInformācijaParProjektu[[#This Row],[FAKTISKAIS DARBS]]","v":{"v":0,"d":"0 EUR"}},{"$f":"INDEX(Parametri[],MATCH(DetalizētaInformācijaParProjektu[[#This Row],[PROJEKTA VEIDS]],Parametri[PROJEKTA VEIDS],0),MATCH(DetalizētaInformācijaParProjektu[[#Headers],[ADMINISTRATĪVIE DARBINIEKI]],Parametri[#Headers],0))*INDEX('PROJEKTA PARAMETRI'!$B$12:$H$12,1,MATCH(DetalizētaInformācijaParProjektu[[#Headers],[ADMINISTRATĪVIE DARBINIEKI]],Parametri[#Headers],0))*DetalizētaInformācijaParProjektu[[#This Row],[FAKTISKAIS DARBS]]","v":{"v":2340,"d":"2,340 EUR"}}]
{"$rows_left_out":5}
{"sheet":"PROJEKTA KOPSUMMAS","index":3,"n_rows":10,"n_cols":14,"rows_kept":10}
["Šajā darblapā iegūstiet projekta kopsummas. Šūnā pa labi tiek automātiski atjaunināts uzņēmuma nosaukums Šīs kolonnas šūnās ir noderīgi norādījumi. Bultiņa uz leju, lai sāktu darbu.",{"$f":"'PROJEKTA PARAMETRI'!B1","v":"Uzņēmuma nosaukums"}]
["Šīs darblapas nosaukums ir šūnā pa labi.","Pasākuma vadības projekta žurnāls"]
["Konfidencialitātes ziņojums ir šūnā pa labi.",{"$f":"'PROJEKTA PARAMETRI'!B3","v":"Uzņēmuma nosaukums , konfidenciāli"}]
["Rakurstabula, kas sākas šūnā pa labi, tiek automātiski atjaunināta.\nINFORMĀCIJA\nLai atsvaidzinātu rakurstabulu labajā pusē, atlasiet to (jebkuru šūnu rakurstabulā), lentes cilnē RAKURSTABULU RĪKI | ANALĪZE atlasiet Atsvaidzināt vai nospiediet taustiņu kombināciju SHIFT+F10 jebkurā rakurstabulas šūnā un pēc tam atlasiet Atsvaidzināt.","PROJEKTA NOSAUKUMS","KONTA PĀRVALDNIEKA PLĀNOTAIS","PROJEKTU VADĪTĀJA PLĀNOTAIS","STRATĒĢIJAS VADĪTĀJA PLĀNOTAIS","NOFORMĒJUMA SPECIĀLISTA PLĀNOTAIS","PASĀKUMA PERSONĀLA PLĀNOTAIS","ADMINISTRATĪVO DARBINIEKU PLĀNOTAIS","KONTA PĀRVALDNIEKA FAKTISKAIS","PROJEKTU VADĪTĀJA FAKTISKAIS","STRATĒĢIJAS VADĪTĀJA FAKTISKAIS","NOFORMĒJUMA SPECIĀLISTA FAKTISKAIS","PASĀKUMA PERSONĀLA FAKTISKAIS","ADMINISTRATĪVO DARBINIEKU FAKTISKAIS"]
[null,"1. projekts",{"v":7200,"d":"7,200.00 EUR"},{"v":2400,"d":"2,400.00 EUR"},{"v":18000,"d":"18,000.00 EUR"},{"v":0,"d":"0.00 EUR"},{"v":0,"d":"0.00 EUR"},{"v":1200,"d":"1,200.00 EUR"},{"v":7920,"d":"7,920.00 EUR"},{"v":2640,"d":"2,640.00 EUR"},{"v":19800,"d":"19,800.00 EUR"},{"v":0,"d":"0.00 EUR"},{"v":0,"d":"0.00 EUR"},{"v":1320,"d":"1,320.00 EUR"}]
[null,"2. projekts",{"v":14400,"d":"14,400.00 EUR"},{"v":24000,"d":"24,000.00 EUR"},{"v":6000,"d":"6,000.00 EUR"},{"v":4000,"d":"4,000.00 EUR"},{"v":0,"d":"0.00 EUR"},{"v":2400,"d":"2,400.00 EUR"},{"v":14040,"d":"14,040.00 EUR"},{"v":23400,"d":"23,400.00 EUR"},{"v":5850,"d":"5,850.00 EUR"},{"v":3900,"d":"3,900.00 EUR"},{"v":0,"d":"0.00 EUR"},{"v":2340,"d":"2,340.00 EUR"}]
{"$rows_left_out":4}