{"text_format":"3","workbook":"xlsx","n_sheets":4,"sheets":["Pradžia","PROJEKTO PARAMETRAI","PROJEKTO INFORMACIJA","PROJEKTO SUMOS"],"not_rendered":{"charts":2,"defined_names":3,"pivot_tables":1},"read":"whole","date_system":"1900"}

{"sheet":"Pradžia","index":0,"n_rows":8,"n_cols":2,"rows_kept":8}
[null,"APIE ŠĮ ŠABLONĄ"]
[]
[null,"Naudokite šią darbaknygę, kad galėtumėte sekti projekto parametrai, projekto informacija ir projekto sumos Advokatų kontorų projekto planavimas įmonėms. įmonėms."]
[null,"Įveskite įmonės pavadinimas darbalapyje Projekto parametrai ir jis bus automatiškai atnaujintas kituose darbalapiuose."]
[null,"Įveskite informaciją apie projekto parametrai darbalapį, kad atnaujintumėte stulpelių diagramas ir projekto informacija darbalapį. Projekto sumos darbalapyje automatiškai atnaujinama projekto „PivotTable“."]
[null,"Pastaba.  "]
{"$rows_left_out":3}
{"sheet":"PROJEKTO PARAMETRAI","index":1,"n_rows":19,"n_cols":9,"rows_kept":19}
["Kurkite projekto parametrai šiame darbalapyje. Langelyje dešinėje įveskite įmonės pavadinimas. Naudingos instrukcijos pateiktos šio stulpelio langeliuose.","Įmonės pavadinimas"]
["Šio darbalapio pavadinimas yra langelyje dešinėje.","Advokatų kontorų projekto planavimas"]
["Konfidencialumo pranešimas langelyje dešinėje.",{"$f":"B1&\" (konfidencialu)\"","v":"Įmonės pavadinimas (konfidencialu)"}]
["Patarimas pateikiamas langelyje dešinėje.","Paryškintuose langeliuose esančios reikšmės apskaičiuojamos už jus. Jums nereikia nieko į juos įvesti."]
["Įveskite informaciją lentelėje Parametrai pradėdami nuo langelio dešinėje. Kitas nurodymas yra A12 langelyje.","PROJEKTO TIPAS","BENDRASIS PARTNERIS","VERSLO TEISININKAS","GYNYBOS ŠALIS TEISINIAME PROCESE","INTELEKTINĖS NUOSAVYBĖS TEISININKAS","BANKROTO TEISININKAS","ADMINISTRACIJOS DARBUOTOJAI","SUMA"]
[null,"Verslo įtraukimas",{"v":0.1,"d":"10%"},{"v":0.4,"d":"40%"},{"v":0,"d":"0%"},{"v":0,"d":"0%"},{"v":0,"d":"0%"},{"v":0.5,"d":"50%"},{"$f":"SUM(Parametrai[[#This Row],[BENDRASIS PARTNERIS]:[ADMINISTRACIJOS DARBUOTOJAI]])","v":{"v":1,"d":"100%"}}]
{"$rows_left_out":14}
{"sheet":"PROJEKTO INFORMACIJA","index":2,"n_rows":10,"n_cols":25,"rows_kept":10,"merged":[[1,24,8,28]]}
["Kurkite projekto informacija šiame darbalapyje. Įmonės pavadinimas automatiškai atnaujinamas langelyje dešinėje. Naudingos instrukcijos pateiktos šio stulpelio langeliuose. Paspauskite rodyklę žemyn, kad pradėtumėte.",{"$f":"'PROJEKTO PARAMETRAI'!B1","v":"Įmonės pavadinimas"}]
["Darbalapio pavadinimas yra langelyje dešinėje, o informaciniai patarimai pateikti langelyje Y2.",{"$f":"'PROJEKTO PARAMETRAI'!B2","v":"Advokatų kontorų projekto planavimas"},{"$nulls":22},"INFORMACIJA:\nNorėdami įtraukti eilutę, pasirinkite apatiniame dešiniajame kampe esantį langelį (ne sumos eilutę) ir paspauskite Tab arba paspauskite SHIFT, tada F10 ten, kur norite įterpti eilutę, tada spustelėkite Įterpti | Lentelės eilutės Viršuje/apačioje.\nĮsitikinkite, kad panaikintos visos nenaudojamas eilutės, nes PROJEKTO SUMOS PivotTable naudos visus lentelės langelius, nes kitu atveju bus pateikti klaidingi rezultatai."]
["Konfidencialumo pranešimas langelyje dešinėje.",{"$f":"'PROJEKTO PARAMETRAI'!B3","v":"Įmonės pavadinimas (konfidencialu)"}]
["Įveskite informaciją lentelėje Informacija nuo langelio dešinėje. Projekto tipas informacija lentelėje dešinėje yra automatiškai atnaujinami pagal lentelė Parametrai, esančią projekto parametrai darbalapyje.","PROJEKTO PAVADINIMAS","PROJEKTO TIPAS","NUMATOMA PRADŽIA","NUMATOMA PABAIGA","FAKTINĖ PRADŽIA","FAKTINĖ PABAIGA","NUMATYTOS DARBO VALANDOS","FAKTINĖS DARBO VALANDOS","NUMATOMA TRUKMĖ","FAKTINĖ TRUKMĖ","BENDRASIS PARTNERIS","VERSLO TEISININKAS","GYNYBOS ŠALIS TEISINIAME PROCESE","INTELEKTINĖS NUOSAVYBĖS TEISININKAS","BANKROTO TEISININKAS","ADMINISTRACIJOS DARBUOTOJAI","2 BENDRASIS PARTNERIS","2 VERSLO TEISININKAS","2 GYNYBOS ŠALIS TEISINIAME PROCESE","2 INTELEKTINĖS NUOSAVYBĖS TEISININKAS","2 BANKROTO TEISININKAS","2 ADMINISTRACIJOS DARBUOTOJAS"]
[null,"1 projektas","Verslo įtraukimas",{"$f":"TODAY()","v":"2019-02-20"},{"$f":"TODAY()+60","v":"2019-04-21"},{"$f":"TODAY()+10","v":"2019-03-02"},{"$f":"TODAY()+65","v":"2019-04-26"},200,220,{"$f":"DAYS360(Informacija[[#This Row],[NUMATOMA PRADŽIA]],Informacija[[#This Row],[NUMATOMA PABAIGA]],FALSE)","v":61},{"$f":"DAYS360(Informacija[[#This Row],[FAKTINĖ PRADŽIA]],Informacija[[#This Row],[FAKTINĖ PABAIGA]],FALSE)","v":54},{"$f":"INDEX(Parametrai[],MATCH(Informacija[[#This Row],[PROJEKTO TIPAS]],Parametrai[PROJEKTO TIPAS],0),MATCH(Informacija[[#Headers],[BENDRASIS PARTNERIS]],Parametrai[#Headers],0))*INDEX('PROJEKTO PARAMETRAI'!$B$12:$H$12,1,MATCH(Informacija[[#Headers],[BENDRASIS PARTNERIS]],Parametrai[#Headers],0))*Informacija[[#This Row],[NUMATYTOS DARBO VALANDOS]]","v":{"v":7000,"d":"7,000 EUR"}},{"$f":"INDEX(Parametrai[],MATCH(Informacija[[#This Row],[PROJEKTO TIPAS]],Parametrai[PROJEKTO TIPAS],0),MATCH(Informacija[[#Headers],[VERSLO TEISININKAS]],Parametrai[#Headers],0))*INDEX('PROJEKTO PARAMETRAI'!$B$12:$H$12,1,MATCH(Informacija[[#Headers],[VERSLO TEISININKAS]],Parametrai[#Headers],0))*Informacija[[#This Row],[NUMATYTOS DARBO VALANDOS]]","v":{"v":20000,"d":"20,000 EUR"}},{"$f":"INDEX(Parametrai[],MATCH(Informacija[[#This Row],[PROJEKTO TIPAS]],Parametrai[PROJEKTO TIPAS],0),MATCH(Informacija[[#Headers],[GYNYBOS ŠALIS TEISINIAME PROCESE]],Parametrai[#Headers],0))*INDEX('PROJEKTO PARAMETRAI'!$B$12:$H$12,1,MATCH(Informacija[[#Headers],[GYNYBOS ŠALIS TEISINIAME PROCESE]],Parametrai[#Headers],0))*Informacija[[#This Row],[NUMATYTOS DARBO VALANDOS]]","v":{"v":0,"d":"0 EUR"}},{"$f":"INDEX(Parametrai[],MATCH(Informacija[[#This Row],[PROJEKTO TIPAS]],Parametrai[PROJEKTO TIPAS],0),MATCH(Informacija[[#Headers],[INTELEKTINĖS NUOSAVYBĖS TEISININKAS]],Parametrai[#Headers],0))*INDEX('PROJEKTO PARAMETRAI'!$B$12:$H$12,1,MATCH(Informacija[[#Headers],[INTELEKTINĖS NUOSAVYBĖS TEISININKAS]],Parametrai[#Headers],0))*Informacija[[#This Row],[NUMATYTOS DARBO VALANDOS]]","v":{"v":0,"d":"0 EUR"}},{"$f":"INDEX(Parametrai[],MATCH(Informacija[[#This Row],[PROJEKTO TIPAS]],Parametrai[PROJEKTO TIPAS],0),MATCH(Informacija[[#Headers],[BANKROTO TEISININKAS]],Parametrai[#Headers],0))*INDEX('PROJEKTO PARAMETRAI'!$B$12:$H$12,1,MATCH(Informacija[[#Headers],[BANKROTO TEISININKAS]],Parametrai[#Headers],0))*Informacija[[#This Row],[NUMATYTOS DARBO VALANDOS]]","v":{"v":0,"d":"0 EUR"}},{"$f":"INDEX(Parametrai[],MATCH(Informacija[[#This Row],[PROJEKTO TIPAS]],Parametrai[PROJEKTO TIPAS],0),MATCH(Informacija[[#Headers],[ADMINISTRACIJOS DARBUOTOJAI]],Parametrai[#Headers],0))*INDEX('PROJEKTO PARAMETRAI'!$B$12:$H$12,1,MATCH(Informacija[[#Headers],[ADMINISTRACIJOS DARBUOTOJAI]],Parametrai[#Headers],0))*Informacija[[#This Row],[NUMATYTOS DARBO VALANDOS]]","v":{"v":12500,"d":"12,500 EUR"}},{"$f":"INDEX(Parametrai[],MATCH(Informacija[[#This Row],[PROJEKTO TIPAS]],Parametrai[PROJEKTO TIPAS],0),MATCH(Informacija[[#Headers],[BENDRASIS PARTNERIS]],Parametrai[#Headers],0))*INDEX('PROJEKTO PARAMETRAI'!$B$12:$H$12,1,MATCH(Informacija[[#Headers],[BENDRASIS PARTNERIS]],Parametrai[#Headers],0))*Informacija[[#This Row],[FAKTINĖS DARBO VALANDOS]]","v":{"v":7700,"d":"7,700 EUR"}},{"$f":"INDEX(Parametrai[],MATCH(Informacija[[#This Row],[PROJEKTO TIPAS]],Parametrai[PROJEKTO TIPAS],0),MATCH(Informacija[[#Headers],[VERSLO TEISININKAS]],Parametrai[#Headers],0))*INDEX('PROJEKTO PARAMETRAI'!$B$12:$H$12,1,MATCH(Informacija[[#Headers],[VERSLO TEISININKAS]],Parametrai[#Headers],0))*Informacija[[#This Row],[FAKTINĖS DARBO VALANDOS]]","v":{"v":22000,"d":"22,000 EUR"}},{"$f":"INDEX(Parametrai[],MATCH(Informacija[[#This Row],[PROJEKTO TIPAS]],Parametrai[PROJEKTO TIPAS],0),MATCH(Informacija[[#Headers],[GYNYBOS ŠALIS TEISINIAME PROCESE]],Parametrai[#Headers],0))*INDEX('PROJEKTO PARAMETRAI'!$B$12:$H$12,1,MATCH(Informacija[[#Headers],[GYNYBOS ŠALIS TEISINIAME PROCESE]],Parametrai[#Headers],0))*Informacija[[#This Row],[FAKTINĖS DARBO VALANDOS]]","v":{"v":0,"d":"0 EUR"}},{"$f":"INDEX(Parametrai[],MATCH(Informacija[[#This Row],[PROJEKTO TIPAS]],Parametrai[PROJEKTO TIPAS],0),MATCH(Informacija[[#Headers],[INTELEKTINĖS NUOSAVYBĖS TEISININKAS]],Parametrai[#Headers],0))*INDEX('PROJEKTO PARAMETRAI'!$B$12:$H$12,1,MATCH(Informacija[[#Headers],[INTELEKTINĖS NUOSAVYBĖS TEISININKAS]],Parametrai[#Headers],0))*Informacija[[#This Row],[FAKTINĖS DARBO VALANDOS]]","v":{"v":0,"d":"0 EUR"}},{"$f":"INDEX(Parametrai[],MATCH(Informacija[[#This Row],[PROJEKTO TIPAS]],Parametrai[PROJEKTO TIPAS],0),MATCH(Informacija[[#Headers],[BANKROTO TEISININKAS]],Parametrai[#Headers],0))*INDEX('PROJEKTO PARAMETRAI'!$B$12:$H$12,1,MATCH(Informacija[[#Headers],[BANKROTO TEISININKAS]],Parametrai[#Headers],0))*Informacija[[#This Row],[FAKTINĖS DARBO VALANDOS]]","v":{"v":0,"d":"0 EUR"}},{"$f":"INDEX(Parametrai[],MATCH(Informacija[[#This Row],[PROJEKTO TIPAS]],Parametrai[PROJEKTO TIPAS],0),MATCH(Informacija[[#Headers],[ADMINISTRACIJOS DARBUOTOJAI]],Parametrai[#Headers],0))*INDEX('PROJEKTO PARAMETRAI'!$B$12:$H$12,1,MATCH(Informacija[[#Headers],[ADMINISTRACIJOS DARBUOTOJAI]],Parametrai[#Headers],0))*Informacija[[#This Row],[FAKTINĖS DARBO VALANDOS]]","v":{"v":13750,"d":"13,750 EUR"}}]
[null,"2 projektas","Verslo įsigijimas",{"$f":"TODAY()+30","v":"2019-03-22"},{"$f":"TODAY()+100","v":"2019-05-31"},{"$f":"TODAY()+40","v":"2019-04-01"},{"$f":"TODAY()+110","v":"2019-06-10"},400,390,{"$f":"DAYS360(Informacija[[#This Row],[NUMATOMA PRADŽIA]],Informacija[[#This Row],[NUMATOMA PABAIGA]],FALSE)","v":69},{"$f":"DAYS360(Informacija[[#This Row],[FAKTINĖ PRADŽIA]],Informacija[[#This Row],[FAKTINĖ PABAIGA]],FALSE)","v":69},{"$f":"INDEX(Parametrai[],MATCH(Informacija[[#This Row],[PROJEKTO TIPAS]],Parametrai[PROJEKTO TIPAS],0),MATCH(Informacija[[#Headers],[BENDRASIS PARTNERIS]],Parametrai[#Headers],0))*INDEX('PROJEKTO PARAMETRAI'!$B$12:$H$12,1,MATCH(Informacija[[#Headers],[BENDRASIS PARTNERIS]],Parametrai[#Headers],0))*Informacija[[#This Row],[NUMATYTOS DARBO VALANDOS]]","v":{"v":14000,"d":"14,000 EUR"}},{"$f":"INDEX(Parametrai[],MATCH(Informacija[[#This Row],[PROJEKTO TIPAS]],Parametrai[PROJEKTO TIPAS],0),MATCH(Informacija[[#Headers],[VERSLO TEISININKAS]],Parametrai[#Headers],0))*INDEX('PROJEKTO PARAMETRAI'!$B$12:$H$12,1,MATCH(Informacija[[#Headers],[VERSLO TEISININKAS]],Parametrai[#Headers],0))*Informacija[[#This Row],[NUMATYTOS DARBO VALANDOS]]","v":{"v":40000,"d":"40,000 EUR"}},{"$f":"INDEX(Parametrai[],MATCH(Informacija[[#This Row],[PROJEKTO TIPAS]],Parametrai[PROJEKTO TIPAS],0),MATCH(Informacija[[#Headers],[GYNYBOS ŠALIS TEISINIAME PROCESE]],Parametrai[#Headers],0))*INDEX('PROJEKTO PARAMETRAI'!$B$12:$H$12,1,MATCH(Informacija[[#Headers],[GYNYBOS ŠALIS TEISINIAME PROCESE]],Parametrai[#Headers],0))*Informacija[[#This Row],[NUMATYTOS DARBO VALANDOS]]","v":{"v":0,"d":"0 EUR"}},{"$f":"INDEX(Parametrai[],MATCH(Informacija[[#This Row],[PROJEKTO TIPAS]],Parametrai[PROJEKTO TIPAS],0),MATCH(Informacija[[#Headers],[INTELEKTINĖS NUOSAVYBĖS TEISININKAS]],Parametrai[#Headers],0))*INDEX('PROJEKTO PARAMETRAI'!$B$12:$H$12,1,MATCH(Informacija[[#Headers],[INTELEKTINĖS NUOSAVYBĖS TEISININKAS]],Parametrai[#Headers],0))*Informacija[[#This Row],[NUMATYTOS DARBO VALANDOS]]","v":{"v":11000,"d":"11,000 EUR"}},{"$f":"INDEX(Parametrai[],MATCH(Informacija[[#This Row],[PROJEKTO TIPAS]],Parametrai[PROJEKTO TIPAS],0),MATCH(Informacija[[#Headers],[BANKROTO TEISININKAS]],Parametrai[#Headers],0))*INDEX('PROJEKTO PARAMETRAI'!$B$12:$H$12,1,MATCH(Informacija[[#Headers],[BANKROTO TEISININKAS]],Parametrai[#Headers],0))*Informacija[[#This Row],[NUMATYTOS DARBO VALANDOS]]","v":{"v":0,"d":"0 EUR"}},{"$f":"INDEX(Parametrai[],MATCH(Informacija[[#This Row],[PROJEKTO TIPAS]],Parametrai[PROJEKTO TIPAS],0),MATCH(Informacija[[#Headers],[ADMINISTRACIJOS DARBUOTOJAI]],Parametrai[#Headers],0))*INDEX('PROJEKTO PARAMETRAI'!$B$12:$H$12,1,MATCH(Informacija[[#Headers],[ADMINISTRACIJOS DARBUOTOJAI]],Parametrai[#Headers],0))*Informacija[[#This Row],[NUMATYTOS DARBO VALANDOS]]","v":{"v":20000,"d":"20,000 EUR"}},{"$f":"INDEX(Parametrai[],MATCH(Informacija[[#This Row],[PROJEKTO TIPAS]],Parametrai[PROJEKTO TIPAS],0),MATCH(Informacija[[#Headers],[BENDRASIS PARTNERIS]],Parametrai[#Headers],0))*INDEX('PROJEKTO PARAMETRAI'!$B$12:$H$12,1,MATCH(Informacija[[#Headers],[BENDRASIS PARTNERIS]],Parametrai[#Headers],0))*Informacija[[#This Row],[FAKTINĖS DARBO VALANDOS]]","v":{"v":13650,"d":"13,650 EUR"}},{"$f":"INDEX(Parametrai[],MATCH(Informacija[[#This Row],[PROJEKTO TIPAS]],Parametrai[PROJEKTO TIPAS],0),MATCH(Informacija[[#Headers],[VERSLO TEISININKAS]],Parametrai[#Headers],0))*INDEX('PROJEKTO PARAMETRAI'!$B$12:$H$12,1,MATCH(Informacija[[#Headers],[VERSLO TEISININKAS]],Parametrai[#Headers],0))*Informacija[[#This Row],[FAKTINĖS DARBO VALANDOS]]","v":{"v":39000,"d":"39,000 EUR"}},{"$f":"INDEX(Parametrai[],MATCH(Informacija[[#This Row],[PROJEKTO TIPAS]],Parametrai[PROJEKTO TIPAS],0),MATCH(Informacija[[#Headers],[GYNYBOS ŠALIS TEISINIAME PROCESE]],Parametrai[#Headers],0))*INDEX('PROJEKTO PARAMETRAI'!$B$12:$H$12,1,MATCH(Informacija[[#Headers],[GYNYBOS ŠALIS TEISINIAME PROCESE]],Parametrai[#Headers],0))*Informacija[[#This Row],[FAKTINĖS DARBO VALANDOS]]","v":{"v":0,"d":"0 EUR"}},{"$f":"INDEX(Parametrai[],MATCH(Informacija[[#This Row],[PROJEKTO TIPAS]],Parametrai[PROJEKTO TIPAS],0),MATCH(Informacija[[#Headers],[INTELEKTINĖS NUOSAVYBĖS TEISININKAS]],Parametrai[#Headers],0))*INDEX('PROJEKTO PARAMETRAI'!$B$12:$H$12,1,MATCH(Informacija[[#Headers],[INTELEKTINĖS NUOSAVYBĖS TEISININKAS]],Parametrai[#Headers],0))*Informacija[[#This Row],[FAKTINĖS DARBO VALANDOS]]","v":{"v":10725,"d":"10,725 EUR"}},{"$f":"INDEX(Parametrai[],MATCH(Informacija[[#This Row],[PROJEKTO TIPAS]],Parametrai[PROJEKTO TIPAS],0),MATCH(Informacija[[#Headers],[BANKROTO TEISININKAS]],Parametrai[#Headers],0))*INDEX('PROJEKTO PARAMETRAI'!$B$12:$H$12,1,MATCH(Informacija[[#Headers],[BANKROTO TEISININKAS]],Parametrai[#Headers],0))*Informacija[[#This Row],[FAKTINĖS DARBO VALANDOS]]","v":{"v":0,"d":"0 EUR"}},{"$f":"INDEX(Parametrai[],MATCH(Informacija[[#This Row],[PROJEKTO TIPAS]],Parametrai[PROJEKTO TIPAS],0),MATCH(Informacija[[#Headers],[ADMINISTRACIJOS DARBUOTOJAI]],Parametrai[#Headers],0))*INDEX('PROJEKTO PARAMETRAI'!$B$12:$H$12,1,MATCH(Informacija[[#Headers],[ADMINISTRACIJOS DARBUOTOJAI]],Parametrai[#Headers],0))*Informacija[[#This Row],[FAKTINĖS DARBO VALANDOS]]","v":{"v":19500,"d":"19,500 EUR"}}]
{"$rows_left_out":5}
{"sheet":"PROJEKTO SUMOS","index":3,"n_rows":11,"n_cols":16,"rows_kept":11,"merged":[[3,2,3,7],[3,8,3,13],[3,15,14,19]]}
["Gaukite projekto sumos šiame darbalapyje. Įmonės pavadinimas automatiškai atnaujinamas langelyje dešinėje pusėje. Naudingos instrukcijos pateiktos šio stulpelio langeliuose. Paspauskite rodyklę žemyn, kad pradėtumėte.",{"$f":"'PROJEKTO PARAMETRAI'!B1","v":"Įmonės pavadinimas"}]
["Šio darbalapio pavadinimas yra langelyje dešinėje.",{"$f":"'PROJEKTO PARAMETRAI'!B2","v":"Advokatų kontorų projekto planavimas"}]
["Konfidencialumo pranešimas langelyje dešinėje.",{"$f":"'PROJEKTO PARAMETRAI'!B3","v":"Įmonės pavadinimas (konfidencialu)"}]
["Numatomos išlaidos yra langelyje C4, Faktinės sumos žymė langelyje I4 ir informacijos patarimas P4 langelyje.",null,"NUMATOMOS IŠLAIDOS",{"$nulls":5},"FAKTINĖS",{"$nulls":6},"INFORMACIJA: \nŠi „PivotTable“ nebus automatiškai atnaujinta.  Norėdami atnaujinti, pasirinkite ją (bet kurį langelį iš „PivotTable“), juostelės skirtuke PIVOTTABLE ĮRANKIAI | ANALIZUOTI pasirinkite Atnaujinti.  Arba paspauskite „SHIFT“ + F10, pasirinkdami „PivotTable“, tada pasirinkite Atnaujinti."]
["„PivotTable“ nuo langelio dešinėje atnaujinama automatiškai.","PROJEKTO PAVADINIMAS","BENDRASIS PARTNERIS ","ĮMONĖ ","GYNYBOS ŠALIS TEISINIAME PROCESE ","INTELEKTINĖ NUOSAVYBĖ ","BANKROTAS ","ADMINISTRACIJOS DARBUOTOJAI ","BENDRASIS PARTNERIS  ","ĮMONĖ","GYNYBOS ŠALIS TEISINIAME PROCESE  ","BANKROTAS","INTELEKTINĖ NUOSAVYBĖ","ADMINISTRACIJOS DARBUOTOJAI  "]
[null,"1 projektas",{"v":7000,"d":"7,000.00 EUR"},{"v":20000,"d":"20,000.00 EUR"},{"v":0,"d":"0.00 EUR"},{"v":0,"d":"0.00 EUR"},{"v":0,"d":"0.00 EUR"},{"v":12500,"d":"12,500.00 EUR"},{"v":7700,"d":"7,700.00 EUR"},{"v":22000,"d":"22,000.00 EUR"},{"v":0,"d":"0.00 EUR"},{"v":0,"d":"0.00 EUR"},{"v":0,"d":"0.00 EUR"},{"v":13750,"d":"13,750.00 EUR"}]
{"$rows_left_out":5}