{"text_format":"3","workbook":"xlsx","n_sheets":3,"sheets":["Mokymo žurnalas","Kursų sąrašas","Darbuotojų informacija"],"not_rendered":{"defined_names":13},"read":"whole","date_system":"1900"}

{"sheet":"Mokymo žurnalas","index":0,"n_rows":23,"n_cols":9,"rows_kept":23}
[]
[]
[null,null,"MOKYMO ŽURNALAS"]
{"$rows_empty":8}
[null,null,"MOKYMO DATA","VARDAS","KURSAS","INSTRUKTORIUS","DALYVAVO","PAVYKO/NEPAVYKO","PASTABOS"]
[null,null,"2012-06-01","Audra Jasaitytė","Pagrindinė informacija darbuotojams",{"$f":"IF(tblMokymoŽurnalas[[#This Row],[KURSAS]]=\"\",\"\",IFERROR(VLOOKUP(tblMokymoŽurnalas[[#This Row],[KURSAS]],tblKursųSąrašas[],2,0),\"Not Found\"))","v":"Zigmas Ragauskas"},"Taip","Pavyko","Puikus instruktorius."]
[null,null,"2012-06-02","Arvydas Abraitis","Pagrindinė informacija darbuotojams",{"$f":"IF(tblMokymoŽurnalas[[#This Row],[KURSAS]]=\"\",\"\",IFERROR(VLOOKUP(tblMokymoŽurnalas[[#This Row],[KURSAS]],tblKursųSąrašas[],2,0),\"Not Found\"))","v":"Zigmas Ragauskas"},"Taip","Nepavyko","Turėjo anksčiau išeiti, nespėjo užbaigti."]
[null,null,"2012-06-03","Tomas Juška","Pagrindinė informacija darbuotojams",{"$f":"IF(tblMokymoŽurnalas[[#This Row],[KURSAS]]=\"\",\"\",IFERROR(VLOOKUP(tblMokymoŽurnalas[[#This Row],[KURSAS]],tblKursųSąrašas[],2,0),\"Not Found\"))","v":"Zigmas Ragauskas"},"Taip","Pavyko","Paskutinis šio ketvirčio pasiūlymas."]
[null,null,"2012-06-04","Arvydas Abraitis","Pagrindinė informacija darbuotojams",{"$f":"IF(tblMokymoŽurnalas[[#This Row],[KURSAS]]=\"\",\"\",IFERROR(VLOOKUP(tblMokymoŽurnalas[[#This Row],[KURSAS]],tblKursųSąrašas[],2,0),\"Not Found\"))","v":"Zigmas Ragauskas"},"Taip","Pavyko","Paskutinis šio ketvirčio pasiūlymas."]
[null,null,"2012-06-05","Arvydas Abraitis","Darbuotojo operacijos",{"$f":"IF(tblMokymoŽurnalas[[#This Row],[KURSAS]]=\"\",\"\",IFERROR(VLOOKUP(tblMokymoŽurnalas[[#This Row],[KURSAS]],tblKursųSąrašas[],2,0),\"Not Found\"))","v":"Marija Stankevičiūtė"},"Taip","Pavyko","Pirmas šio ketvirčio pasiūlymas"]
[null,null,"2012-06-06","Tomas Juška","Darbuotojo operacijos",{"$f":"IF(tblMokymoŽurnalas[[#This Row],[KURSAS]]=\"\",\"\",IFERROR(VLOOKUP(tblMokymoŽurnalas[[#This Row],[KURSAS]],tblKursųSąrašas[],2,0),\"Not Found\"))","v":"Marija Stankevičiūtė"},"Taip","Pavyko","Pirmas šio ketvirčio pasiūlymas"]
[null,null,"2012-06-07","Tomas Juška","Vidutinio lygio apskaita",{"$f":"IF(tblMokymoŽurnalas[[#This Row],[KURSAS]]=\"\",\"\",IFERROR(VLOOKUP(tblMokymoŽurnalas[[#This Row],[KURSAS]],tblKursųSąrašas[],2,0),\"Not Found\"))","v":"Marija Stankevičiūtė"},"Taip","Pavyko","Tik ribota auditorija."]
[null,null,"2012-06-08","Audra Jasaitytė","Darbuotojo operacijos",{"$f":"IF(tblMokymoŽurnalas[[#This Row],[KURSAS]]=\"\",\"\",IFERROR(VLOOKUP(tblMokymoŽurnalas[[#This Row],[KURSAS]],tblKursųSąrašas[],2,0),\"Not Found\"))","v":"Marija Stankevičiūtė"},"Taip","Pavyko","Pirmas šio ketvirčio pasiūlymas"]
[null,null,"2012-06-09","Audra Jasaitytė","Vidutinio lygio apskaita",{"$f":"IF(tblMokymoŽurnalas[[#This Row],[KURSAS]]=\"\",\"\",IFERROR(VLOOKUP(tblMokymoŽurnalas[[#This Row],[KURSAS]],tblKursųSąrašas[],2,0),\"Not Found\"))","v":"Marija Stankevičiūtė"},"Ne","Ateities","Dar nedalyvavo."]
[null,null,"2012-06-10","Arvydas Abraitis","Aukštesnio lygio apskaita",{"$f":"IF(tblMokymoŽurnalas[[#This Row],[KURSAS]]=\"\",\"\",IFERROR(VLOOKUP(tblMokymoŽurnalas[[#This Row],[KURSAS]],tblKursųSąrašas[],2,0),\"Not Found\"))","v":"Zigmas Ragauskas"},"Ne","Ateities","Dar nedalyvavo."]
[{"$nulls":5},{"$f":"IF(tblMokymoŽurnalas[[#This Row],[KURSAS]]=\"\",\"\",IFERROR(VLOOKUP(tblMokymoŽurnalas[[#This Row],[KURSAS]],tblKursųSąrašas[],2,0),\"Not Found\"))","v":""}]

{"sheet":"Kursų sąrašas","index":1,"n_rows":10,"n_cols":6,"rows_kept":10}
[]
[]
[null,null,"KURSŲ SĄRAŠAS"]
[]
[null,null,"PAVADINIMAS","INSTRUKTORIUS","APRAŠAS","LAIKAS"]
[null,null,"Pagrindinė informacija darbuotojams","Zigmas Ragauskas","Baziniai kursai naujiems darbuotojams. Pristatomi skyriaus tikslai ir lūkesčiai, taip pat terminai ir ribos.",2]
[null,null,"Darbuotojo operacijos","Marija Stankevičiūtė","Pagrindinės darbuotojo operacijos pagal darbuotojo instrukcijas.",1]
[null,null,"Darbuotojo operacijos","Zigmas Ragauskas","Pagrindinės apskaitos procedūros ir rekomendacijos",1.5]
[null,null,"Vidutinio lygio apskaita","Marija Stankevičiūtė","Vidutinio lygio apskaitos procedūros ir rekomendacijos",2]
[null,null,"Aukštesnio lygio apskaita","Zigmas Ragauskas","Sudėtingesnės apskaitos procedūros ir rekomendacijos",2]

{"sheet":"Darbuotojų informacija","index":2,"n_rows":9,"n_cols":5,"rows_kept":9}
[]
[]
[null,null,"DARBUOTOJŲ INFORMACIJA"]
[]
[null,null,"VARDAS","SKYRIUS","PAVADINIMAS"]
[null,null,"Audra Jasaitytė","Pardavimas","Vyr. buhalteris"]
[null,null,"Arvydas Abraitis","Apskaita","Buhalteris"]
[null,null,"Tomas Juška","Apskaita","Buhalteris"]
[null,null,"Ligita Žukauskienė","Apskaita","Buhalteris"]