{"text_format":"3","workbook":"xlsx","n_sheets":4,"sheets":["Finansinė ataskaita","Finansinių duomenų įvestis","Pagrindinės metrikos parametrai","Skaičiavimai"],"not_rendered":{"defined_names":5},"read":"whole","date_system":"1900"}

{"sheet":"Finansinė ataskaita","index":0,"n_rows":40,"n_cols":14,"rows_kept":40,"merged":[[1,10,1,11],[6,9,6,11],[7,9,7,11],[8,9,8,11],[9,9,9,11],[12,3,12,7],[14,8,14,11],[15,8,15,11],[16,8,16,11],[17,8,17,11],[18,8,18,11],[19,8,19,11],[20,8,20,11],[21,8,21,11],[22,8,22,11],[23,8,23,11],[24,8,24,11],[25,8,25,11],[26,8,26,11],[27,8,27,11],[28,8,28,11],[29,8,29,11],[30,8,30,11],[31,8,31,11],[32,8,32,11],[33,8,33,11],[34,8,34,11],[35,8,35,11],[36,8,36,11],[37,8,37,11],[38,8,38,11],[39,8,39,11]]}
[]
[null,"METINĖ FINANSINĖ ATASKAITA",{"$nulls":8},2016,null,null,"Langelyje L2 pasirinkite ataskaitos metus"]
[null,"ĮMONĖS PAVADINIMAS",{"$nulls":11},"Norėdami redaguoti duomenis, pasirinkite finansinių duomenų įvesties lapą"]
[]
[null,"PAGRINDINĖ METRIKA",null,"Spustelėkite, norėdami pakeisti ataskaitos pagrindinę metriką"]
[]
[null,{"$f":"Skaičiavimai!B8","v":"PAJAMOS"},null,{"$f":"Skaičiavimai!B9","v":"GRYNASIS PELNAS"},null,{"$f":"Skaičiavimai!B10","v":"PALŪKANOS"},null,{"$f":"Skaičiavimai!B11","v":"NUSIDĖVĖJIMAS"},null,{"$f":"Skaičiavimai!B12","v":"VEIKLOS SĄNAUDOS"}]
[null,{"$f":"IFERROR(Skaičiavimai!G8,\"\")","v":{"v":361167.76,"d":"361,168 €"}},null,{"$f":"IFERROR(Skaičiavimai!G9,\"\")","v":{"v":134949.7,"d":"134,950 €"}},null,{"$f":"IFERROR(Skaičiavimai!G10,\"\")","v":{"v":7578.94,"d":"7,579 €"}},null,{"$f":"IFERROR(Skaičiavimai!G11,\"\")","v":{"v":11093.76,"d":"11,094 €"}},null,{"$f":"IFERROR(Skaičiavimai!G12,\"\")","v":{"v":146851.98,"d":"146,852 €"}}]
[null,{"$f":"Skaičiavimai!H8","v":{"v":3.0953753897409175E-3,"d":"0%"}},null,{"$f":"Skaičiavimai!H9","v":{"v":0.018148662861143583,"d":"2%"}},null,{"$f":"Skaičiavimai!H10","v":{"v":0.1351496270556869,"d":"14%"}},null,{"$f":"Skaičiavimai!H11","v":{"v":0.09440022728976682,"d":"9%"}},null,{"$f":"Skaičiavimai!H12","v":{"v":-0.05033560822904626,"d":"-5%"}}]
[]
[]
[]
[null,"VISOS METRIKOS",null,"Nekeiskite toliau pateiktos informacijos. Spustelėkite, norėdami įvesti finansinius duomenis"]
[]
[null,"METRIKA",null,{"$f":"\"ATASKAITOS METAI (\"&SelectedYear&\")\"","v":"ATASKAITOS METAI (2016)"},null,{"$f":"\"PRAĖJĘ METAI (\"&SelectedYear-1&\")\"","v":"PRAĖJĘ METAI (2015)"},null,"% KEISTI",{"$f":"CONCATENATE(Metai,\" METŲ TENDENCIJOS\")","v":"5 METŲ TENDENCIJOS"}]
[null,{"$f":"Skaičiavimai!B15","v":"PAJAMOS"},null,{"$f":"IF($B16=\"\",\"\",Skaičiavimai!G15)","v":{"v":361167.76,"d":"361,167.76 €"}},null,{"$f":"IF($B16=\"\",\"\",Skaičiavimai!F15)","v":{"v":360053.26,"d":"360,053.26 €"}},null,{"$f":"IFERROR(D16/F16-1,\"\")","v":{"v":3.0953753897409175E-3,"d":"0%"}}]
[null,{"$f":"Skaičiavimai!B16","v":"NAUDOJIMO IŠLAIDOS"},null,{"$f":"IF($B17=\"\",\"\",Skaičiavimai!G16)","v":{"v":188838.9,"d":"188,838.90 €"}},null,{"$f":"IF($B17=\"\",\"\",Skaičiavimai!F16)","v":{"v":161766.66,"d":"161,766.66 €"}},null,{"v":0.16735364382252804,"d":"17%"}]
[null,{"$f":"Skaičiavimai!B17","v":"VEIKLOS SĄNAUDOS"},null,{"$f":"IF($B18=\"\",\"\",Skaičiavimai!G17)","v":{"v":146851.98,"d":"146,851.98 €"}},null,{"$f":"IF($B18=\"\",\"\",Skaičiavimai!F17)","v":{"v":154635.66,"d":"154,635.66 €"}},null,{"v":-0.05033560822904626,"d":"-5%"}]
[null,{"$f":"Skaičiavimai!B18","v":"NUSIDĖVĖJIMAS"},null,{"$f":"IF($B19=\"\",\"\",Skaičiavimai!G18)","v":{"v":11093.76,"d":"11,093.76 €"}},null,{"$f":"IF($B19=\"\",\"\",Skaičiavimai!F18)","v":{"v":10136.84,"d":"10,136.84 €"}},null,{"v":0.09440022728976682,"d":"9%"}]
[null,{"$f":"Skaičiavimai!B19","v":"PALŪKANOS"},null,{"$f":"IF($B20=\"\",\"\",Skaičiavimai!G19)","v":{"v":7578.94,"d":"7,578.94 €"}},null,{"$f":"IF($B20=\"\",\"\",Skaičiavimai!F19)","v":{"v":6676.6,"d":"6,676.60 €"}},null,{"v":0.1351496270556869,"d":"14%"}]
{"$rows_left_out":21}
{"sheet":"Finansinių duomenų įvestis","index":1,"n_rows":19,"n_cols":9,"rows_kept":19}
[]
[null,"ĮVESKITE FINANSINIUS DUOMENIS"]
[null," GALITE NURODYTI IKI 25 PAGRINIDNIŲ METRIKŲ 7 METAMS"]
[null," Spustelėkite norėdami peržiūrėti finansinę ataskaitą"]
[null,"METRIKOS PAVADINIMAS",2010,2011,2012,2013,2014,2015,2016]
[null,"PAJAMOS",{"v":250000,"d":"250,000.00 €"},{"v":268274.9,"d":"268,274.90 €"},{"v":285456.76,"d":"285,456.76 €"},{"v":301374.92,"d":"301,374.92 €"},{"v":330089.12,"d":"330,089.12 €"},{"v":360053.26,"d":"360,053.26 €"},{"v":361167.76,"d":"361,167.76 €"}]
[null,"NAUDOJIMO IŠLAIDOS",{"v":130000,"d":"130,000.00 €"},{"v":141924.62,"d":"141,924.62 €"},{"v":151849.72,"d":"151,849.72 €"},{"v":157802.54,"d":"157,802.54 €"},{"v":163348.74,"d":"163,348.74 €"},{"v":161766.66,"d":"161,766.66 €"},{"v":188838.9,"d":"188,838.90 €"}]
[null,"VEIKLOS SĄNAUDOS",{"v":120000,"d":"120,000.00 €"},{"v":128414.6,"d":"128,414.60 €"},{"v":137715.38,"d":"137,715.38 €"},{"v":151286.5,"d":"151,286.50 €"},{"v":153510.52,"d":"153,510.52 €"},{"v":154635.66,"d":"154,635.66 €"},{"v":146851.98,"d":"146,851.98 €"}]
[null,"NUSIDĖVĖJIMAS",{"v":9000,"d":"9,000.00 €"},{"v":9035.54,"d":"9,035.54 €"},{"v":9313.84,"d":"9,313.84 €"},{"v":9948.42,"d":"9,948.42 €"},{"v":10048.22,"d":"10,048.22 €"},{"v":10136.84,"d":"10,136.84 €"},{"v":11093.76,"d":"11,093.76 €"}]
[null,"PALŪKANOS",{"v":5000,"d":"5,000.00 €"},{"v":5491.64,"d":"5,491.64 €"},{"v":5786.22,"d":"5,786.22 €"},{"v":6272.24,"d":"6,272.24 €"},{"v":6297.06,"d":"6,297.06 €"},{"v":6676.6,"d":"6,676.60 €"},{"v":7578.94,"d":"7,578.94 €"}]
[null,"GRYNASIS PELNAS",{"v":108000,"d":"108,000.00 €"},{"v":109522.15,"d":"109,522.15 €"},{"v":111721.62,"d":"111,721.62 €"},{"v":119495.9,"d":"119,495.90 €"},{"v":122967.18,"d":"122,967.18 €"},{"v":132544.2,"d":"132,544.20 €"},{"v":134949.7,"d":"134,949.70 €"}]
[null,"MOKESČIAI",{"v":44000,"d":"44,000.00 €"},{"v":47841.08,"d":"47,841.08 €"},{"v":51153.48,"d":"51,153.48 €"},{"v":54997.72,"d":"54,997.72 €"},{"v":56671.34,"d":"56,671.34 €"},{"v":58849.06,"d":"58,849.06 €"},{"v":62816.5,"d":"62,816.50 €"}]
[null,"PELNAS PO MOKESČIŲ",{"v":64000,"d":"64,000.00 €"},{"v":69886.98,"d":"69,886.98 €"},{"v":76837.06,"d":"76,837.06 €"},{"v":79790.1,"d":"79,790.10 €"},{"v":81215.46,"d":"81,215.46 €"},{"v":84876.4,"d":"84,876.40 €"},{"v":100495.36,"d":"100,495.36 €"}]
[null,"1 METRIKA",{"v":25.6,"d":"25.60 €"},{"v":25.62,"d":"25.62 €"},{"v":27.56,"d":"27.56 €"},{"v":28.58,"d":"28.58 €"},{"v":31.14,"d":"31.14 €"},{"v":33.56,"d":"33.56 €"},{"v":39.92,"d":"39.92 €"}]
[null,"2 METRIKA",{"v":36.4,"d":"36.40 €"},{"v":37.18,"d":"37.18 €"},{"v":38.44,"d":"38.44 €"},{"v":40.34,"d":"40.34 €"},{"v":40.96,"d":"40.96 €"},{"v":43.68,"d":"43.68 €"},{"v":52.02,"d":"52.02 €"}]
[null,"3 METRIKA",{"v":38.2,"d":"38.20 €"},{"v":41.1,"d":"41.10 €"},{"v":43.74,"d":"43.74 €"},{"v":46.38,"d":"46.38 €"},{"v":49.34,"d":"49.34 €"},{"v":52.78,"d":"52.78 €"},{"v":62.16,"d":"62.16 €"}]
[null,"4 METRIKA",{"v":24.2,"d":"24.20 €"},{"v":24.42,"d":"24.42 €"},{"v":25.18,"d":"25.18 €"},{"v":27.4,"d":"27.40 €"},{"v":27.52,"d":"27.52 €"},{"v":29.18,"d":"29.18 €"},{"v":29.84,"d":"29.84 €"}]
[null,"5 METRIKA",{"v":1.5,"d":"1.50 €"},{"v":1.58,"d":"1.58 €"},{"v":1.7,"d":"1.70 €"},{"v":1.78,"d":"1.78 €"},{"v":1.82,"d":"1.82 €"},{"v":2,"d":"2.00 €"},{"v":2.06,"d":"2.06 €"}]
[null,"6 METRIKA",{"v":0.46,"d":"0.46 €"},{"v":0.5,"d":"0.50 €"},{"v":0.54,"d":"0.54 €"},{"v":0.56,"d":"0.56 €"},{"v":0.58,"d":"0.58 €"},{"v":0.6,"d":"0.60 €"},{"v":0.68,"d":"0.68 €"}]

{"sheet":"Pagrindinės metrikos parametrai","index":2,"n_rows":9,"n_cols":5,"rows_kept":9,"merged":[[3,1,3,3]]}
[]
[null,"ČIA APIBRĖŽKITE PAGRINDINĘ METRIKĄ"]
[null," PASIRINKITE IKI 5 PAGRINIDNIŲ METRIKŲ, KURIOS BUS RODOMOS ATASKAITOS VIRŠUJE"]
[null,"  Spustelėkite norėdami peržiūrėti finansinę ataskaitą"]
[null,1,"PAJAMOS",null,{"$f":"IF(ISBLANK(C5),\"← Pasirinkite reikšmę iš išskleidžiamojo sąrašo\",IF(COUNTIF($C$5:C5,C5)>1,\"Reikšmę \"&C5&\" pasirinkote keliskart.\",\"\"))","v":""}]
[null,2,"GRYNASIS PELNAS",null,{"$f":"IF(ISBLANK(C6),\"← Pasirinkite reikšmę iš išskleidžiamojo sąrašo\",IF(COUNTIF($C$5:C6,C6)>1,\"Reikšmę \"&C6&\" pasirinkote keliskart.\",\"\"))","v":""}]
[null,3,"PALŪKANOS",null,{"$f":"IF(ISBLANK(C7),\"← Pasirinkite reikšmę iš išskleidžiamojo sąrašo\",IF(COUNTIF($C$5:C7,C7)>1,\"Reikšmę \"&C7&\" pasirinkote keliskart.\",\"\"))","v":""}]
[null,4,"NUSIDĖVĖJIMAS",null,{"$f":"IF(ISBLANK(C8),\"← Pasirinkite reikšmę iš išskleidžiamojo sąrašo\",IF(COUNTIF($C$5:C8,C8)>1,\"Reikšmę \"&C8&\" pasirinkote keliskart.\",\"\"))","v":""}]
[null,5,"VEIKLOS SĄNAUDOS",null,{"$f":"IF(ISBLANK(C9),\"← Pasirinkite reikšmę iš išskleidžiamojo sąrašo\",IF(COUNTIF($C$5:C9,C9)>1,\"Reikšmę \"&C9&\" pasirinkote keliskart.\",\"\"))","v":""}]

{"sheet":"Skaičiavimai","index":3,"n_rows":39,"n_cols":9,"rows_kept":39,"hidden":true}
["Šis darbalapis naudojamas finansinių ataskaitų skaičiavimams ir turėtų likti paslėptas."]
[{"$nulls":3},"Padėtis"]
[null,"Šie metai",{"$f":"SelectedYear","v":2016},{"$f":"MATCH(C3,lstMetai,0)+1","v":8}]
[null,"Praėję metai",{"$f":"C3-1","v":2015},{"$f":"MATCH(C4,lstMetai,0)+1","v":7}]
[]
[null,"Padėtis",{"$f":"MATCH(C7,lstMetai,0)+1","v":4},{"$f":"MATCH(D7,lstMetai,0)+1","v":5},{"$f":"MATCH(E7,lstMetai,0)+1","v":6},{"$f":"MATCH(F7,lstMetai,0)+1","v":7},{"$f":"MATCH(G7,lstMetai,0)+1","v":8},null,{"$f":"COUNT(C6:G6)","v":5}]
[null,"Pagrindinė metrika",{"$f":"D7-1","v":2012},{"$f":"E7-1","v":2013},{"$f":"F7-1","v":2014},{"$f":"G7-1","v":2015},{"$f":"C3","v":2016}]
[{"$f":"MATCH(B8,'Finansinių duomenų įvestis'!$B$6:$B$30,0)","v":1},{"$f":"IF('Pagrindinės metrikos parametrai'!C5=\"\",\"\",'Pagrindinės metrikos parametrai'!C5)","v":"PAJAMOS"},{"$f":"IFERROR(INDEX('Finansinių duomenų įvestis'!$B$6:$I$30,$A8,C$6),NA())","v":285456.76},{"$f":"IFERROR(INDEX('Finansinių duomenų įvestis'!$B$6:$I$30,$A8,D$6),NA())","v":301374.92},{"$f":"IFERROR(INDEX('Finansinių duomenų įvestis'!$B$6:$I$30,$A8,E$6),NA())","v":330089.12},{"$f":"IFERROR(INDEX('Finansinių duomenų įvestis'!$B$6:$I$30,$A8,F$6),NA())","v":360053.26},{"$f":"IFERROR(INDEX('Finansinių duomenų įvestis'!$B$6:$I$30,$A8,G$6),NA())","v":361167.76},{"$f":"IFERROR(G8/F8-1,\"\")","v":{"v":3.0953753897409175E-3,"d":"0%"}}]
[{"$f":"MATCH(B9,'Finansinių duomenų įvestis'!$B$6:$B$30,0)","v":6},{"$f":"IF('Pagrindinės metrikos parametrai'!C6=\"\",\"\",'Pagrindinės metrikos parametrai'!C6)","v":"GRYNASIS PELNAS"},{"$f":"IFERROR(INDEX('Finansinių duomenų įvestis'!$B$6:$I$30,$A9,C$6),NA())","v":111721.62},{"$f":"IFERROR(INDEX('Finansinių duomenų įvestis'!$B$6:$I$30,$A9,D$6),NA())","v":119495.9},{"$f":"IFERROR(INDEX('Finansinių duomenų įvestis'!$B$6:$I$30,$A9,E$6),NA())","v":122967.18},{"$f":"IFERROR(INDEX('Finansinių duomenų įvestis'!$B$6:$I$30,$A9,F$6),NA())","v":132544.2},{"$f":"IFERROR(INDEX('Finansinių duomenų įvestis'!$B$6:$I$30,$A9,G$6),NA())","v":134949.7},{"$f":"IFERROR(G9/F9-1,\"\")","v":{"v":0.018148662861143583,"d":"2%"}}]
[{"$f":"MATCH(B10,'Finansinių duomenų įvestis'!$B$6:$B$30,0)","v":5},{"$f":"IF('Pagrindinės metrikos parametrai'!C7=\"\",\"\",'Pagrindinės metrikos parametrai'!C7)","v":"PALŪKANOS"},{"$f":"IFERROR(INDEX('Finansinių duomenų įvestis'!$B$6:$I$30,$A10,C$6),NA())","v":5786.22},{"$f":"IFERROR(INDEX('Finansinių duomenų įvestis'!$B$6:$I$30,$A10,D$6),NA())","v":6272.24},{"$f":"IFERROR(INDEX('Finansinių duomenų įvestis'!$B$6:$I$30,$A10,E$6),NA())","v":6297.06},{"$f":"IFERROR(INDEX('Finansinių duomenų įvestis'!$B$6:$I$30,$A10,F$6),NA())","v":6676.6},{"$f":"IFERROR(INDEX('Finansinių duomenų įvestis'!$B$6:$I$30,$A10,G$6),NA())","v":7578.94},{"v":0.1351496270556869,"d":"14%"}]
[{"$f":"MATCH(B11,'Finansinių duomenų įvestis'!$B$6:$B$30,0)","v":4},{"$f":"IF('Pagrindinės metrikos parametrai'!C8=\"\",\"\",'Pagrindinės metrikos parametrai'!C8)","v":"NUSIDĖVĖJIMAS"},{"$f":"IFERROR(INDEX('Finansinių duomenų įvestis'!$B$6:$I$30,$A11,C$6),NA())","v":9313.84},{"$f":"IFERROR(INDEX('Finansinių duomenų įvestis'!$B$6:$I$30,$A11,D$6),NA())","v":9948.42},{"$f":"IFERROR(INDEX('Finansinių duomenų įvestis'!$B$6:$I$30,$A11,E$6),NA())","v":10048.22},{"$f":"IFERROR(INDEX('Finansinių duomenų įvestis'!$B$6:$I$30,$A11,F$6),NA())","v":10136.84},{"$f":"IFERROR(INDEX('Finansinių duomenų įvestis'!$B$6:$I$30,$A11,G$6),NA())","v":11093.76},{"v":0.09440022728976682,"d":"9%"}]
[{"$f":"MATCH(B12,'Finansinių duomenų įvestis'!$B$6:$B$30,0)","v":3},{"$f":"IF('Pagrindinės metrikos parametrai'!C9=\"\",\"\",'Pagrindinės metrikos parametrai'!C9)","v":"VEIKLOS SĄNAUDOS"},{"$f":"IFERROR(INDEX('Finansinių duomenų įvestis'!$B$6:$I$30,$A12,C$6),NA())","v":137715.38},{"$f":"IFERROR(INDEX('Finansinių duomenų įvestis'!$B$6:$I$30,$A12,D$6),NA())","v":151286.5},{"$f":"IFERROR(INDEX('Finansinių duomenų įvestis'!$B$6:$I$30,$A12,E$6),NA())","v":153510.52},{"$f":"IFERROR(INDEX('Finansinių duomenų įvestis'!$B$6:$I$30,$A12,F$6),NA())","v":154635.66},{"$f":"IFERROR(INDEX('Finansinių duomenų įvestis'!$B$6:$I$30,$A12,G$6),NA())","v":146851.98},{"v":-0.05033560822904626,"d":"-5%"}]
[]
[null,"Visa metrika (gali būti iki 25 metrikų)"]
[{"$f":"ROWS($B$15:B15)","v":1},{"$f":"IF('Finansinių duomenų įvestis'!B6=0,\"\",'Finansinių duomenų įvestis'!B6)","v":"PAJAMOS"},{"$f":"IF($B15=\"\",NA(),IFERROR(INDEX('Finansinių duomenų įvestis'!$B$6:$I$30,$A15,C$6),NA()))","v":285456.76},{"$f":"IF($B15=\"\",NA(),IFERROR(INDEX('Finansinių duomenų įvestis'!$B$6:$I$30,$A15,D$6),NA()))","v":301374.92},{"$f":"IF($B15=\"\",NA(),IFERROR(INDEX('Finansinių duomenų įvestis'!$B$6:$I$30,$A15,E$6),NA()))","v":330089.12},{"$f":"IF($B15=\"\",NA(),IFERROR(INDEX('Finansinių duomenų įvestis'!$B$6:$I$30,$A15,F$6),NA()))","v":360053.26},{"$f":"IF($B15=\"\",NA(),IFERROR(INDEX('Finansinių duomenų įvestis'!$B$6:$I$30,$A15,G$6),NA()))","v":361167.76}]
[{"$f":"ROWS($B$15:B16)","v":2},{"$f":"IF('Finansinių duomenų įvestis'!B7=0,\"\",'Finansinių duomenų įvestis'!B7)","v":"NAUDOJIMO IŠLAIDOS"},{"$f":"IF($B16=\"\",NA(),IFERROR(INDEX('Finansinių duomenų įvestis'!$B$6:$I$30,$A16,C$6),NA()))","v":151849.72},{"$f":"IF($B16=\"\",NA(),IFERROR(INDEX('Finansinių duomenų įvestis'!$B$6:$I$30,$A16,D$6),NA()))","v":157802.54},{"$f":"IF($B16=\"\",NA(),IFERROR(INDEX('Finansinių duomenų įvestis'!$B$6:$I$30,$A16,E$6),NA()))","v":163348.74},{"$f":"IF($B16=\"\",NA(),IFERROR(INDEX('Finansinių duomenų įvestis'!$B$6:$I$30,$A16,F$6),NA()))","v":161766.66},{"$f":"IF($B16=\"\",NA(),IFERROR(INDEX('Finansinių duomenų įvestis'!$B$6:$I$30,$A16,G$6),NA()))","v":188838.9}]
[{"$f":"ROWS($B$15:B17)","v":3},{"$f":"IF('Finansinių duomenų įvestis'!B8=0,\"\",'Finansinių duomenų įvestis'!B8)","v":"VEIKLOS SĄNAUDOS"},{"$f":"IF($B17=\"\",NA(),IFERROR(INDEX('Finansinių duomenų įvestis'!$B$6:$I$30,$A17,C$6),NA()))","v":137715.38},{"$f":"IF($B17=\"\",NA(),IFERROR(INDEX('Finansinių duomenų įvestis'!$B$6:$I$30,$A17,D$6),NA()))","v":151286.5},{"$f":"IF($B17=\"\",NA(),IFERROR(INDEX('Finansinių duomenų įvestis'!$B$6:$I$30,$A17,E$6),NA()))","v":153510.52},{"$f":"IF($B17=\"\",NA(),IFERROR(INDEX('Finansinių duomenų įvestis'!$B$6:$I$30,$A17,F$6),NA()))","v":154635.66},{"$f":"IF($B17=\"\",NA(),IFERROR(INDEX('Finansinių duomenų įvestis'!$B$6:$I$30,$A17,G$6),NA()))","v":146851.98}]
[{"$f":"ROWS($B$15:B18)","v":4},{"$f":"IF('Finansinių duomenų įvestis'!B9=0,\"\",'Finansinių duomenų įvestis'!B9)","v":"NUSIDĖVĖJIMAS"},{"$f":"IF($B18=\"\",NA(),IFERROR(INDEX('Finansinių duomenų įvestis'!$B$6:$I$30,$A18,C$6),NA()))","v":9313.84},{"$f":"IF($B18=\"\",NA(),IFERROR(INDEX('Finansinių duomenų įvestis'!$B$6:$I$30,$A18,D$6),NA()))","v":9948.42},{"$f":"IF($B18=\"\",NA(),IFERROR(INDEX('Finansinių duomenų įvestis'!$B$6:$I$30,$A18,E$6),NA()))","v":10048.22},{"$f":"IF($B18=\"\",NA(),IFERROR(INDEX('Finansinių duomenų įvestis'!$B$6:$I$30,$A18,F$6),NA()))","v":10136.84},{"$f":"IF($B18=\"\",NA(),IFERROR(INDEX('Finansinių duomenų įvestis'!$B$6:$I$30,$A18,G$6),NA()))","v":11093.76}]
[{"$f":"ROWS($B$15:B19)","v":5},{"$f":"IF('Finansinių duomenų įvestis'!B10=0,\"\",'Finansinių duomenų įvestis'!B10)","v":"PALŪKANOS"},{"$f":"IF($B19=\"\",NA(),IFERROR(INDEX('Finansinių duomenų įvestis'!$B$6:$I$30,$A19,C$6),NA()))","v":5786.22},{"$f":"IF($B19=\"\",NA(),IFERROR(INDEX('Finansinių duomenų įvestis'!$B$6:$I$30,$A19,D$6),NA()))","v":6272.24},{"$f":"IF($B19=\"\",NA(),IFERROR(INDEX('Finansinių duomenų įvestis'!$B$6:$I$30,$A19,E$6),NA()))","v":6297.06},{"$f":"IF($B19=\"\",NA(),IFERROR(INDEX('Finansinių duomenų įvestis'!$B$6:$I$30,$A19,F$6),NA()))","v":6676.6},{"$f":"IF($B19=\"\",NA(),IFERROR(INDEX('Finansinių duomenų įvestis'!$B$6:$I$30,$A19,G$6),NA()))","v":7578.94}]
[{"$f":"ROWS($B$15:B20)","v":6},{"$f":"IF('Finansinių duomenų įvestis'!B11=0,\"\",'Finansinių duomenų įvestis'!B11)","v":"GRYNASIS PELNAS"},{"$f":"IF($B20=\"\",NA(),IFERROR(INDEX('Finansinių duomenų įvestis'!$B$6:$I$30,$A20,C$6),NA()))","v":111721.62},{"$f":"IF($B20=\"\",NA(),IFERROR(INDEX('Finansinių duomenų įvestis'!$B$6:$I$30,$A20,D$6),NA()))","v":119495.9},{"$f":"IF($B20=\"\",NA(),IFERROR(INDEX('Finansinių duomenų įvestis'!$B$6:$I$30,$A20,E$6),NA()))","v":122967.18},{"$f":"IF($B20=\"\",NA(),IFERROR(INDEX('Finansinių duomenų įvestis'!$B$6:$I$30,$A20,F$6),NA()))","v":132544.2},{"$f":"IF($B20=\"\",NA(),IFERROR(INDEX('Finansinių duomenų įvestis'!$B$6:$I$30,$A20,G$6),NA()))","v":134949.7}]
{"$rows_left_out":19}