{"text_format":"3","workbook":"xlsx","n_sheets":4,"sheets":["시작","프로젝트 매개 변수","프로젝트 세부 정보","프로젝트 총계"],"not_rendered":{"charts":2,"defined_names":3,"pivot_tables":1},"read":"whole","date_system":"1900"}

{"sheet":"시작","index":0,"n_rows":8,"n_cols":2,"rows_kept":8}
[null,"이 템플릿 정보"]
[]
[null,"이 통합 문서를 이용해 법률회사를 위한 프로젝트를 계획하는 동안 프로젝트 매개 변수, 프로젝트 세부 정보 및 프로젝트 총계를 추적합니다."]
[null,"프로젝트 매개 변수 워크시트에 회사 이름을 입력하면 다른 워크시트에서 자동으로 업데이트됩니다."]
[null,"세로 막대형 차트를 업데이트 하려면 프로젝트 매개 변수 워크시트에 정보를 입력하고 프로젝트 세부 정보 워크시트에도 정보를 입력합니다. 프로젝트 총계 워크시트에서 피벗 테이블은 자동으로 업데이트됩니다."]
[null,"참고:  "]
[null,"추가적인 지침은 각 워크시트의 A열에 있습니다. 이 텍스트는 일부러 숨겨 놓았습니다. 텍스트를 제거하려면 A열을 선택한 다음 [삭제]를 선택합니다. 텍스트를 표시하려면 A열을 선택한 다음 글꼴 색상을 변경합니다."]
[null,"워크시트에 있는 표에 대해 자세히 알아보려면 표 안에서 SHIFT 키를 누른 채 F10 키를 누르고 [표] 옵션을 선택한 다음, [대체 텍스트]를 선택합니다. 프로젝트 종합 워크시트 안의 피벗테이블의 경우 표 안에서 SHIFT 키를 누른 다음 F10 키를 누르고, 피벗 테이블 옵션을 선택한 다음, 대체 텍스트 탭을 선택합니다."]

{"sheet":"프로젝트 매개 변수","index":1,"n_rows":19,"n_cols":9,"rows_kept":19}
["이 워크시트에서 프로젝트 매개 변수를 만듭니다. 오른쪽 셀에 회사 이름을 입력합니다. 이 열의 몇몇 셀에서 유용한 지침을 확인할 수 있습니다.","회사 이름"]
["오른쪽 셀에 이 워크시트의 제목이 표시됩니다.","법률회사를 위한 프로젝트 계획"]
["기밀 메시지는 오른쪽 셀에 있습니다.",{"$f":"B1&\" 기밀\"","v":"회사 이름 기밀"}]
["오른쪽 셀에 팁이 표시됩니다.","음영 처리된 셀은 자동으로 계산됩니다. 회식 셀에는 데이터를 입력할 필요가 없습니다."]
["오른쪽 셀에서 시작하는 매개 변수 표에 세부 정보를 입력합니다. 다음 지침은 A12 셀에 있습니다.","프로젝트 유형","일반 파트너","비즈니스 변호사","피고측 법률 관계자","지적 재산권 변호사","파산 변호사","관리 인력","합계"]
[null,"회사 통합",{"v":0.1,"d":"10%"},{"v":0.4,"d":"40%"},{"v":0,"d":"0%"},{"v":0,"d":"0%"},{"v":0,"d":"0%"},{"v":0.5,"d":"50%"},{"$f":"SUM(매개_변수[[#This Row],[일반 파트너]:[관리 인력]])","v":{"v":1,"d":"100%"}}]
[null,"회사 인수",{"v":0.1,"d":"10%"},{"v":0.4,"d":"40%"},{"v":0,"d":"0%"},{"v":0.1,"d":"10%"},{"v":0,"d":"0%"},{"v":0.4,"d":"40%"},{"$f":"SUM(매개_변수[[#This Row],[일반 파트너]:[관리 인력]])","v":{"v":1,"d":"100%"}}]
[null,"제품 책임 방어",{"v":0.2,"d":"20%"},{"v":0,"d":"0%"},{"v":0.5,"d":"50%"},{"v":0,"d":"0%"},{"v":0,"d":"0%"},{"v":0.3,"d":"30%"},{"$f":"SUM(매개_변수[[#This Row],[일반 파트너]:[관리 인력]])","v":{"v":1,"d":"100%"}}]
[null,"특허 응용",{"v":0.1,"d":"10%"},{"v":0,"d":"0%"},{"v":0,"d":"0%"},{"v":0.6,"d":"60%"},{"v":0,"d":"0%"},{"v":0.3,"d":"30%"},{"$f":"SUM(매개_변수[[#This Row],[일반 파트너]:[관리 인력]])","v":{"v":1,"d":"100%"}}]
[null,"직원 소송",{"v":0.2,"d":"20%"},{"v":0.1,"d":"10%"},{"v":0.4,"d":"40%"},{"v":0,"d":"0%"},{"v":0,"d":"0%"},{"v":0.3,"d":"30%"},{"$f":"SUM(매개_변수[[#This Row],[일반 파트너]:[관리 인력]])","v":{"v":1,"d":"100%"}}]
[null,"파산",{"v":0.1,"d":"10%"},{"v":0.2,"d":"20%"},{"v":0,"d":"0%"},{"v":0,"d":"0%"},{"v":0.4,"d":"40%"},{"v":0.3,"d":"30%"},{"$f":"SUM(매개_변수[[#This Row],[일반 파트너]:[관리 인력]])","v":{"v":1,"d":"100%"}}]
["셀 C12부터 H12까지 오른쪽에 있는 셀에 혼합 비율을 입력합니다. 다음 지침은 A14 셀에 있습니다.","혼합 비율",{"v":350,"d":"₩350"},{"v":250,"d":"₩250"},{"v":300,"d":"₩300"},{"v":275,"d":"₩275"},{"v":225,"d":"₩225"},{"v":125,"d":"₩125"}]
[]
["계획 대비 실제 비용을 보여주는 세로 막대형 차트는 오른쪽 셀에 표시되고, 계획 대비 실제 시간을 보여주는 세로 막대형 차트는 F14 셀에 있습니다."]
[null,null,"일반 파트너","비즈니스","피고측 법률 관계자","지적 재산권","파산","관리 인력"]
{"$rows_left_out":5}
{"sheet":"프로젝트 세부 정보","index":2,"n_rows":10,"n_cols":25,"rows_kept":10,"merged":[[1,24,8,28]]}
["이 워크시트에 프로젝트 세부 정보를 만듭니다. 오른쪽 셀에 회사 이름이 자동으로 업데이트됩니다. 이 열의 몇몇 셀에서 유용한 지침을 확인할 수 있습니다. 아래쪽 화살표를 사용하여 시작할 수 있습니다.",{"$f":"'프로젝트 매개 변수'!B1","v":"회사 이름"}]
["이 워크시트 제목은 오른쪽 셀에 나타나며 정보 팁은 Y2 셀에 표시됩니다.",{"$f":"'프로젝트 매개 변수'!B2","v":"법률회사를 위한 프로젝트 계획"},{"$nulls":22},"정보:\n행을 추가하려면 표 안의 가장 오른쪽 아래 셀(합계 행 아님)을 선택하고 행을 삽입하고 싶은 위치에서 Tab 키를 누르거나 SHIFT와 F10을 차례로 누르고 삽입 | 위쪽에 / 아래쪽에 표 행 삽입.\n프로젝트 총계 피벗테이블이 표의 모든 셀을 사용할 것이므로 사용하지 않는 행은 모두 지우십시오. 그렇지 않으면 오류 있는 결과가 발생할 수 있습니다."]
["기밀 메시지는 오른쪽 셀에 있습니다.",{"$f":"'프로젝트 매개 변수'!B3","v":"회사 이름 기밀"}]
["오른쪽 셀에서 시작되는 세부 정보 테이블에 정보를 입력 합니다. 오른쪽의 세부 정보 표 안의 프로젝트 유형은 프로젝트 매개 변수 워크시트의 매개 변수 표를 토대로 자동으로 업데이트됩니다.","프로젝트 이름","프로젝트 유형","예상 시작","예상 완료","실제 시작","실제 완료","예상 작업","실제 작업","예상 기간","실제 기간","일반 파트너","비즈니스 변호사","피고측 법률 관계자","지적 재산권 변호사","파산 변호사","관리 인력","일반 파트너 2","비즈니스 변호사 2","피고측 법률 관계자 2","지적 재산권 변호사 2","파산 변호사 2","관리 인력 2"]
[null,"프로젝트 1","회사 통합",{"$f":"TODAY()","v":"2019-02-18"},{"$f":"TODAY()+60","v":"2019-04-19"},{"$f":"TODAY()+10","v":"2019-02-28"},{"$f":"TODAY()+65","v":"2019-04-24"},200,220,{"$f":"DAYS360(세부_정보[[#This Row],[예상 시작]],세부_정보[[#This Row],[예상 완료]],FALSE)","v":61},{"$f":"DAYS360(세부_정보[[#This Row],[실제 시작]],세부_정보[[#This Row],[실제 완료]],FALSE)","v":54},{"$f":"INDEX(매개_변수[],MATCH(세부_정보[[#This Row],[프로젝트 유형]],매개_변수[프로젝트 유형],0),MATCH(세부_정보[[#Headers],[일반 파트너]],매개_변수[#Headers],0))*INDEX('프로젝트 매개 변수'!$B$12:$H$12,1,MATCH(세부_정보[[#Headers],[일반 파트너]],매개_변수[#Headers],0))*세부_정보[[#This Row],[예상 작업]]","v":{"v":7000,"d":"₩7,000"}},{"$f":"INDEX(매개_변수[],MATCH(세부_정보[[#This Row],[프로젝트 유형]],매개_변수[프로젝트 유형],0),MATCH(세부_정보[[#Headers],[비즈니스 변호사]],매개_변수[#Headers],0))*INDEX('프로젝트 매개 변수'!$B$12:$H$12,1,MATCH(세부_정보[[#Headers],[비즈니스 변호사]],매개_변수[#Headers],0))*세부_정보[[#This Row],[예상 작업]]","v":{"v":20000,"d":"₩20,000"}},{"$f":"INDEX(매개_변수[],MATCH(세부_정보[[#This Row],[프로젝트 유형]],매개_변수[프로젝트 유형],0),MATCH(세부_정보[[#Headers],[피고측 법률 관계자]],매개_변수[#Headers],0))*INDEX('프로젝트 매개 변수'!$B$12:$H$12,1,MATCH(세부_정보[[#Headers],[피고측 법률 관계자]],매개_변수[#Headers],0))*세부_정보[[#This Row],[예상 작업]]","v":{"v":0,"d":"₩0"}},{"$f":"INDEX(매개_변수[],MATCH(세부_정보[[#This Row],[프로젝트 유형]],매개_변수[프로젝트 유형],0),MATCH(세부_정보[[#Headers],[지적 재산권 변호사]],매개_변수[#Headers],0))*INDEX('프로젝트 매개 변수'!$B$12:$H$12,1,MATCH(세부_정보[[#Headers],[지적 재산권 변호사]],매개_변수[#Headers],0))*세부_정보[[#This Row],[예상 작업]]","v":{"v":0,"d":"₩0"}},{"$f":"INDEX(매개_변수[],MATCH(세부_정보[[#This Row],[프로젝트 유형]],매개_변수[프로젝트 유형],0),MATCH(세부_정보[[#Headers],[파산 변호사]],매개_변수[#Headers],0))*INDEX('프로젝트 매개 변수'!$B$12:$H$12,1,MATCH(세부_정보[[#Headers],[파산 변호사]],매개_변수[#Headers],0))*세부_정보[[#This Row],[예상 작업]]","v":{"v":0,"d":"₩0"}},{"$f":"INDEX(매개_변수[],MATCH(세부_정보[[#This Row],[프로젝트 유형]],매개_변수[프로젝트 유형],0),MATCH(세부_정보[[#Headers],[관리 인력]],매개_변수[#Headers],0))*INDEX('프로젝트 매개 변수'!$B$12:$H$12,1,MATCH(세부_정보[[#Headers],[관리 인력]],매개_변수[#Headers],0))*세부_정보[[#This Row],[예상 작업]]","v":{"v":12500,"d":"₩12,500"}},{"$f":"INDEX(매개_변수[],MATCH(세부_정보[[#This Row],[프로젝트 유형]],매개_변수[프로젝트 유형],0),MATCH(세부_정보[[#Headers],[일반 파트너]],매개_변수[#Headers],0))*INDEX('프로젝트 매개 변수'!$B$12:$H$12,1,MATCH(세부_정보[[#Headers],[일반 파트너]],매개_변수[#Headers],0))*세부_정보[[#This Row],[실제 작업]]","v":{"v":7700,"d":"₩7,700"}},{"$f":"INDEX(매개_변수[],MATCH(세부_정보[[#This Row],[프로젝트 유형]],매개_변수[프로젝트 유형],0),MATCH(세부_정보[[#Headers],[비즈니스 변호사]],매개_변수[#Headers],0))*INDEX('프로젝트 매개 변수'!$B$12:$H$12,1,MATCH(세부_정보[[#Headers],[비즈니스 변호사]],매개_변수[#Headers],0))*세부_정보[[#This Row],[실제 작업]]","v":{"v":22000,"d":"₩22,000"}},{"$f":"INDEX(매개_변수[],MATCH(세부_정보[[#This Row],[프로젝트 유형]],매개_변수[프로젝트 유형],0),MATCH(세부_정보[[#Headers],[피고측 법률 관계자]],매개_변수[#Headers],0))*INDEX('프로젝트 매개 변수'!$B$12:$H$12,1,MATCH(세부_정보[[#Headers],[피고측 법률 관계자]],매개_변수[#Headers],0))*세부_정보[[#This Row],[실제 작업]]","v":{"v":0,"d":"₩0"}},{"$f":"INDEX(매개_변수[],MATCH(세부_정보[[#This Row],[프로젝트 유형]],매개_변수[프로젝트 유형],0),MATCH(세부_정보[[#Headers],[지적 재산권 변호사]],매개_변수[#Headers],0))*INDEX('프로젝트 매개 변수'!$B$12:$H$12,1,MATCH(세부_정보[[#Headers],[지적 재산권 변호사]],매개_변수[#Headers],0))*세부_정보[[#This Row],[실제 작업]]","v":{"v":0,"d":"₩0"}},{"$f":"INDEX(매개_변수[],MATCH(세부_정보[[#This Row],[프로젝트 유형]],매개_변수[프로젝트 유형],0),MATCH(세부_정보[[#Headers],[파산 변호사]],매개_변수[#Headers],0))*INDEX('프로젝트 매개 변수'!$B$12:$H$12,1,MATCH(세부_정보[[#Headers],[파산 변호사]],매개_변수[#Headers],0))*세부_정보[[#This Row],[실제 작업]]","v":{"v":0,"d":"₩0"}},{"$f":"INDEX(매개_변수[],MATCH(세부_정보[[#This Row],[프로젝트 유형]],매개_변수[프로젝트 유형],0),MATCH(세부_정보[[#Headers],[관리 인력]],매개_변수[#Headers],0))*INDEX('프로젝트 매개 변수'!$B$12:$H$12,1,MATCH(세부_정보[[#Headers],[관리 인력]],매개_변수[#Headers],0))*세부_정보[[#This Row],[실제 작업]]","v":{"v":13750,"d":"₩13,750"}}]
[null,"프로젝트 2","회사 인수",{"$f":"TODAY()+30","v":"2019-03-20"},{"$f":"TODAY()+100","v":"2019-05-29"},{"$f":"TODAY()+40","v":"2019-03-30"},{"$f":"TODAY()+110","v":"2019-06-08"},400,390,{"$f":"DAYS360(세부_정보[[#This Row],[예상 시작]],세부_정보[[#This Row],[예상 완료]],FALSE)","v":69},{"$f":"DAYS360(세부_정보[[#This Row],[실제 시작]],세부_정보[[#This Row],[실제 완료]],FALSE)","v":68},{"$f":"INDEX(매개_변수[],MATCH(세부_정보[[#This Row],[프로젝트 유형]],매개_변수[프로젝트 유형],0),MATCH(세부_정보[[#Headers],[일반 파트너]],매개_변수[#Headers],0))*INDEX('프로젝트 매개 변수'!$B$12:$H$12,1,MATCH(세부_정보[[#Headers],[일반 파트너]],매개_변수[#Headers],0))*세부_정보[[#This Row],[예상 작업]]","v":{"v":14000,"d":"₩14,000"}},{"$f":"INDEX(매개_변수[],MATCH(세부_정보[[#This Row],[프로젝트 유형]],매개_변수[프로젝트 유형],0),MATCH(세부_정보[[#Headers],[비즈니스 변호사]],매개_변수[#Headers],0))*INDEX('프로젝트 매개 변수'!$B$12:$H$12,1,MATCH(세부_정보[[#Headers],[비즈니스 변호사]],매개_변수[#Headers],0))*세부_정보[[#This Row],[예상 작업]]","v":{"v":40000,"d":"₩40,000"}},{"$f":"INDEX(매개_변수[],MATCH(세부_정보[[#This Row],[프로젝트 유형]],매개_변수[프로젝트 유형],0),MATCH(세부_정보[[#Headers],[피고측 법률 관계자]],매개_변수[#Headers],0))*INDEX('프로젝트 매개 변수'!$B$12:$H$12,1,MATCH(세부_정보[[#Headers],[피고측 법률 관계자]],매개_변수[#Headers],0))*세부_정보[[#This Row],[예상 작업]]","v":{"v":0,"d":"₩0"}},{"$f":"INDEX(매개_변수[],MATCH(세부_정보[[#This Row],[프로젝트 유형]],매개_변수[프로젝트 유형],0),MATCH(세부_정보[[#Headers],[지적 재산권 변호사]],매개_변수[#Headers],0))*INDEX('프로젝트 매개 변수'!$B$12:$H$12,1,MATCH(세부_정보[[#Headers],[지적 재산권 변호사]],매개_변수[#Headers],0))*세부_정보[[#This Row],[예상 작업]]","v":{"v":11000,"d":"₩11,000"}},{"$f":"INDEX(매개_변수[],MATCH(세부_정보[[#This Row],[프로젝트 유형]],매개_변수[프로젝트 유형],0),MATCH(세부_정보[[#Headers],[파산 변호사]],매개_변수[#Headers],0))*INDEX('프로젝트 매개 변수'!$B$12:$H$12,1,MATCH(세부_정보[[#Headers],[파산 변호사]],매개_변수[#Headers],0))*세부_정보[[#This Row],[예상 작업]]","v":{"v":0,"d":"₩0"}},{"$f":"INDEX(매개_변수[],MATCH(세부_정보[[#This Row],[프로젝트 유형]],매개_변수[프로젝트 유형],0),MATCH(세부_정보[[#Headers],[관리 인력]],매개_변수[#Headers],0))*INDEX('프로젝트 매개 변수'!$B$12:$H$12,1,MATCH(세부_정보[[#Headers],[관리 인력]],매개_변수[#Headers],0))*세부_정보[[#This Row],[예상 작업]]","v":{"v":20000,"d":"₩20,000"}},{"$f":"INDEX(매개_변수[],MATCH(세부_정보[[#This Row],[프로젝트 유형]],매개_변수[프로젝트 유형],0),MATCH(세부_정보[[#Headers],[일반 파트너]],매개_변수[#Headers],0))*INDEX('프로젝트 매개 변수'!$B$12:$H$12,1,MATCH(세부_정보[[#Headers],[일반 파트너]],매개_변수[#Headers],0))*세부_정보[[#This Row],[실제 작업]]","v":{"v":13650,"d":"₩13,650"}},{"$f":"INDEX(매개_변수[],MATCH(세부_정보[[#This Row],[프로젝트 유형]],매개_변수[프로젝트 유형],0),MATCH(세부_정보[[#Headers],[비즈니스 변호사]],매개_변수[#Headers],0))*INDEX('프로젝트 매개 변수'!$B$12:$H$12,1,MATCH(세부_정보[[#Headers],[비즈니스 변호사]],매개_변수[#Headers],0))*세부_정보[[#This Row],[실제 작업]]","v":{"v":39000,"d":"₩39,000"}},{"$f":"INDEX(매개_변수[],MATCH(세부_정보[[#This Row],[프로젝트 유형]],매개_변수[프로젝트 유형],0),MATCH(세부_정보[[#Headers],[피고측 법률 관계자]],매개_변수[#Headers],0))*INDEX('프로젝트 매개 변수'!$B$12:$H$12,1,MATCH(세부_정보[[#Headers],[피고측 법률 관계자]],매개_변수[#Headers],0))*세부_정보[[#This Row],[실제 작업]]","v":{"v":0,"d":"₩0"}},{"$f":"INDEX(매개_변수[],MATCH(세부_정보[[#This Row],[프로젝트 유형]],매개_변수[프로젝트 유형],0),MATCH(세부_정보[[#Headers],[지적 재산권 변호사]],매개_변수[#Headers],0))*INDEX('프로젝트 매개 변수'!$B$12:$H$12,1,MATCH(세부_정보[[#Headers],[지적 재산권 변호사]],매개_변수[#Headers],0))*세부_정보[[#This Row],[실제 작업]]","v":{"v":10725,"d":"₩10,725"}},{"$f":"INDEX(매개_변수[],MATCH(세부_정보[[#This Row],[프로젝트 유형]],매개_변수[프로젝트 유형],0),MATCH(세부_정보[[#Headers],[파산 변호사]],매개_변수[#Headers],0))*INDEX('프로젝트 매개 변수'!$B$12:$H$12,1,MATCH(세부_정보[[#Headers],[파산 변호사]],매개_변수[#Headers],0))*세부_정보[[#This Row],[실제 작업]]","v":{"v":0,"d":"₩0"}},{"$f":"INDEX(매개_변수[],MATCH(세부_정보[[#This Row],[프로젝트 유형]],매개_변수[프로젝트 유형],0),MATCH(세부_정보[[#Headers],[관리 인력]],매개_변수[#Headers],0))*INDEX('프로젝트 매개 변수'!$B$12:$H$12,1,MATCH(세부_정보[[#Headers],[관리 인력]],매개_변수[#Headers],0))*세부_정보[[#This Row],[실제 작업]]","v":{"v":19500,"d":"₩19,500"}}]
[null,"프로젝트 3","제품 책임 방어",{"$f":"TODAY()+150","v":"2019-07-18"},{"$f":"TODAY()+150","v":"2019-07-18"},{"$f":"TODAY()+150","v":"2019-07-18"},{"$f":"TODAY()+170","v":"2019-08-07"},500,500,{"$f":"DAYS360(세부_정보[[#This Row],[예상 시작]],세부_정보[[#This Row],[예상 완료]],FALSE)","v":0},{"$f":"DAYS360(세부_정보[[#This Row],[실제 시작]],세부_정보[[#This Row],[실제 완료]],FALSE)","v":19},{"$f":"INDEX(매개_변수[],MATCH(세부_정보[[#This Row],[프로젝트 유형]],매개_변수[프로젝트 유형],0),MATCH(세부_정보[[#Headers],[일반 파트너]],매개_변수[#Headers],0))*INDEX('프로젝트 매개 변수'!$B$12:$H$12,1,MATCH(세부_정보[[#Headers],[일반 파트너]],매개_변수[#Headers],0))*세부_정보[[#This Row],[예상 작업]]","v":{"v":35000,"d":"₩35,000"}},{"$f":"INDEX(매개_변수[],MATCH(세부_정보[[#This Row],[프로젝트 유형]],매개_변수[프로젝트 유형],0),MATCH(세부_정보[[#Headers],[비즈니스 변호사]],매개_변수[#Headers],0))*INDEX('프로젝트 매개 변수'!$B$12:$H$12,1,MATCH(세부_정보[[#Headers],[비즈니스 변호사]],매개_변수[#Headers],0))*세부_정보[[#This Row],[예상 작업]]","v":{"v":0,"d":"₩0"}},{"$f":"INDEX(매개_변수[],MATCH(세부_정보[[#This Row],[프로젝트 유형]],매개_변수[프로젝트 유형],0),MATCH(세부_정보[[#Headers],[피고측 법률 관계자]],매개_변수[#Headers],0))*INDEX('프로젝트 매개 변수'!$B$12:$H$12,1,MATCH(세부_정보[[#Headers],[피고측 법률 관계자]],매개_변수[#Headers],0))*세부_정보[[#This Row],[예상 작업]]","v":{"v":75000,"d":"₩75,000"}},{"$f":"INDEX(매개_변수[],MATCH(세부_정보[[#This Row],[프로젝트 유형]],매개_변수[프로젝트 유형],0),MATCH(세부_정보[[#Headers],[지적 재산권 변호사]],매개_변수[#Headers],0))*INDEX('프로젝트 매개 변수'!$B$12:$H$12,1,MATCH(세부_정보[[#Headers],[지적 재산권 변호사]],매개_변수[#Headers],0))*세부_정보[[#This Row],[예상 작업]]","v":{"v":0,"d":"₩0"}},{"$f":"INDEX(매개_변수[],MATCH(세부_정보[[#This Row],[프로젝트 유형]],매개_변수[프로젝트 유형],0),MATCH(세부_정보[[#Headers],[파산 변호사]],매개_변수[#Headers],0))*INDEX('프로젝트 매개 변수'!$B$12:$H$12,1,MATCH(세부_정보[[#Headers],[파산 변호사]],매개_변수[#Headers],0))*세부_정보[[#This Row],[예상 작업]]","v":{"v":0,"d":"₩0"}},{"$f":"INDEX(매개_변수[],MATCH(세부_정보[[#This Row],[프로젝트 유형]],매개_변수[프로젝트 유형],0),MATCH(세부_정보[[#Headers],[관리 인력]],매개_변수[#Headers],0))*INDEX('프로젝트 매개 변수'!$B$12:$H$12,1,MATCH(세부_정보[[#Headers],[관리 인력]],매개_변수[#Headers],0))*세부_정보[[#This Row],[예상 작업]]","v":{"v":18750,"d":"₩18,750"}},{"$f":"INDEX(매개_변수[],MATCH(세부_정보[[#This Row],[프로젝트 유형]],매개_변수[프로젝트 유형],0),MATCH(세부_정보[[#Headers],[일반 파트너]],매개_변수[#Headers],0))*INDEX('프로젝트 매개 변수'!$B$12:$H$12,1,MATCH(세부_정보[[#Headers],[일반 파트너]],매개_변수[#Headers],0))*세부_정보[[#This Row],[실제 작업]]","v":{"v":35000,"d":"₩35,000"}},{"$f":"INDEX(매개_변수[],MATCH(세부_정보[[#This Row],[프로젝트 유형]],매개_변수[프로젝트 유형],0),MATCH(세부_정보[[#Headers],[비즈니스 변호사]],매개_변수[#Headers],0))*INDEX('프로젝트 매개 변수'!$B$12:$H$12,1,MATCH(세부_정보[[#Headers],[비즈니스 변호사]],매개_변수[#Headers],0))*세부_정보[[#This Row],[실제 작업]]","v":{"v":0,"d":"₩0"}},{"$f":"INDEX(매개_변수[],MATCH(세부_정보[[#This Row],[프로젝트 유형]],매개_변수[프로젝트 유형],0),MATCH(세부_정보[[#Headers],[피고측 법률 관계자]],매개_변수[#Headers],0))*INDEX('프로젝트 매개 변수'!$B$12:$H$12,1,MATCH(세부_정보[[#Headers],[피고측 법률 관계자]],매개_변수[#Headers],0))*세부_정보[[#This Row],[실제 작업]]","v":{"v":75000,"d":"₩75,000"}},{"$f":"INDEX(매개_변수[],MATCH(세부_정보[[#This Row],[프로젝트 유형]],매개_변수[프로젝트 유형],0),MATCH(세부_정보[[#Headers],[지적 재산권 변호사]],매개_변수[#Headers],0))*INDEX('프로젝트 매개 변수'!$B$12:$H$12,1,MATCH(세부_정보[[#Headers],[지적 재산권 변호사]],매개_변수[#Headers],0))*세부_정보[[#This Row],[실제 작업]]","v":{"v":0,"d":"₩0"}},{"$f":"INDEX(매개_변수[],MATCH(세부_정보[[#This Row],[프로젝트 유형]],매개_변수[프로젝트 유형],0),MATCH(세부_정보[[#Headers],[파산 변호사]],매개_변수[#Headers],0))*INDEX('프로젝트 매개 변수'!$B$12:$H$12,1,MATCH(세부_정보[[#Headers],[파산 변호사]],매개_변수[#Headers],0))*세부_정보[[#This Row],[실제 작업]]","v":{"v":0,"d":"₩0"}},{"$f":"INDEX(매개_변수[],MATCH(세부_정보[[#This Row],[프로젝트 유형]],매개_변수[프로젝트 유형],0),MATCH(세부_정보[[#Headers],[관리 인력]],매개_변수[#Headers],0))*INDEX('프로젝트 매개 변수'!$B$12:$H$12,1,MATCH(세부_정보[[#Headers],[관리 인력]],매개_변수[#Headers],0))*세부_정보[[#This Row],[실제 작업]]","v":{"v":18750,"d":"₩18,750"}}]
[null,"프로젝트 4","특허 응용",{"$f":"TODAY()+200","v":"2019-09-06"},{"$f":"TODAY()+230","v":"2019-10-06"},{"$f":"TODAY()+230","v":"2019-10-06"},{"$f":"TODAY()+230","v":"2019-10-06"},150,145,{"$f":"DAYS360(세부_정보[[#This Row],[예상 시작]],세부_정보[[#This Row],[예상 완료]],FALSE)","v":30},{"$f":"DAYS360(세부_정보[[#This Row],[실제 시작]],세부_정보[[#This Row],[실제 완료]],FALSE)","v":0},{"$f":"INDEX(매개_변수[],MATCH(세부_정보[[#This Row],[프로젝트 유형]],매개_변수[프로젝트 유형],0),MATCH(세부_정보[[#Headers],[일반 파트너]],매개_변수[#Headers],0))*INDEX('프로젝트 매개 변수'!$B$12:$H$12,1,MATCH(세부_정보[[#Headers],[일반 파트너]],매개_변수[#Headers],0))*세부_정보[[#This Row],[예상 작업]]","v":{"v":5250,"d":"₩5,250"}},{"$f":"INDEX(매개_변수[],MATCH(세부_정보[[#This Row],[프로젝트 유형]],매개_변수[프로젝트 유형],0),MATCH(세부_정보[[#Headers],[비즈니스 변호사]],매개_변수[#Headers],0))*INDEX('프로젝트 매개 변수'!$B$12:$H$12,1,MATCH(세부_정보[[#Headers],[비즈니스 변호사]],매개_변수[#Headers],0))*세부_정보[[#This Row],[예상 작업]]","v":{"v":0,"d":"₩0"}},{"$f":"INDEX(매개_변수[],MATCH(세부_정보[[#This Row],[프로젝트 유형]],매개_변수[프로젝트 유형],0),MATCH(세부_정보[[#Headers],[피고측 법률 관계자]],매개_변수[#Headers],0))*INDEX('프로젝트 매개 변수'!$B$12:$H$12,1,MATCH(세부_정보[[#Headers],[피고측 법률 관계자]],매개_변수[#Headers],0))*세부_정보[[#This Row],[예상 작업]]","v":{"v":0,"d":"₩0"}},{"$f":"INDEX(매개_변수[],MATCH(세부_정보[[#This Row],[프로젝트 유형]],매개_변수[프로젝트 유형],0),MATCH(세부_정보[[#Headers],[지적 재산권 변호사]],매개_변수[#Headers],0))*INDEX('프로젝트 매개 변수'!$B$12:$H$12,1,MATCH(세부_정보[[#Headers],[지적 재산권 변호사]],매개_변수[#Headers],0))*세부_정보[[#This Row],[예상 작업]]","v":{"v":24750,"d":"₩24,750"}},{"$f":"INDEX(매개_변수[],MATCH(세부_정보[[#This Row],[프로젝트 유형]],매개_변수[프로젝트 유형],0),MATCH(세부_정보[[#Headers],[파산 변호사]],매개_변수[#Headers],0))*INDEX('프로젝트 매개 변수'!$B$12:$H$12,1,MATCH(세부_정보[[#Headers],[파산 변호사]],매개_변수[#Headers],0))*세부_정보[[#This Row],[예상 작업]]","v":{"v":0,"d":"₩0"}},{"$f":"INDEX(매개_변수[],MATCH(세부_정보[[#This Row],[프로젝트 유형]],매개_변수[프로젝트 유형],0),MATCH(세부_정보[[#Headers],[관리 인력]],매개_변수[#Headers],0))*INDEX('프로젝트 매개 변수'!$B$12:$H$12,1,MATCH(세부_정보[[#Headers],[관리 인력]],매개_변수[#Headers],0))*세부_정보[[#This Row],[예상 작업]]","v":{"v":5625,"d":"₩5,625"}},{"$f":"INDEX(매개_변수[],MATCH(세부_정보[[#This Row],[프로젝트 유형]],매개_변수[프로젝트 유형],0),MATCH(세부_정보[[#Headers],[일반 파트너]],매개_변수[#Headers],0))*INDEX('프로젝트 매개 변수'!$B$12:$H$12,1,MATCH(세부_정보[[#Headers],[일반 파트너]],매개_변수[#Headers],0))*세부_정보[[#This Row],[실제 작업]]","v":{"v":5075,"d":"₩5,075"}},{"$f":"INDEX(매개_변수[],MATCH(세부_정보[[#This Row],[프로젝트 유형]],매개_변수[프로젝트 유형],0),MATCH(세부_정보[[#Headers],[비즈니스 변호사]],매개_변수[#Headers],0))*INDEX('프로젝트 매개 변수'!$B$12:$H$12,1,MATCH(세부_정보[[#Headers],[비즈니스 변호사]],매개_변수[#Headers],0))*세부_정보[[#This Row],[실제 작업]]","v":{"v":0,"d":"₩0"}},{"$f":"INDEX(매개_변수[],MATCH(세부_정보[[#This Row],[프로젝트 유형]],매개_변수[프로젝트 유형],0),MATCH(세부_정보[[#Headers],[피고측 법률 관계자]],매개_변수[#Headers],0))*INDEX('프로젝트 매개 변수'!$B$12:$H$12,1,MATCH(세부_정보[[#Headers],[피고측 법률 관계자]],매개_변수[#Headers],0))*세부_정보[[#This Row],[실제 작업]]","v":{"v":0,"d":"₩0"}},{"$f":"INDEX(매개_변수[],MATCH(세부_정보[[#This Row],[프로젝트 유형]],매개_변수[프로젝트 유형],0),MATCH(세부_정보[[#Headers],[지적 재산권 변호사]],매개_변수[#Headers],0))*INDEX('프로젝트 매개 변수'!$B$12:$H$12,1,MATCH(세부_정보[[#Headers],[지적 재산권 변호사]],매개_변수[#Headers],0))*세부_정보[[#This Row],[실제 작업]]","v":{"v":23925,"d":"₩23,925"}},{"$f":"INDEX(매개_변수[],MATCH(세부_정보[[#This Row],[프로젝트 유형]],매개_변수[프로젝트 유형],0),MATCH(세부_정보[[#Headers],[파산 변호사]],매개_변수[#Headers],0))*INDEX('프로젝트 매개 변수'!$B$12:$H$12,1,MATCH(세부_정보[[#Headers],[파산 변호사]],매개_변수[#Headers],0))*세부_정보[[#This Row],[실제 작업]]","v":{"v":0,"d":"₩0"}},{"$f":"INDEX(매개_변수[],MATCH(세부_정보[[#This Row],[프로젝트 유형]],매개_변수[프로젝트 유형],0),MATCH(세부_정보[[#Headers],[관리 인력]],매개_변수[#Headers],0))*INDEX('프로젝트 매개 변수'!$B$12:$H$12,1,MATCH(세부_정보[[#Headers],[관리 인력]],매개_변수[#Headers],0))*세부_정보[[#This Row],[실제 작업]]","v":{"v":5437.5,"d":"₩5,438"}}]
[null,"프로젝트 5","직원 소송",{"$f":"TODAY()+220","v":"2019-09-26"},{"$f":"TODAY()+250","v":"2019-10-26"},{"$f":"TODAY()+230","v":"2019-10-06"},{"$f":"TODAY()+259","v":"2019-11-04"},250,255,{"$f":"DAYS360(세부_정보[[#This Row],[예상 시작]],세부_정보[[#This Row],[예상 완료]],FALSE)","v":30},{"$f":"DAYS360(세부_정보[[#This Row],[실제 시작]],세부_정보[[#This Row],[실제 완료]],FALSE)","v":28},{"$f":"INDEX(매개_변수[],MATCH(세부_정보[[#This Row],[프로젝트 유형]],매개_변수[프로젝트 유형],0),MATCH(세부_정보[[#Headers],[일반 파트너]],매개_변수[#Headers],0))*INDEX('프로젝트 매개 변수'!$B$12:$H$12,1,MATCH(세부_정보[[#Headers],[일반 파트너]],매개_변수[#Headers],0))*세부_정보[[#This Row],[예상 작업]]","v":{"v":17500,"d":"₩17,500"}},{"$f":"INDEX(매개_변수[],MATCH(세부_정보[[#This Row],[프로젝트 유형]],매개_변수[프로젝트 유형],0),MATCH(세부_정보[[#Headers],[비즈니스 변호사]],매개_변수[#Headers],0))*INDEX('프로젝트 매개 변수'!$B$12:$H$12,1,MATCH(세부_정보[[#Headers],[비즈니스 변호사]],매개_변수[#Headers],0))*세부_정보[[#This Row],[예상 작업]]","v":{"v":6250,"d":"₩6,250"}},{"$f":"INDEX(매개_변수[],MATCH(세부_정보[[#This Row],[프로젝트 유형]],매개_변수[프로젝트 유형],0),MATCH(세부_정보[[#Headers],[피고측 법률 관계자]],매개_변수[#Headers],0))*INDEX('프로젝트 매개 변수'!$B$12:$H$12,1,MATCH(세부_정보[[#Headers],[피고측 법률 관계자]],매개_변수[#Headers],0))*세부_정보[[#This Row],[예상 작업]]","v":{"v":30000,"d":"₩30,000"}},{"$f":"INDEX(매개_변수[],MATCH(세부_정보[[#This Row],[프로젝트 유형]],매개_변수[프로젝트 유형],0),MATCH(세부_정보[[#Headers],[지적 재산권 변호사]],매개_변수[#Headers],0))*INDEX('프로젝트 매개 변수'!$B$12:$H$12,1,MATCH(세부_정보[[#Headers],[지적 재산권 변호사]],매개_변수[#Headers],0))*세부_정보[[#This Row],[예상 작업]]","v":{"v":0,"d":"₩0"}},{"$f":"INDEX(매개_변수[],MATCH(세부_정보[[#This Row],[프로젝트 유형]],매개_변수[프로젝트 유형],0),MATCH(세부_정보[[#Headers],[파산 변호사]],매개_변수[#Headers],0))*INDEX('프로젝트 매개 변수'!$B$12:$H$12,1,MATCH(세부_정보[[#Headers],[파산 변호사]],매개_변수[#Headers],0))*세부_정보[[#This Row],[예상 작업]]","v":{"v":0,"d":"₩0"}},{"$f":"INDEX(매개_변수[],MATCH(세부_정보[[#This Row],[프로젝트 유형]],매개_변수[프로젝트 유형],0),MATCH(세부_정보[[#Headers],[관리 인력]],매개_변수[#Headers],0))*INDEX('프로젝트 매개 변수'!$B$12:$H$12,1,MATCH(세부_정보[[#Headers],[관리 인력]],매개_변수[#Headers],0))*세부_정보[[#This Row],[예상 작업]]","v":{"v":9375,"d":"₩9,375"}},{"$f":"INDEX(매개_변수[],MATCH(세부_정보[[#This Row],[프로젝트 유형]],매개_변수[프로젝트 유형],0),MATCH(세부_정보[[#Headers],[일반 파트너]],매개_변수[#Headers],0))*INDEX('프로젝트 매개 변수'!$B$12:$H$12,1,MATCH(세부_정보[[#Headers],[일반 파트너]],매개_변수[#Headers],0))*세부_정보[[#This Row],[실제 작업]]","v":{"v":17850,"d":"₩17,850"}},{"$f":"INDEX(매개_변수[],MATCH(세부_정보[[#This Row],[프로젝트 유형]],매개_변수[프로젝트 유형],0),MATCH(세부_정보[[#Headers],[비즈니스 변호사]],매개_변수[#Headers],0))*INDEX('프로젝트 매개 변수'!$B$12:$H$12,1,MATCH(세부_정보[[#Headers],[비즈니스 변호사]],매개_변수[#Headers],0))*세부_정보[[#This Row],[실제 작업]]","v":{"v":6375,"d":"₩6,375"}},{"$f":"INDEX(매개_변수[],MATCH(세부_정보[[#This Row],[프로젝트 유형]],매개_변수[프로젝트 유형],0),MATCH(세부_정보[[#Headers],[피고측 법률 관계자]],매개_변수[#Headers],0))*INDEX('프로젝트 매개 변수'!$B$12:$H$12,1,MATCH(세부_정보[[#Headers],[피고측 법률 관계자]],매개_변수[#Headers],0))*세부_정보[[#This Row],[실제 작업]]","v":{"v":30600,"d":"₩30,600"}},{"$f":"INDEX(매개_변수[],MATCH(세부_정보[[#This Row],[프로젝트 유형]],매개_변수[프로젝트 유형],0),MATCH(세부_정보[[#Headers],[지적 재산권 변호사]],매개_변수[#Headers],0))*INDEX('프로젝트 매개 변수'!$B$12:$H$12,1,MATCH(세부_정보[[#Headers],[지적 재산권 변호사]],매개_변수[#Headers],0))*세부_정보[[#This Row],[실제 작업]]","v":{"v":0,"d":"₩0"}},{"$f":"INDEX(매개_변수[],MATCH(세부_정보[[#This Row],[프로젝트 유형]],매개_변수[프로젝트 유형],0),MATCH(세부_정보[[#Headers],[파산 변호사]],매개_변수[#Headers],0))*INDEX('프로젝트 매개 변수'!$B$12:$H$12,1,MATCH(세부_정보[[#Headers],[파산 변호사]],매개_변수[#Headers],0))*세부_정보[[#This Row],[실제 작업]]","v":{"v":0,"d":"₩0"}},{"$f":"INDEX(매개_변수[],MATCH(세부_정보[[#This Row],[프로젝트 유형]],매개_변수[프로젝트 유형],0),MATCH(세부_정보[[#Headers],[관리 인력]],매개_변수[#Headers],0))*INDEX('프로젝트 매개 변수'!$B$12:$H$12,1,MATCH(세부_정보[[#Headers],[관리 인력]],매개_변수[#Headers],0))*세부_정보[[#This Row],[실제 작업]]","v":{"v":9562.5,"d":"₩9,563"}}]
[null,"요약",{"$nulls":5},{"$f":"SUBTOTAL(109,세부_정보[예상 작업])","v":1500},{"$f":"SUBTOTAL(109,세부_정보[실제 작업])","v":1510},{"$f":"SUBTOTAL(109,세부_정보[예상 기간])","v":190},{"$f":"SUBTOTAL(109,세부_정보[실제 기간])","v":169}]

{"sheet":"프로젝트 총계","index":3,"n_rows":11,"n_cols":16,"rows_kept":11,"merged":[[3,2,3,7],[3,8,3,13],[3,15,14,19]]}
["이 워크시트의 프로젝트 총계를 확인하세요. 회사 이름은 오른쪽 셀에 자동으로 업데이트됩니다. 이 열의 몇몇 셀에서 유용한 지침을 확인할 수 있습니다. 아래쪽 화살표를 사용하여 시작할 수 있습니다.",{"$f":"'프로젝트 매개 변수'!B1","v":"회사 이름"}]
["오른쪽 셀에 이 워크시트의 제목이 표시됩니다.",{"$f":"'프로젝트 매개 변수'!B2","v":"법률회사를 위한 프로젝트 계획"}]
["기밀 메시지는 오른쪽 셀에 있습니다.",{"$f":"'프로젝트 매개 변수'!B3","v":"회사 이름 기밀"}]
["예상된 레이블은 C4 셀에, 실제 레이블은 I4 셀에 나타나며 P4 셀에는 정보 팁이 표시됩니다.",null,"예상",{"$nulls":5},"실제",{"$nulls":6},"정보: \n이 피벗 테이블은 자동으로 새로 고침되지 않습니다.  새로 고침하려면 선택하고(피벗 테이블 안의 아무 셀이나 선택), 피벗 테이블 도구 | 분석 리본 메뉴 탭에서 새로 고침을 선택합니다.  또는 피벗 테이블을 선택해 SHIFT + F10을 누르고 새로 고침을 선택합니다."]
["오른쪽 셀에서 시작되는 피벗 테이블은 자동으로 업데이트됩니다.","프로젝트 이름","일반 파트너 ","비즈니스 ","피고측 법률 관계자 ","지적 재산권 ","파산 ","관리 인력 ","일반 파트너  ","비즈니스    ","피고측 법률 관계자  ","파산  ","지적 재산권  ","관리 인력  "]
[null,"프로젝트 1",{"v":7000,"d":"₩7,000.00"},{"v":20000,"d":"₩20,000.00"},{"v":0,"d":"₩0.00"},{"v":0,"d":"₩0.00"},{"v":0,"d":"₩0.00"},{"v":12500,"d":"₩12,500.00"},{"v":7700,"d":"₩7,700.00"},{"v":22000,"d":"₩22,000.00"},{"v":0,"d":"₩0.00"},{"v":0,"d":"₩0.00"},{"v":0,"d":"₩0.00"},{"v":13750,"d":"₩13,750.00"}]
[null,"프로젝트 2",{"v":14000,"d":"₩14,000.00"},{"v":40000,"d":"₩40,000.00"},{"v":0,"d":"₩0.00"},{"v":11000,"d":"₩11,000.00"},{"v":0,"d":"₩0.00"},{"v":20000,"d":"₩20,000.00"},{"v":13650,"d":"₩13,650.00"},{"v":39000,"d":"₩39,000.00"},{"v":0,"d":"₩0.00"},{"v":10725,"d":"₩10,725.00"},{"v":0,"d":"₩0.00"},{"v":19500,"d":"₩19,500.00"}]
[null,"프로젝트 3",{"v":35000,"d":"₩35,000.00"},{"v":0,"d":"₩0.00"},{"v":75000,"d":"₩75,000.00"},{"v":0,"d":"₩0.00"},{"v":0,"d":"₩0.00"},{"v":18750,"d":"₩18,750.00"},{"v":35000,"d":"₩35,000.00"},{"v":0,"d":"₩0.00"},{"v":75000,"d":"₩75,000.00"},{"v":0,"d":"₩0.00"},{"v":0,"d":"₩0.00"},{"v":18750,"d":"₩18,750.00"}]
[null,"프로젝트 4",{"v":5250,"d":"₩5,250.00"},{"v":0,"d":"₩0.00"},{"v":0,"d":"₩0.00"},{"v":24750,"d":"₩24,750.00"},{"v":0,"d":"₩0.00"},{"v":5625,"d":"₩5,625.00"},{"v":5075,"d":"₩5,075.00"},{"v":0,"d":"₩0.00"},{"v":0,"d":"₩0.00"},{"v":23925,"d":"₩23,925.00"},{"v":0,"d":"₩0.00"},{"v":5437.5,"d":"₩5,437.50"}]
[null,"프로젝트 5",{"v":17500,"d":"₩17,500.00"},{"v":6250,"d":"₩6,250.00"},{"v":30000,"d":"₩30,000.00"},{"v":0,"d":"₩0.00"},{"v":0,"d":"₩0.00"},{"v":9375,"d":"₩9,375.00"},{"v":17850,"d":"₩17,850.00"},{"v":6375,"d":"₩6,375.00"},{"v":30600,"d":"₩30,600.00"},{"v":0,"d":"₩0.00"},{"v":0,"d":"₩0.00"},{"v":9562.5,"d":"₩9,562.50"}]
[null,"총합계",{"v":78750,"d":"₩78,750.00"},{"v":66250,"d":"₩66,250.00"},{"v":105000,"d":"₩105,000.00"},{"v":35750,"d":"₩35,750.00"},{"v":0,"d":"₩0.00"},{"v":66250,"d":"₩66,250.00"},{"v":79275,"d":"₩79,275.00"},{"v":67375,"d":"₩67,375.00"},{"v":105600,"d":"₩105,600.00"},{"v":34650,"d":"₩34,650.00"},{"v":0,"d":"₩0.00"},{"v":67000,"d":"₩67,000.00"}]