{"text_format":"1","workbook":"xlsx","n_sheets":4,"sheets":["점수 기록표","성적","설정","계산"],"not_rendered":{"charts":0,"images":0,"macros":0,"external_links":0,"defined_names":3,"comments":1,"pivot_tables":0},"unopened":[],"bounds":{"document_bytes":16777216,"sheet_cells":100000,"rows_first":2000,"rows_last":500,"rows_between":2000,"halvings":0,"cell_chars":16384,"cell_head_chars":4096},"cells_cut":0,"cells_raw":0,"read":"whole","date_system":"1900"}

{"sheet":"점수 기록표","index":0,"n_rows":14,"n_cols":6,"rows_kept":14,"cut":false,"hidden":false,"merged":[]}
[null,"여기에 점수를 입력하세요."]
[]
[null,null,"수업","종류","설명","점수"]
[null,null,"현대 프랑스어","숙제","제2차 세계 대전 역사",0.8]
[null,null,"Java 고급 프로그래밍","중간고사",null,0.75]
[null,null,"스페인어","숙제",null,0.5]
[null,null,"이론 물리학","숙제",null,0.95]
[null,null,"현대 프랑스어","숙제","제2차 세계 대전 역사",0.9]
[null,null,"현대 프랑스어","숙제","30 - 41페이지",0.8]
[null,null,"작법","작문","설득 논문",0.95]
[null,null,"수학 1","숙제","21 & 26페이지",0.8]
[null,null,"수학 2","숙제","15 & 18페이지",0.85]
[null,null,"수학 1","숙제","34 - 36페이지",0.8]
[null,null,"수학 2","퀴즈",null,0.95]

{"sheet":"성적","index":1,"n_rows":31,"n_cols":8,"rows_kept":31,"cut":false,"hidden":false,"merged":[]}
[null,"성적"]
[]
[null,null,"합계"]
[null,null,{"$f":"\"시간: \"&SUM(표_수업[이수 시간])","v":"시간: 24"},{"$f":"AVERAGE(D7:D31)","v":0.81047619047619057},{"$f":"AVERAGE(E7:E31)","v":2.7142857142857144},{"$f":"SUM(F7:F31)","v":2.625},{"$f":"IFERROR(HLOOKUP(D4,목록_GPA_매핑,2),\"\")","v":"B-"}]
[]
[null,null,"수업","%","평점","w평점","학점","전체 성적"]
[null,null,{"$f":"계산!C6","v":"현대 프랑스어"},{"$f":"계산!AL6","v":0.83333333333333337},{"$f":"계산!AM6","v":3},{"$f":"IFERROR(E7*설정!D9/SUM(표_수업[이수 시간]),\"\")","v":0.375},{"$f":"계산!AN6","v":"B"}]
[null,null,{"$f":"계산!C7","v":"이론 물리학"},{"$f":"계산!AL7","v":0.95},{"$f":"계산!AM7","v":4},{"$f":"IFERROR(E8*설정!D10/SUM(표_수업[이수 시간]),\"\")","v":0.5},{"$f":"계산!AN7","v":"A"}]
[null,null,{"$f":"계산!C8","v":"수학 1"},{"$f":"계산!AL8","v":0.80000000000000016},{"$f":"계산!AM8","v":2.67},{"$f":"IFERROR(E9*설정!D11/SUM(표_수업[이수 시간]),\"\")","v":0.44500000000000001},{"$f":"계산!AN8","v":"B-"}]
[null,null,{"$f":"계산!C9","v":"수학 2"},{"$f":"계산!AL9","v":0.89},{"$f":"계산!AM9","v":3.33},{"$f":"IFERROR(E10*설정!D12/SUM(표_수업[이수 시간]),\"\")","v":0.55500000000000005},{"$f":"계산!AN9","v":"B+"}]
[null,null,{"$f":"계산!C10","v":"Java 고급 프로그래밍"},{"$f":"계산!AL10","v":0.75000000000000011},{"$f":"계산!AM10","v":2},{"$f":"IFERROR(E11*설정!D13/SUM(표_수업[이수 시간]),\"\")","v":0.41666666666666669},{"$f":"계산!AN10","v":"C"}]
[null,null,{"$f":"계산!C11","v":"스페인어"},{"$f":"계산!AL11","v":0.5},{"$f":"계산!AM11","v":0},{"$f":"IFERROR(E12*설정!D14/SUM(표_수업[이수 시간]),\"\")","v":0},{"$f":"계산!AN11","v":"F"}]
[null,null,{"$f":"계산!C12","v":"작법"},{"$f":"계산!AL12","v":0.95},{"$f":"계산!AM12","v":4},{"$f":"IFERROR(E13*설정!D15/SUM(표_수업[이수 시간]),\"\")","v":0.33333333333333331},{"$f":"계산!AN12","v":"A"}]
[null,null,{"$f":"계산!C13","v":""},{"$f":"계산!AL13","v":""},{"$f":"계산!AM13","v":""},{"$f":"IFERROR(E14*설정!D16/SUM(표_수업[이수 시간]),\"\")","v":""},{"$f":"계산!AN13","v":""}]
[null,null,{"$f":"계산!C14","v":""},{"$f":"계산!AL14","v":""},{"$f":"계산!AM14","v":""},{"$f":"IFERROR(E15*설정!D17/SUM(표_수업[이수 시간]),\"\")","v":""},{"$f":"계산!AN14","v":""}]
[null,null,{"$f":"계산!C15","v":""},{"$f":"계산!AL15","v":""},{"$f":"계산!AM15","v":""},{"$f":"IFERROR(E16*설정!D18/SUM(표_수업[이수 시간]),\"\")","v":""},{"$f":"계산!AN15","v":""}]
[null,null,{"$f":"계산!C16","v":""},{"$f":"계산!AL16","v":""},{"$f":"계산!AM16","v":""},{"$f":"IFERROR(E17*설정!D19/SUM(표_수업[이수 시간]),\"\")","v":""},{"$f":"계산!AN16","v":""}]
[null,null,{"$f":"계산!C17","v":""},{"$f":"계산!AL17","v":""},{"$f":"계산!AM17","v":""},{"$f":"IFERROR(E18*설정!D20/SUM(표_수업[이수 시간]),\"\")","v":""},{"$f":"계산!AN17","v":""}]
[null,null,{"$f":"계산!C18","v":""},{"$f":"계산!AL18","v":""},{"$f":"계산!AM18","v":""},{"$f":"IFERROR(E19*설정!D21/SUM(표_수업[이수 시간]),\"\")","v":""},{"$f":"계산!AN18","v":""}]
[null,null,{"$f":"계산!C19","v":""},{"$f":"계산!AL19","v":""},{"$f":"계산!AM19","v":""},{"$f":"IFERROR(E20*설정!D22/SUM(표_수업[이수 시간]),\"\")","v":""},{"$f":"계산!AN19","v":""}]
{"$rows_left_out":12}
{"sheet":"설정","index":2,"n_rows":15,"n_cols":16,"rows_kept":15,"cut":false,"hidden":false,"merged":[[5,2,5,15]]}
[null,"설정"]
[null,null,"점수 및 평점 매핑"]
[null,null,"백분율",0,0.6,0.63,0.67,0.7,0.73,0.77,0.8,0.83,0.87,0.9,0.93,0.97]
[null,null,"학점","F","D-","D","D+","C-","C","C+","B-","B","B+","A-","A","A+"]
[null,null,"평점",0,0.67,1,1.33,1.67,2,2.33,2.67,3,3.33,3.67,4,4]
[]
[null,null,"최대 25개 수업에 대한 가중치 부가 점수"]
[null,null,"수강 과목","이수 시간","숙제","작문","퀴즈","프로젝트","중간고사","기말고사","기타","% 합계"]
[null,null,"현대 프랑스어",3,0.1,0.15,0.15,0.1,0.2,0.3,null,{"$f":"SUM(표_수업[[#This Row],[숙제]:[기타]])","v":1}]
[null,null,"이론 물리학",3,0.15,0.15,0.1,0.1,0.15,0.3,0.05,{"$f":"SUM(표_수업[[#This Row],[숙제]:[기타]])","v":1}]
[null,null,"수학 1",4,0.1,0.15,0.15,0.1,0.2,0.3,null,{"$f":"SUM(표_수업[[#This Row],[숙제]:[기타]])","v":1}]
[null,null,"수학 2",4,0.15,0.15,0.1,0.1,0.15,0.3,0.05,{"$f":"SUM(표_수업[[#This Row],[숙제]:[기타]])","v":1}]
[null,null,"Java 고급 프로그래밍",5,0.15,0.15,0.1,0.1,0.2,0.3,null,{"$f":"SUM(표_수업[[#This Row],[숙제]:[기타]])","v":1}]
[null,null,"스페인어",3,0.1,0.15,0.17,0.13,0.2,0.2,0.05,{"$f":"SUM(표_수업[[#This Row],[숙제]:[기타]])","v":1}]
[null,null,"작법",2,0.15,0.15,0.12,0.15,0.15,0.25,0.03,{"$f":"SUM(표_수업[[#This Row],[숙제]:[기타]])","v":1}]

{"sheet":"계산","index":3,"n_rows":657,"n_cols":40,"rows_kept":657,"cut":false,"hidden":true,"merged":[]}
[null,"계산"]
[null,null,"이 워크시트는 점수 및 평점에 대한 계산을 제공하며 숨겨진 상태로 유지해야 합니다. 이 시트를 변경하면 오류가 발생할 수 있습니다."]
[]
[null,null,"현재 수업 목록","점수(기준: 1)",null,null,null,null,null,null,null,null,null,null,null,null,null,null,null,null,null,null,null,null,null,null,null,null,"점수 계산"]
[null,null,"수업",1,2,3,4,5,6,7,8,9,10,11,12,13,14,15,16,17,18,19,20,21,22,23,24,25,{"$f":"표_수업[[#Headers],[숙제]]","v":"숙제"},{"$f":"표_수업[[#Headers],[작문]]","v":"작문"},{"$f":"표_수업[[#Headers],[퀴즈]]","v":"퀴즈"},{"$f":"표_수업[[#Headers],[프로젝트]]","v":"프로젝트"},{"$f":"표_수업[[#Headers],[중간고사]]","v":"중간고사"},{"$f":"표_수업[[#Headers],[기말고사]]","v":"기말고사"},{"$f":"표_수업[[#Headers],[기타]]","v":"기타"},"합계","만점","총 %","점수","학점"]
[null,null,{"$f":"IF(설정!C9=\"\",\"\",설정!C9)","v":"현대 프랑스어"},{"$f":"IFERROR(INDEX(표_수업_점수[],MATCH($C6:$C30&D$5:AB$5,계산!$C$33:$C$657,0),4),\"\")","v":0.8},0.9,0.8,"","","","","","","","","","","","","","","","","","","","","","",{"$f":"IFERROR(AVERAGEIFS(표_수업_점수[점수],표_수업_점수[수업],계산!$C6,표_수업_점수[종류],계산!AC$5)*설정!E9,\"\")","v":8.3333333333333343E-2},{"$f":"IFERROR(AVERAGEIFS(표_수업_점수[점수],표_수업_점수[수업],계산!$C6,표_수업_점수[종류],계산!AD$5)*설정!F9,\"\")","v":""},{"$f":"IFERROR(AVERAGEIFS(표_수업_점수[점수],표_수업_점수[수업],계산!$C6,표_수업_점수[종류],계산!AE$5)*설정!G9,\"\")","v":""},{"$f":"IFERROR(AVERAGEIFS(표_수업_점수[점수],표_수업_점수[수업],계산!$C6,표_수업_점수[종류],계산!AF$5)*설정!H9,\"\")","v":""},{"$f":"IFERROR(AVERAGEIFS(표_수업_점수[점수],표_수업_점수[수업],계산!$C6,표_수업_점수[종류],계산!AG$5)*설정!I9,\"\")","v":""},{"$f":"IFERROR(AVERAGEIFS(표_수업_점수[점수],표_수업_점수[수업],계산!$C6,표_수업_점수[종류],계산!AH$5)*설정!J9,\"\")","v":""},{"$f":"IFERROR(AVERAGEIFS(표_수업_점수[점수],표_수업_점수[수업],계산!$C6,표_수업_점수[종류],계산!AI$5)*설정!K9,\"\")","v":""},{"$f":"SUM(AC6:AI6)","v":8.3333333333333343E-2},{"$f":"SUMIFS(설정!E9:K9,계산!AC6:AI6,\">0\")","v":0.1},{"$f":"IFERROR(AJ6/AK6,\"\")","v":0.83333333333333337},{"$f":"IFERROR(HLOOKUP(AL6,목록_GPA_매핑,3),\"\")","v":3},{"$f":"IFERROR(HLOOKUP(AL6,목록_GPA_매핑,2),\"\")","v":"B"}]
[null,null,{"$f":"IF(설정!C10=\"\",\"\",설정!C10)","v":"이론 물리학"},0.95,"","","","","","","","","","","","","","","","","","","","","","","","",{"$f":"IFERROR(AVERAGEIFS(표_수업_점수[점수],표_수업_점수[수업],계산!$C7,표_수업_점수[종류],계산!AC$5)*설정!E10,\"\")","v":0.14249999999999999},{"$f":"IFERROR(AVERAGEIFS(표_수업_점수[점수],표_수업_점수[수업],계산!$C7,표_수업_점수[종류],계산!AD$5)*설정!F10,\"\")","v":""},{"$f":"IFERROR(AVERAGEIFS(표_수업_점수[점수],표_수업_점수[수업],계산!$C7,표_수업_점수[종류],계산!AE$5)*설정!G10,\"\")","v":""},{"$f":"IFERROR(AVERAGEIFS(표_수업_점수[점수],표_수업_점수[수업],계산!$C7,표_수업_점수[종류],계산!AF$5)*설정!H10,\"\")","v":""},{"$f":"IFERROR(AVERAGEIFS(표_수업_점수[점수],표_수업_점수[수업],계산!$C7,표_수업_점수[종류],계산!AG$5)*설정!I10,\"\")","v":""},{"$f":"IFERROR(AVERAGEIFS(표_수업_점수[점수],표_수업_점수[수업],계산!$C7,표_수업_점수[종류],계산!AH$5)*설정!J10,\"\")","v":""},{"$f":"IFERROR(AVERAGEIFS(표_수업_점수[점수],표_수업_점수[수업],계산!$C7,표_수업_점수[종류],계산!AI$5)*설정!K10,\"\")","v":""},{"$f":"SUM(AC7:AI7)","v":0.14249999999999999},{"$f":"SUMIFS(설정!E10:K10,계산!AC7:AI7,\">0\")","v":0.15},{"$f":"IFERROR(AJ7/AK7,\"\")","v":0.95},4,"A"]
[null,null,{"$f":"IF(설정!C11=\"\",\"\",설정!C11)","v":"수학 1"},0.8,0.8,"","","","","","","","","","","","","","","","","","","","","","","",{"$f":"IFERROR(AVERAGEIFS(표_수업_점수[점수],표_수업_점수[수업],계산!$C8,표_수업_점수[종류],계산!AC$5)*설정!E11,\"\")","v":8.0000000000000016E-2},{"$f":"IFERROR(AVERAGEIFS(표_수업_점수[점수],표_수업_점수[수업],계산!$C8,표_수업_점수[종류],계산!AD$5)*설정!F11,\"\")","v":""},{"$f":"IFERROR(AVERAGEIFS(표_수업_점수[점수],표_수업_점수[수업],계산!$C8,표_수업_점수[종류],계산!AE$5)*설정!G11,\"\")","v":""},{"$f":"IFERROR(AVERAGEIFS(표_수업_점수[점수],표_수업_점수[수업],계산!$C8,표_수업_점수[종류],계산!AF$5)*설정!H11,\"\")","v":""},{"$f":"IFERROR(AVERAGEIFS(표_수업_점수[점수],표_수업_점수[수업],계산!$C8,표_수업_점수[종류],계산!AG$5)*설정!I11,\"\")","v":""},{"$f":"IFERROR(AVERAGEIFS(표_수업_점수[점수],표_수업_점수[수업],계산!$C8,표_수업_점수[종류],계산!AH$5)*설정!J11,\"\")","v":""},{"$f":"IFERROR(AVERAGEIFS(표_수업_점수[점수],표_수업_점수[수업],계산!$C8,표_수업_점수[종류],계산!AI$5)*설정!K11,\"\")","v":""},8.0000000000000016E-2,{"$f":"SUMIFS(설정!E11:K11,계산!AC8:AI8,\">0\")","v":0.1},0.80000000000000016,2.67,"B-"]
[null,null,{"$f":"IF(설정!C12=\"\",\"\",설정!C12)","v":"수학 2"},0.85,0.95,"","","","","","","","","","","","","","","","","","","","","","","",{"$f":"IFERROR(AVERAGEIFS(표_수업_점수[점수],표_수업_점수[수업],계산!$C9,표_수업_점수[종류],계산!AC$5)*설정!E12,\"\")","v":0.1275},{"$f":"IFERROR(AVERAGEIFS(표_수업_점수[점수],표_수업_점수[수업],계산!$C9,표_수업_점수[종류],계산!AD$5)*설정!F12,\"\")","v":""},{"$f":"IFERROR(AVERAGEIFS(표_수업_점수[점수],표_수업_점수[수업],계산!$C9,표_수업_점수[종류],계산!AE$5)*설정!G12,\"\")","v":9.5000000000000001E-2},{"$f":"IFERROR(AVERAGEIFS(표_수업_점수[점수],표_수업_점수[수업],계산!$C9,표_수업_점수[종류],계산!AF$5)*설정!H12,\"\")","v":""},{"$f":"IFERROR(AVERAGEIFS(표_수업_점수[점수],표_수업_점수[수업],계산!$C9,표_수업_점수[종류],계산!AG$5)*설정!I12,\"\")","v":""},{"$f":"IFERROR(AVERAGEIFS(표_수업_점수[점수],표_수업_점수[수업],계산!$C9,표_수업_점수[종류],계산!AH$5)*설정!J12,\"\")","v":""},{"$f":"IFERROR(AVERAGEIFS(표_수업_점수[점수],표_수업_점수[수업],계산!$C9,표_수업_점수[종류],계산!AI$5)*설정!K12,\"\")","v":""},0.2225,{"$f":"SUMIFS(설정!E12:K12,계산!AC9:AI9,\">0\")","v":0.25},0.89,3.33,"B+"]
[null,null,{"$f":"IF(설정!C13=\"\",\"\",설정!C13)","v":"Java 고급 프로그래밍"},0.75,"","","","","","","","","","","","","","","","","","","","","","","","",{"$f":"IFERROR(AVERAGEIFS(표_수업_점수[점수],표_수업_점수[수업],계산!$C10,표_수업_점수[종류],계산!AC$5)*설정!E13,\"\")","v":""},{"$f":"IFERROR(AVERAGEIFS(표_수업_점수[점수],표_수업_점수[수업],계산!$C10,표_수업_점수[종류],계산!AD$5)*설정!F13,\"\")","v":""},{"$f":"IFERROR(AVERAGEIFS(표_수업_점수[점수],표_수업_점수[수업],계산!$C10,표_수업_점수[종류],계산!AE$5)*설정!G13,\"\")","v":""},{"$f":"IFERROR(AVERAGEIFS(표_수업_점수[점수],표_수업_점수[수업],계산!$C10,표_수업_점수[종류],계산!AF$5)*설정!H13,\"\")","v":""},{"$f":"IFERROR(AVERAGEIFS(표_수업_점수[점수],표_수업_점수[수업],계산!$C10,표_수업_점수[종류],계산!AG$5)*설정!I13,\"\")","v":0.15000000000000002},{"$f":"IFERROR(AVERAGEIFS(표_수업_점수[점수],표_수업_점수[수업],계산!$C10,표_수업_점수[종류],계산!AH$5)*설정!J13,\"\")","v":""},{"$f":"IFERROR(AVERAGEIFS(표_수업_점수[점수],표_수업_점수[수업],계산!$C10,표_수업_점수[종류],계산!AI$5)*설정!K13,\"\")","v":""},0.15000000000000002,{"$f":"SUMIFS(설정!E13:K13,계산!AC10:AI10,\">0\")","v":0.2},0.75000000000000011,2,"C"]
[null,null,{"$f":"IF(설정!C14=\"\",\"\",설정!C14)","v":"스페인어"},0.5,"","","","","","","","","","","","","","","","","","","","","","","","",{"$f":"IFERROR(AVERAGEIFS(표_수업_점수[점수],표_수업_점수[수업],계산!$C11,표_수업_점수[종류],계산!AC$5)*설정!E14,\"\")","v":0.05},{"$f":"IFERROR(AVERAGEIFS(표_수업_점수[점수],표_수업_점수[수업],계산!$C11,표_수업_점수[종류],계산!AD$5)*설정!F14,\"\")","v":""},{"$f":"IFERROR(AVERAGEIFS(표_수업_점수[점수],표_수업_점수[수업],계산!$C11,표_수업_점수[종류],계산!AE$5)*설정!G14,\"\")","v":""},{"$f":"IFERROR(AVERAGEIFS(표_수업_점수[점수],표_수업_점수[수업],계산!$C11,표_수업_점수[종류],계산!AF$5)*설정!H14,\"\")","v":""},{"$f":"IFERROR(AVERAGEIFS(표_수업_점수[점수],표_수업_점수[수업],계산!$C11,표_수업_점수[종류],계산!AG$5)*설정!I14,\"\")","v":""},{"$f":"IFERROR(AVERAGEIFS(표_수업_점수[점수],표_수업_점수[수업],계산!$C11,표_수업_점수[종류],계산!AH$5)*설정!J14,\"\")","v":""},{"$f":"IFERROR(AVERAGEIFS(표_수업_점수[점수],표_수업_점수[수업],계산!$C11,표_수업_점수[종류],계산!AI$5)*설정!K14,\"\")","v":""},0.05,{"$f":"SUMIFS(설정!E14:K14,계산!AC11:AI11,\">0\")","v":0.1},0.5,0,"F"]
[null,null,{"$f":"IF(설정!C15=\"\",\"\",설정!C15)","v":"작법"},0.95,"","","","","","","","","","","","","","","","","","","","","","","","",{"$f":"IFERROR(AVERAGEIFS(표_수업_점수[점수],표_수업_점수[수업],계산!$C12,표_수업_점수[종류],계산!AC$5)*설정!E15,\"\")","v":""},{"$f":"IFERROR(AVERAGEIFS(표_수업_점수[점수],표_수업_점수[수업],계산!$C12,표_수업_점수[종류],계산!AD$5)*설정!F15,\"\")","v":0.14249999999999999},{"$f":"IFERROR(AVERAGEIFS(표_수업_점수[점수],표_수업_점수[수업],계산!$C12,표_수업_점수[종류],계산!AE$5)*설정!G15,\"\")","v":""},{"$f":"IFERROR(AVERAGEIFS(표_수업_점수[점수],표_수업_점수[수업],계산!$C12,표_수업_점수[종류],계산!AF$5)*설정!H15,\"\")","v":""},{"$f":"IFERROR(AVERAGEIFS(표_수업_점수[점수],표_수업_점수[수업],계산!$C12,표_수업_점수[종류],계산!AG$5)*설정!I15,\"\")","v":""},{"$f":"IFERROR(AVERAGEIFS(표_수업_점수[점수],표_수업_점수[수업],계산!$C12,표_수업_점수[종류],계산!AH$5)*설정!J15,\"\")","v":""},{"$f":"IFERROR(AVERAGEIFS(표_수업_점수[점수],표_수업_점수[수업],계산!$C12,표_수업_점수[종류],계산!AI$5)*설정!K15,\"\")","v":""},0.14249999999999999,{"$f":"SUMIFS(설정!E15:K15,계산!AC12:AI12,\">0\")","v":0.15},0.95,4,"A"]
[null,null,{"$f":"IF(설정!C16=\"\",\"\",설정!C16)","v":""},"","","","","","","","","","","","","","","","","","","","","","","","","",{"$f":"IFERROR(AVERAGEIFS(표_수업_점수[점수],표_수업_점수[수업],계산!$C13,표_수업_점수[종류],계산!AC$5)*설정!#REF!,\"\")","v":""},{"$f":"IFERROR(AVERAGEIFS(표_수업_점수[점수],표_수업_점수[수업],계산!$C13,표_수업_점수[종류],계산!AD$5)*설정!#REF!,\"\")","v":""},{"$f":"IFERROR(AVERAGEIFS(표_수업_점수[점수],표_수업_점수[수업],계산!$C13,표_수업_점수[종류],계산!AE$5)*설정!#REF!,\"\")","v":""},{"$f":"IFERROR(AVERAGEIFS(표_수업_점수[점수],표_수업_점수[수업],계산!$C13,표_수업_점수[종류],계산!AF$5)*설정!#REF!,\"\")","v":""},{"$f":"IFERROR(AVERAGEIFS(표_수업_점수[점수],표_수업_점수[수업],계산!$C13,표_수업_점수[종류],계산!AG$5)*설정!#REF!,\"\")","v":""},{"$f":"IFERROR(AVERAGEIFS(표_수업_점수[점수],표_수업_점수[수업],계산!$C13,표_수업_점수[종류],계산!AH$5)*설정!#REF!,\"\")","v":""},{"$f":"IFERROR(AVERAGEIFS(표_수업_점수[점수],표_수업_점수[수업],계산!$C13,표_수업_점수[종류],계산!AI$5)*설정!#REF!,\"\")","v":""},0,{"$f":"SUMIFS(설정!E16:K16,계산!AC13:AI13,\">0\")","v":0},"","",""]
[null,null,{"$f":"IF(설정!C17=\"\",\"\",설정!C17)","v":""},"","","","","","","","","","","","","","","","","","","","","","","","","",{"$f":"IFERROR(AVERAGEIFS(표_수업_점수[점수],표_수업_점수[수업],계산!$C14,표_수업_점수[종류],계산!AC$5)*설정!#REF!,\"\")","v":""},{"$f":"IFERROR(AVERAGEIFS(표_수업_점수[점수],표_수업_점수[수업],계산!$C14,표_수업_점수[종류],계산!AD$5)*설정!#REF!,\"\")","v":""},{"$f":"IFERROR(AVERAGEIFS(표_수업_점수[점수],표_수업_점수[수업],계산!$C14,표_수업_점수[종류],계산!AE$5)*설정!#REF!,\"\")","v":""},{"$f":"IFERROR(AVERAGEIFS(표_수업_점수[점수],표_수업_점수[수업],계산!$C14,표_수업_점수[종류],계산!AF$5)*설정!#REF!,\"\")","v":""},{"$f":"IFERROR(AVERAGEIFS(표_수업_점수[점수],표_수업_점수[수업],계산!$C14,표_수업_점수[종류],계산!AG$5)*설정!#REF!,\"\")","v":""},{"$f":"IFERROR(AVERAGEIFS(표_수업_점수[점수],표_수업_점수[수업],계산!$C14,표_수업_점수[종류],계산!AH$5)*설정!#REF!,\"\")","v":""},{"$f":"IFERROR(AVERAGEIFS(표_수업_점수[점수],표_수업_점수[수업],계산!$C14,표_수업_점수[종류],계산!AI$5)*설정!#REF!,\"\")","v":""},0,{"$f":"SUMIFS(설정!E17:K17,계산!AC14:AI14,\">0\")","v":0},"","",""]
[null,null,{"$f":"IF(설정!C18=\"\",\"\",설정!C18)","v":""},"","","","","","","","","","","","","","","","","","","","","","","","","",{"$f":"IFERROR(AVERAGEIFS(표_수업_점수[점수],표_수업_점수[수업],계산!$C15,표_수업_점수[종류],계산!AC$5)*설정!#REF!,\"\")","v":""},{"$f":"IFERROR(AVERAGEIFS(표_수업_점수[점수],표_수업_점수[수업],계산!$C15,표_수업_점수[종류],계산!AD$5)*설정!#REF!,\"\")","v":""},{"$f":"IFERROR(AVERAGEIFS(표_수업_점수[점수],표_수업_점수[수업],계산!$C15,표_수업_점수[종류],계산!AE$5)*설정!#REF!,\"\")","v":""},{"$f":"IFERROR(AVERAGEIFS(표_수업_점수[점수],표_수업_점수[수업],계산!$C15,표_수업_점수[종류],계산!AF$5)*설정!#REF!,\"\")","v":""},{"$f":"IFERROR(AVERAGEIFS(표_수업_점수[점수],표_수업_점수[수업],계산!$C15,표_수업_점수[종류],계산!AG$5)*설정!#REF!,\"\")","v":""},{"$f":"IFERROR(AVERAGEIFS(표_수업_점수[점수],표_수업_점수[수업],계산!$C15,표_수업_점수[종류],계산!AH$5)*설정!#REF!,\"\")","v":""},{"$f":"IFERROR(AVERAGEIFS(표_수업_점수[점수],표_수업_점수[수업],계산!$C15,표_수업_점수[종류],계산!AI$5)*설정!#REF!,\"\")","v":""},0,{"$f":"SUMIFS(설정!E18:K18,계산!AC15:AI15,\">0\")","v":0},"","",""]
[null,null,{"$f":"IF(설정!C19=\"\",\"\",설정!C19)","v":""},"","","","","","","","","","","","","","","","","","","","","","","","","",{"$f":"IFERROR(AVERAGEIFS(표_수업_점수[점수],표_수업_점수[수업],계산!$C16,표_수업_점수[종류],계산!AC$5)*설정!#REF!,\"\")","v":""},{"$f":"IFERROR(AVERAGEIFS(표_수업_점수[점수],표_수업_점수[수업],계산!$C16,표_수업_점수[종류],계산!AD$5)*설정!#REF!,\"\")","v":""},{"$f":"IFERROR(AVERAGEIFS(표_수업_점수[점수],표_수업_점수[수업],계산!$C16,표_수업_점수[종류],계산!AE$5)*설정!#REF!,\"\")","v":""},{"$f":"IFERROR(AVERAGEIFS(표_수업_점수[점수],표_수업_점수[수업],계산!$C16,표_수업_점수[종류],계산!AF$5)*설정!#REF!,\"\")","v":""},{"$f":"IFERROR(AVERAGEIFS(표_수업_점수[점수],표_수업_점수[수업],계산!$C16,표_수업_점수[종류],계산!AG$5)*설정!#REF!,\"\")","v":""},{"$f":"IFERROR(AVERAGEIFS(표_수업_점수[점수],표_수업_점수[수업],계산!$C16,표_수업_점수[종류],계산!AH$5)*설정!#REF!,\"\")","v":""},{"$f":"IFERROR(AVERAGEIFS(표_수업_점수[점수],표_수업_점수[수업],계산!$C16,표_수업_점수[종류],계산!AI$5)*설정!#REF!,\"\")","v":""},0,{"$f":"SUMIFS(설정!E19:K19,계산!AC16:AI16,\">0\")","v":0},"","",""]
[null,null,{"$f":"IF(설정!C20=\"\",\"\",설정!C20)","v":""},"","","","","","","","","","","","","","","","","","","","","","","","","",{"$f":"IFERROR(AVERAGEIFS(표_수업_점수[점수],표_수업_점수[수업],계산!$C17,표_수업_점수[종류],계산!AC$5)*설정!#REF!,\"\")","v":""},{"$f":"IFERROR(AVERAGEIFS(표_수업_점수[점수],표_수업_점수[수업],계산!$C17,표_수업_점수[종류],계산!AD$5)*설정!#REF!,\"\")","v":""},{"$f":"IFERROR(AVERAGEIFS(표_수업_점수[점수],표_수업_점수[수업],계산!$C17,표_수업_점수[종류],계산!AE$5)*설정!#REF!,\"\")","v":""},{"$f":"IFERROR(AVERAGEIFS(표_수업_점수[점수],표_수업_점수[수업],계산!$C17,표_수업_점수[종류],계산!AF$5)*설정!#REF!,\"\")","v":""},{"$f":"IFERROR(AVERAGEIFS(표_수업_점수[점수],표_수업_점수[수업],계산!$C17,표_수업_점수[종류],계산!AG$5)*설정!#REF!,\"\")","v":""},{"$f":"IFERROR(AVERAGEIFS(표_수업_점수[점수],표_수업_점수[수업],계산!$C17,표_수업_점수[종류],계산!AH$5)*설정!#REF!,\"\")","v":""},{"$f":"IFERROR(AVERAGEIFS(표_수업_점수[점수],표_수업_점수[수업],계산!$C17,표_수업_점수[종류],계산!AI$5)*설정!#REF!,\"\")","v":""},0,{"$f":"SUMIFS(설정!E20:K20,계산!AC17:AI17,\">0\")","v":0},"","",""]
[null,null,{"$f":"IF(설정!C21=\"\",\"\",설정!C21)","v":""},"","","","","","","","","","","","","","","","","","","","","","","","","",{"$f":"IFERROR(AVERAGEIFS(표_수업_점수[점수],표_수업_점수[수업],계산!$C18,표_수업_점수[종류],계산!AC$5)*설정!#REF!,\"\")","v":""},{"$f":"IFERROR(AVERAGEIFS(표_수업_점수[점수],표_수업_점수[수업],계산!$C18,표_수업_점수[종류],계산!AD$5)*설정!#REF!,\"\")","v":""},{"$f":"IFERROR(AVERAGEIFS(표_수업_점수[점수],표_수업_점수[수업],계산!$C18,표_수업_점수[종류],계산!AE$5)*설정!#REF!,\"\")","v":""},{"$f":"IFERROR(AVERAGEIFS(표_수업_점수[점수],표_수업_점수[수업],계산!$C18,표_수업_점수[종류],계산!AF$5)*설정!#REF!,\"\")","v":""},{"$f":"IFERROR(AVERAGEIFS(표_수업_점수[점수],표_수업_점수[수업],계산!$C18,표_수업_점수[종류],계산!AG$5)*설정!#REF!,\"\")","v":""},{"$f":"IFERROR(AVERAGEIFS(표_수업_점수[점수],표_수업_점수[수업],계산!$C18,표_수업_점수[종류],계산!AH$5)*설정!#REF!,\"\")","v":""},{"$f":"IFERROR(AVERAGEIFS(표_수업_점수[점수],표_수업_점수[수업],계산!$C18,표_수업_점수[종류],계산!AI$5)*설정!#REF!,\"\")","v":""},0,{"$f":"SUMIFS(설정!E21:K21,계산!AC18:AI18,\">0\")","v":0},"","",""]
[null,null,{"$f":"IF(설정!C22=\"\",\"\",설정!C22)","v":""},"","","","","","","","","","","","","","","","","","","","","","","","","",{"$f":"IFERROR(AVERAGEIFS(표_수업_점수[점수],표_수업_점수[수업],계산!$C19,표_수업_점수[종류],계산!AC$5)*설정!#REF!,\"\")","v":""},{"$f":"IFERROR(AVERAGEIFS(표_수업_점수[점수],표_수업_점수[수업],계산!$C19,표_수업_점수[종류],계산!AD$5)*설정!#REF!,\"\")","v":""},{"$f":"IFERROR(AVERAGEIFS(표_수업_점수[점수],표_수업_점수[수업],계산!$C19,표_수업_점수[종류],계산!AE$5)*설정!#REF!,\"\")","v":""},{"$f":"IFERROR(AVERAGEIFS(표_수업_점수[점수],표_수업_점수[수업],계산!$C19,표_수업_점수[종류],계산!AF$5)*설정!#REF!,\"\")","v":""},{"$f":"IFERROR(AVERAGEIFS(표_수업_점수[점수],표_수업_점수[수업],계산!$C19,표_수업_점수[종류],계산!AG$5)*설정!#REF!,\"\")","v":""},{"$f":"IFERROR(AVERAGEIFS(표_수업_점수[점수],표_수업_점수[수업],계산!$C19,표_수업_점수[종류],계산!AH$5)*설정!#REF!,\"\")","v":""},{"$f":"IFERROR(AVERAGEIFS(표_수업_점수[점수],표_수업_점수[수업],계산!$C19,표_수업_점수[종류],계산!AI$5)*설정!#REF!,\"\")","v":""},0,{"$f":"SUMIFS(설정!E22:K22,계산!AC19:AI19,\">0\")","v":0},"","",""]
[null,null,{"$f":"IF(설정!C23=\"\",\"\",설정!C23)","v":""},"","","","","","","","","","","","","","","","","","","","","","","","","",{"$f":"IFERROR(AVERAGEIFS(표_수업_점수[점수],표_수업_점수[수업],계산!$C20,표_수업_점수[종류],계산!AC$5)*설정!#REF!,\"\")","v":""},{"$f":"IFERROR(AVERAGEIFS(표_수업_점수[점수],표_수업_점수[수업],계산!$C20,표_수업_점수[종류],계산!AD$5)*설정!#REF!,\"\")","v":""},{"$f":"IFERROR(AVERAGEIFS(표_수업_점수[점수],표_수업_점수[수업],계산!$C20,표_수업_점수[종류],계산!AE$5)*설정!#REF!,\"\")","v":""},{"$f":"IFERROR(AVERAGEIFS(표_수업_점수[점수],표_수업_점수[수업],계산!$C20,표_수업_점수[종류],계산!AF$5)*설정!#REF!,\"\")","v":""},{"$f":"IFERROR(AVERAGEIFS(표_수업_점수[점수],표_수업_점수[수업],계산!$C20,표_수업_점수[종류],계산!AG$5)*설정!#REF!,\"\")","v":""},{"$f":"IFERROR(AVERAGEIFS(표_수업_점수[점수],표_수업_점수[수업],계산!$C20,표_수업_점수[종류],계산!AH$5)*설정!#REF!,\"\")","v":""},{"$f":"IFERROR(AVERAGEIFS(표_수업_점수[점수],표_수업_점수[수업],계산!$C20,표_수업_점수[종류],계산!AI$5)*설정!#REF!,\"\")","v":""},0,{"$f":"SUMIFS(설정!E23:K23,계산!AC20:AI20,\">0\")","v":0},"","",""]
{"$rows_left_out":637}