{"text_format":"3","workbook":"xlsx","n_sheets":3,"sheets":["시작","월간 대학 예산","chart_calcs"],"not_rendered":{"charts":4,"defined_names":19},"read":"whole","date_system":"1900"}

{"sheet":"시작","index":0,"n_rows":7,"n_cols":2,"rows_kept":7}
[null,"이 템플릿 정보"]
[null,"월간 대학 예산 워크시트를 사용하여 수입, 비용 및 현금 흐름을 추적하십시오."]
[null,"월 수입과 비용을 입력하여 총 수입과 비용을 계산하십시오."]
[null,"현금 흐름은 자동으로 계산되고 현금 흐름 차트에 업데이트 됩니다."]
[null,"월간과 연간 수입, 비용 및 현금 흐름 차트를 구하려면 슬라이더를 선택하십시오."]
[null,"참고: "]
[null,"추가적인 지침은 워크시트의 A열에 있습니다. 이 텍스트는 일부러 숨겨 놓았습니다. 텍스트를 제거하려면 A열을 선택한 다음 [삭제]를 선택합니다. 텍스트를 표시하려면 A열을 선택한 다음 글꼴 색상을 변경합니다."]

{"sheet":"월간 대학 예산","index":1,"n_rows":72,"n_cols":16,"rows_kept":72,"merged":[[5,1,14,3],[5,4,14,11],[5,12,13,15],[15,1,19,15],[20,1,21,15]]}
["이 워크시트에 월간 대학 예산을 작성합니다. 오른쪽 셀과 B1 셀에 이 워크시트의 제목이 있습니다. 이 워크시트의 사용방법에 대한 유용한 지침은 이 열의 셀에 있습니다. 다음 지침은 A4 셀에 있습니다.","월간 대학 예산"]
[]
[]
["오른쪽 셀에 수입 레이블이, E4 셀에 비용 레이블이, M4 셀에 현금 흐름 레이블이 있습니다.",{"$f":"chart_calcs!$D$6","v":"연도 수입:"},null,null,{"$f":"chart_calcs!$D$7","v":"연도 지출:"},{"$nulls":7},{"$f":"chart_calcs!$D$8","v":"연도 현금 흐름:"}]
["수입은 오른쪽 셀에, 비용은 E5 셀에, 현금 흐름은 M5 셀에 자동으로 업데이트 됩니다.",{"$f":"\" \"&chart_calcs!$F$6","v":{"$error":"#VALUE!"}},null,null,{"$f":"\" \"&chart_calcs!$F$7","v":{"$error":"#VALUE!"}},{"$nulls":7},{"$f":"\" \"&chart_calcs!$F$8","v":" ₩169"}]
["오른쪽 셀의 수입 요약 및 E6 셀의 비용 요약을 보여주는 도넛형 차트와 M6 셀의 양수 및 음수 현금 흐름을 보여주는 막대형 차트가 자동으로 업데이트됩니다. 다음 지침은 셀 A17에 있습니다.","이 셀은 선택한 월 또는 연도에 대한 수입 요약을 표시하는 도덧형 차트입니다.",null,null,"이 셀은 선택한 월 또는 연도에 대한 비용 요약을 표시하는 도덧형 차트입니다.",{"$nulls":7},"이 셀은 선택한 월 또는 연도에 대한 현금 흐름의 증가 및 감소를 보여 주는 라인 차트입니다."]
{"$rows_empty":9}
[null,"이 셀은 선택한 월 또는 연도에 대한 현금 흐름을 보여 주는 라인 차트입니다."]
["오른쪽 셀에는 현금 흐름 라인 차트가 있습니다. 다음 지침은 A21 셀에 있습니다."]
[]
[]
[]
["월간 또는 연간 수입, 비용과 현금 흐름 데이터 및 차트를 얻으려면 오른쪽에 있는 슬라이더를 선택 합니다. 다음 지침은 셀 A25에 있습니다.","이 셀에 슬라이더가 있습니다."]
[]
[]
[]
["오른쪽 셀에서 월을 선택합니다. Alt+아래쪽 화살표를 눌러 옵션을 표시하고 아래쪽 화살표+Enter를 눌러 항목을 선택합니다.","1월"]
["선택한 기간은 자동으로 P26 셀에서 업데이트 합니다.",{"$nulls":14},{"$f":"SelectedPeriod","v":{"$error":"#VALUE!"}}]
["이 행은 레이블을, 오른쪽 셀은 비용 지출 후 월간 현금을, C27에서 N27까지의 셀은 월을, O27 셀은 년을, P27 셀은 퍼센트 증가를 나타냅니다.","비용 지출 후 월간 현금",{"$f":"첫번째달","v":{"$error":"#VALUE!"}},{"$f":"다음달","v":{"$error":"#VALUE!"}},{"$error":"#VALUE!"},{"$error":"#VALUE!"},{"$error":"#VALUE!"},{"$error":"#VALUE!"},{"$error":"#VALUE!"},{"$error":"#VALUE!"},{"$error":"#VALUE!"},{"$error":"#VALUE!"},{"$error":"#VALUE!"},{"$error":"#VALUE!"},"연도  ","% 증가 "]
["오른쪽 셀에 현금 흐름 레이블이 있습니다. C28 에서 N28 셀에는 각 월의 현금 흐름을, O28 셀에는 연간 값을, P28 셀에는 퍼센트 증가를 자동으로 계산해서 표시합니다. Q28 셀에는 스파크라인이 자동 업데이트됩니다.","현금 흐름",{"$f":"C37-C72","v":{"v":169,"d":"169 "}},{"v":69,"d":"69 "},{"v":192,"d":"192 "},{"v":199,"d":"199 "},{"v":204,"d":"204 "},{"v":-771,"d":"(771)"},{"v":124,"d":"124 "},{"v":154,"d":"154 "},{"v":-721,"d":"(721)"},{"v":109,"d":"109 "},{"v":34,"d":"34 "},{"v":-61,"d":"(61)"},{"$f":"SUM(C28:N28)","v":{"v":-299,"d":"(299)"}},{"$f":"INDEX($C28:$O28,,SelectedPeriodColumn)/INDEX($C$37:$O$37,,SelectedPeriodColumn)","v":{"$error":"#VALUE!"}}]
["오른쪽 셀에 누적 현금 흐름 레이블이 있습니다. C29 에서 N29 셀에는 각 월의 누적 현금 흐름을, O29 셀에는 연간 값을, P29 셀에는 퍼센트 증가를 자동으로 계산해서 표시합니다. Q29 셀에는 스파크라인이 자동 업데이트됩니다. 다음 지침은 셀 A31에 있습니다.","누적 현금 흐름",{"$f":"SUM($C$28:C$28)","v":{"v":169,"d":"169 "}},{"$f":"SUM($C$28:D$28)","v":{"v":238,"d":"238 "}},{"$f":"SUM($C$28:E$28)","v":{"v":430,"d":"430 "}},{"$f":"SUM($C$28:F$28)","v":{"v":629,"d":"629 "}},{"$f":"SUM($C$28:G$28)","v":{"v":833,"d":"833 "}},{"$f":"SUM($C$28:H$28)","v":{"v":62,"d":"62 "}},{"$f":"SUM($C$28:I$28)","v":{"v":186,"d":"186 "}},{"$f":"SUM($C$28:J$28)","v":{"v":340,"d":"340 "}},{"$f":"SUM($C$28:K$28)","v":{"v":-381,"d":"(381)"}},{"$f":"SUM($C$28:L$28)","v":{"v":-272,"d":"(272)"}},{"$f":"SUM($C$28:M$28)","v":{"v":-238,"d":"(238)"}},{"$f":"SUM($C$28:N$28)","v":{"v":-299,"d":"(299)"}}]
[]
["오른쪽 셀은 월별 수입 레이블을, C31 부터 N31 셀은 월을, O31 셀은 년을, P31 셀은 퍼센트 증가를 표시합니다. B32 에서 B36 셀에 월별 수입 항목을, C32 에서 N36 셀에 월별 수입 값을 입력합니다. O32 에서 O36 셀에 연간 수입이, P32 에서 P36 셀에 퍼센트 증가가 자동으로 계산됩니다. 다음 지침은 A37 셀에 있습니다.","월별 수입",{"$f":"첫번째달","v":{"$error":"#VALUE!"}},{"$f":"다음달","v":{"$error":"#VALUE!"}},{"$error":"#VALUE!"},{"$error":"#VALUE!"},{"$error":"#VALUE!"},{"$error":"#VALUE!"},{"$error":"#VALUE!"},{"$error":"#VALUE!"},{"$error":"#VALUE!"},{"$error":"#VALUE!"},{"$error":"#VALUE!"},{"$error":"#VALUE!"},"연도  ","% 증가 "]
[null,"지급되는 재정 보조금 (보조금, 장학금, 대출금)",0,0,750,750,750,750,750,750,750,750,750,750,{"$f":"SUM(C32:N32)","v":{"v":7500,"d":"7,500 "}},{"$f":"INDEX($C32:$O32,,SelectedPeriodColumn)/INDEX($C$37:$O$37,,SelectedPeriodColumn)","v":{"$error":"#VALUE!"}}]
[null,"작업의 세후 급여",450,450,450,450,450,450,450,450,550,350,350,350,{"v":5200,"d":"5,200 "},{"$f":"INDEX($C33:$O33,,SelectedPeriodColumn)/INDEX($C$37:$O$37,,SelectedPeriodColumn)","v":{"$error":"#VALUE!"}}]
[null,"가족의 재정 지원",200,200,{"v":1000,"d":"1,000"},350,350,350,350,350,350,350,350,350,{"v":4550,"d":"4,550 "},{"$f":"INDEX($C34:$O34,,SelectedPeriodColumn)/INDEX($C$37:$O$37,,SelectedPeriodColumn)","v":{"$error":"#VALUE!"}}]
[null,"저축에서 인출",500,350,150,0,0,0,0,0,0,0,0,0,{"v":1000,"d":"1,000 "},{"$f":"INDEX($C35:$O35,,SelectedPeriodColumn)/INDEX($C$37:$O$37,,SelectedPeriodColumn)","v":{"$error":"#VALUE!"}}]
[null,"기타 (아동 양육비, 공공 보조금, 선물 등)",75,75,75,75,75,75,75,75,75,75,75,75,{"v":900,"d":"900 "},{"$f":"INDEX($C36:$O36,,SelectedPeriodColumn)/INDEX($C$37:$O$37,,SelectedPeriodColumn)","v":{"$error":"#VALUE!"}}]
["오른쪽 셀에는 총 수입 레이블이 표시됩니다. C37 에서 N37 셀에는 각 월의 총 수입을, O37 셀에는 연간 수입을, P37 셀에는 퍼센트 증가를 자동으로 계산해서 표시합니다. Q37 셀에는 스파크라인이 자동 업데이트됩니다. 다음 지침은 A39 셀에 있습니다.","총 수입",{"$f":"SUM(C32:C36)","v":{"v":1225,"d":"1,225 "}},{"v":1075,"d":"1,075 "},{"v":2425,"d":"2,425 "},{"v":1625,"d":"1,625 "},{"v":1625,"d":"1,625 "},{"v":1625,"d":"1,625 "},{"v":1625,"d":"1,625 "},{"v":1625,"d":"1,625 "},{"v":1725,"d":"1,725 "},{"v":1525,"d":"1,525 "},{"v":1525,"d":"1,525 "},{"v":1525,"d":"1,525 "},{"v":19150,"d":"19,150 "},{"$f":"INDEX($C37:$O37,,SelectedPeriodColumn)/INDEX($C$37:$O$37,,SelectedPeriodColumn)","v":{"$error":"#VALUE!"}}]
[]
["오른쪽 셀은 월간 비용 레이블을, C39 부터 N39 셀은 월을, O39 셀은 년을, P39 셀은 퍼센트 증가를 표시합니다.","월 지출",{"$f":"첫번째달","v":{"$error":"#VALUE!"}},{"$f":"다음달","v":{"$error":"#VALUE!"}},{"$error":"#VALUE!"},{"$error":"#VALUE!"},{"$error":"#VALUE!"},{"$error":"#VALUE!"},{"$error":"#VALUE!"},{"$error":"#VALUE!"},{"$error":"#VALUE!"},{"$error":"#VALUE!"},{"$error":"#VALUE!"},{"$error":"#VALUE!"},"연도  ","% 증가 "]
["오른쪽 셀에 비용 항목을, C40 부터 N43 셀에 비용 값을 입력하거나 수정하세요. O40 에서 O43 셀에 연간 값이, P40 에서 P43 셀에 퍼센트 증가가 자동으로 계산됩니다. Q40 셀에는 스파크라인이 자동 업데이트됩니다. 다음 지침은 A45 셀에 있습니다.","회의실 및 보드",{"$f":"SUM(C41:C43)","v":{"v":565,"d":"565 "}},{"v":565,"d":"565 "},{"v":565,"d":"565 "},{"v":565,"d":"565 "},{"v":565,"d":"565 "},{"v":565,"d":"565 "},{"v":565,"d":"565 "},{"v":565,"d":"565 "},{"v":565,"d":"565 "},{"v":565,"d":"565 "},{"v":565,"d":"565 "},{"v":565,"d":"565 "},{"$f":"SUM(C40:N40)","v":{"v":6780,"d":"6,780 "}},{"$f":"INDEX($C40:$O40,,SelectedPeriodColumn)/INDEX($C$72:$O$72,,SelectedPeriodColumn)","v":{"$error":"#VALUE!"}}]
[null,null,315,315,315,315,315,315,315,315,315,315,315,315,{"$f":"SUM(C41:N41)","v":{"v":3780,"d":"3,780 "}},{"$f":"INDEX($C41:$O41,,SelectedPeriodColumn)/INDEX($C$72:$O$72,,SelectedPeriodColumn)","v":{"$error":"#VALUE!"}}]
[null,null,200,200,200,200,200,200,200,200,200,200,200,200,{"$f":"SUM(C42:N42)","v":{"v":2400,"d":"2,400 "}},{"$f":"INDEX($C42:$O42,,SelectedPeriodColumn)/INDEX($C$72:$O$72,,SelectedPeriodColumn)","v":{"$error":"#VALUE!"}}]
[null,null,50,50,50,50,50,50,50,50,50,50,50,50,{"$f":"SUM(C43:N43)","v":{"v":600,"d":"600 "}},{"$f":"INDEX($C43:$O43,,SelectedPeriodColumn)/INDEX($C$72:$O$72,,SelectedPeriodColumn)","v":{"$error":"#VALUE!"}}]
[]
["오른쪽 셀에 비용 항목을, C45 부터 N47 셀에 월별 비용 값을 입력하거나 수정하세요. O45 에서 O47 셀에 연간 값이, P45 에서 P47 셀에 퍼센트 증가가 자동으로 계산됩니다. Q45 셀에는 스파크라인이 자동 업데이트됩니다. 다음 지침은 A49 셀에 있습니다.","수업료 및 수수료",{"$f":"SUM(C46:C47)","v":{"v":0,"d":"0 "}},{"v":0,"d":"0 "},{"v":750,"d":"750 "},{"v":0,"d":"0 "},{"v":0,"d":"0 "},{"v":650,"d":"650 "},{"v":0,"d":"0 "},{"v":0,"d":"0 "},{"v":650,"d":"650 "},{"v":0,"d":"0 "},{"v":0,"d":"0 "},{"v":0,"d":"0 "},{"$f":"SUM(C45:N45)","v":{"v":2050,"d":"2,050 "}},{"$f":"INDEX($C45:$O45,,SelectedPeriodColumn)/INDEX($C$72:$O$72,,SelectedPeriodColumn)","v":{"$error":"#VALUE!"}}]
[null,null,0,0,500,0,0,500,0,0,500,0,0,0,{"$f":"SUM(C46:N46)","v":{"v":1500,"d":"1,500 "}},{"$f":"INDEX($C46:$O46,,SelectedPeriodColumn)/INDEX($C$72:$O$72,,SelectedPeriodColumn)","v":{"$error":"#VALUE!"}}]
[null,null,0,0,250,0,0,150,0,0,150,0,0,0,{"$f":"SUM(C47:N47)","v":{"v":550,"d":"550 "}},{"$f":"INDEX($C47:$O47,,SelectedPeriodColumn)/INDEX($C$72:$O$72,,SelectedPeriodColumn)","v":{"$error":"#VALUE!"}}]
[]
["오른쪽 셀에 비용 항목을, C49 부터 N51 셀에 월별 비용 값을 입력하거나 수정하세요. O49 에서 O51 셀에 연간 값이, P49 에서 P51 셀에 퍼센트 증가가 자동으로 계산됩니다. Q49 셀에는 스파크라인이 자동 업데이트됩니다. 다음 지침은 A53 셀에 있습니다.","서적 및 문구",{"$f":"SUM(C50:C51)","v":{"v":0,"d":"0 "}},{"v":0,"d":"0 "},{"v":325,"d":"325 "},{"v":20,"d":"20 "},{"v":20,"d":"20 "},{"v":325,"d":"325 "},{"v":10,"d":"10 "},{"v":10,"d":"10 "},{"v":400,"d":"400 "},{"v":15,"d":"15 "},{"v":15,"d":"15 "},{"v":15,"d":"15 "},{"$f":"SUM(C49:N49)","v":{"v":1155,"d":"1,155 "}},{"$f":"INDEX($C49:$O49,,SelectedPeriodColumn)/INDEX($C$72:$O$72,,SelectedPeriodColumn)","v":{"$error":"#VALUE!"}}]
[null,null,0,0,225,0,0,275,0,0,325,0,0,0,{"$f":"SUM(C50:N50)","v":{"v":825,"d":"825 "}},{"$f":"INDEX($C50:$O50,,SelectedPeriodColumn)/INDEX($C$72:$O$72,,SelectedPeriodColumn)","v":{"$error":"#VALUE!"}}]
[null,null,0,0,100,20,20,50,10,10,75,15,15,15,{"$f":"SUM(C51:N51)","v":{"v":330,"d":"330 "}},{"$f":"INDEX($C51:$O51,,SelectedPeriodColumn)/INDEX($C$72:$O$72,,SelectedPeriodColumn)","v":{"$error":"#VALUE!"}}]
[]
["오른쪽 셀에 비용 항목을, C53 부터 N57 셀에 월별 비용 값을 입력하거나 수정하세요. O53 에서 O57 셀에 연간 값이, P53 에서 P57 셀에 퍼센트 증가가 자동으로 계산됩니다. Q53 셀에는 스파크라인이 자동 업데이트됩니다. 다음 지침은 A59 셀에 있습니다.","교통비",{"$f":"SUM(C54:C57)","v":{"v":224,"d":"224 "}},{"v":174,"d":"174 "},{"v":174,"d":"174 "},{"v":219,"d":"219 "},{"v":174,"d":"174 "},{"v":174,"d":"174 "},{"v":274,"d":"274 "},{"v":219,"d":"219 "},{"v":174,"d":"174 "},{"v":174,"d":"174 "},{"v":224,"d":"224 "},{"v":269,"d":"269 "},{"$f":"SUM(C53:N53)","v":{"v":2473,"d":"2,473 "}},{"$f":"INDEX($C53:$O53,,SelectedPeriodColumn)/INDEX($C$72:$O$72,,SelectedPeriodColumn)","v":{"$error":"#VALUE!"}}]
[null,null,30,30,30,75,30,30,30,75,30,30,30,75,{"$f":"SUM(C54:N54)","v":{"v":495,"d":"495 "}},{"$f":"INDEX($C54:$O54,,SelectedPeriodColumn)/INDEX($C$72:$O$72,,SelectedPeriodColumn)","v":{"$error":"#VALUE!"}}]
[null,null,129,129,129,129,129,129,129,129,129,129,129,129,{"$f":"SUM(C55:N55)","v":{"v":1548,"d":"1,548 "}},{"$f":"INDEX($C55:$O55,,SelectedPeriodColumn)/INDEX($C$72:$O$72,,SelectedPeriodColumn)","v":{"$error":"#VALUE!"}}]
[null,null,15,15,15,15,15,15,15,15,15,15,15,15,{"$f":"SUM(C56:N56)","v":{"v":180,"d":"180 "}},{"$f":"INDEX($C56:$O56,,SelectedPeriodColumn)/INDEX($C$72:$O$72,,SelectedPeriodColumn)","v":{"$error":"#VALUE!"}}]
[null,null,50,0,0,0,0,0,100,0,0,0,50,50,{"$f":"SUM(C57:N57)","v":{"v":250,"d":"250 "}},{"$f":"INDEX($C57:$O57,,SelectedPeriodColumn)/INDEX($C$72:$O$72,,SelectedPeriodColumn)","v":{"$error":"#VALUE!"}}]
[]
["오른쪽 셀에 비용 항목을, C59 부터 N65 셀에 월별 비용 값을 입력하거나 수정하세요. O59 에서 O65 셀에 연간 값이, P59 에서 P65 셀에 퍼센트 증가가 자동으로 계산됩니다. Q59 셀에는 스파크라인이 자동 업데이트됩니다. 다음 지침은 A67 셀에 있습니다.","재량지출",{"$f":"SUM(C60:C65)","v":{"v":69,"d":"69 "}},{"v":69,"d":"69 "},{"v":169,"d":"169 "},{"v":369,"d":"369 "},{"v":419,"d":"419 "},{"v":444,"d":"444 "},{"v":419,"d":"419 "},{"v":419,"d":"419 "},{"v":394,"d":"394 "},{"v":394,"d":"394 "},{"v":419,"d":"419 "},{"v":469,"d":"469 "},{"$f":"SUM(C59:N59)","v":{"v":4053,"d":"4,053 "}},{"$f":"INDEX($C59:$O59,,SelectedPeriodColumn)/INDEX($C$72:$O$72,,SelectedPeriodColumn)","v":{"$error":"#VALUE!"}}]
[null,null,0,0,0,50,100,100,100,100,75,75,100,100,{"v":800,"d":"800 "},{"$f":"INDEX($C60:$O60,,SelectedPeriodColumn)/INDEX($C$72:$O$72,,SelectedPeriodColumn)","v":{"$error":"#VALUE!"}}]
[null,null,69,69,69,69,69,69,69,69,69,69,69,69,{"v":828,"d":"828 "},{"$f":"INDEX($C61:$O61,,SelectedPeriodColumn)/INDEX($C$72:$O$72,,SelectedPeriodColumn)","v":{"$error":"#VALUE!"}}]
[null,null,0,0,0,0,0,25,0,0,0,0,0,50,{"v":75,"d":"75 "},{"$f":"INDEX($C62:$O62,,SelectedPeriodColumn)/INDEX($C$72:$O$72,,SelectedPeriodColumn)","v":{"$error":"#VALUE!"}}]
[null,null,0,0,100,100,100,100,100,100,100,100,100,100,{"v":1000,"d":"1,000 "},{"$f":"INDEX($C63:$O63,,SelectedPeriodColumn)/INDEX($C$72:$O$72,,SelectedPeriodColumn)","v":{"$error":"#VALUE!"}}]
[null,null,0,0,0,50,50,50,50,50,50,50,50,50,{"v":450,"d":"450 "},{"$f":"INDEX($C64:$O64,,SelectedPeriodColumn)/INDEX($C$72:$O$72,,SelectedPeriodColumn)","v":{"$error":"#VALUE!"}}]
[null,null,0,0,0,100,100,100,100,100,100,100,100,100,{"v":900,"d":"900 "},{"$f":"INDEX($C65:$O65,,SelectedPeriodColumn)/INDEX($C$72:$O$72,,SelectedPeriodColumn)","v":{"$error":"#VALUE!"}}]
[]
["오른쪽 셀에 비용 항목을, C67 부터 N70 셀에 월별 비용 값을 입력하거나 수정하세요. O67 에서 O70 셀에 연간 값이, P67 에서 P70 셀에 퍼센트 증가가 자동으로 계산됩니다. Q67 셀에는 스파크라인이 자동 업데이트됩니다. A72 셀에 다음 지침이 표시됩니다.","기타 경비",{"$f":"SUM(C68:C70)","v":{"v":198,"d":"198 "}},{"$f":"SUM(D68:D70)","v":{"v":198,"d":"198 "}},{"v":250,"d":"250 "},{"v":253,"d":"253 "},{"v":243,"d":"243 "},{"v":238,"d":"238 "},{"v":233,"d":"233 "},{"v":258,"d":"258 "},{"v":263,"d":"263 "},{"v":268,"d":"268 "},{"v":268,"d":"268 "},{"v":268,"d":"268 "},{"$f":"SUM(C67:N67)","v":{"v":2938,"d":"2,938 "}},{"$f":"INDEX($C67:$O67,,SelectedPeriodColumn)/INDEX($C$72:$O$72,,SelectedPeriodColumn)","v":{"$error":"#VALUE!"}}]
[null,null,123,123,123,123,123,123,123,123,123,123,123,123,{"$f":"SUM(C68:N68)","v":{"v":1476,"d":"1,476 "}},{"$f":"INDEX($C68:$O68,,SelectedPeriodColumn)/INDEX($C$72:$O$72,,SelectedPeriodColumn)","v":{"$error":"#VALUE!"}}]
[null,null,0,0,52,55,45,40,35,60,65,70,70,70,{"$f":"SUM(C69:N69)","v":{"v":562,"d":"562 "}},{"$f":"INDEX($C69:$O69,,SelectedPeriodColumn)/INDEX($C$72:$O$72,,SelectedPeriodColumn)","v":{"$error":"#VALUE!"}}]
[null,null,75,75,75,75,75,75,75,75,75,75,75,75,{"$f":"SUM(C70:N70)","v":{"v":900,"d":"900 "}},{"$f":"INDEX($C70:$O70,,SelectedPeriodColumn)/INDEX($C$72:$O$72,,SelectedPeriodColumn)","v":{"$error":"#VALUE!"}}]
[]
["오른쪽 셀에 총 비용 레이블이 있습니다. C72 부터 N72 셀에는 각 월에 대한 총 비용이, O72 셀에는 연간 비용이, P72 에는 퍼센트 증가가 자동 계산됩니다. Q72 셀에는 스파크라인이 자동 업데이트됩니다.","경비 합계",{"$f":"SUM(C40,C45,C49,C53,C59,C67)","v":{"v":1056,"d":"1,056 "}},{"v":1006,"d":"1,006 "},{"v":2233,"d":"2,233 "},{"v":1426,"d":"1,426 "},{"v":1421,"d":"1,421 "},{"v":2396,"d":"2,396 "},{"v":1501,"d":"1,501 "},{"v":1471,"d":"1,471 "},{"v":2446,"d":"2,446 "},{"v":1416,"d":"1,416 "},{"v":1491,"d":"1,491 "},{"v":1586,"d":"1,586 "},{"$f":"SUM(C72:N72)","v":{"v":19449,"d":"19,449 "}},{"$f":"INDEX($C72:$O72,,SelectedPeriodColumn)/INDEX($C$72:$O$72,,SelectedPeriodColumn)","v":{"$error":"#VALUE!"}}]

{"sheet":"chart_calcs","index":2,"n_rows":23,"n_cols":16,"rows_kept":23,"hidden":true}
["*** 이 시트는 숨겨진 상태로 유지되어야 합니다.*** "]
[]
[{"$nulls":3},{"$f":"IFERROR(LOWER(TEXT(VALUE(LEFT(SelectedPeriod,LEN(SelectedPeriod)-2))&\"/1\",\"m월\")),\"연도\")","v":"연도"}]
[]
[{"$nulls":3},"동적 차트 제목"]
[{"$nulls":3},{"$f":"D3&\" 수입:\"","v":"연도 수입:"},null,{"$f":"TEXT(INDEX('월간 대학 예산'!$C$37:$O$37,,SelectedPeriodColumn),\"₩#,##\")","v":{"$error":"#VALUE!"}}]
[{"$nulls":3},{"$f":"D3&\" 지출:\"","v":"연도 지출:"},null,{"$f":"TEXT(INDEX('월간 대학 예산'!$C$72:$O$72,,SelectedPeriodColumn),\"₩#,##\")","v":{"$error":"#VALUE!"}}]
[{"$nulls":3},{"$f":"D3&\" 현금 흐름:\"","v":"연도 현금 흐름:"},{"$f":"INDEX('월간 대학 예산'!C28:O28,ScrollBarValue)","v":169},{"$f":"TEXT(E8,\"₩#,##\")","v":"₩169"}]
[]
[]
[]
[{"$nulls":3},{"$f":"LOWER('월간 대학 예산'!C27)","v":{"$error":"#VALUE!"}},{"$f":"LOWER('월간 대학 예산'!D27)","v":{"$error":"#VALUE!"}},{"$f":"LOWER('월간 대학 예산'!E27)","v":{"$error":"#VALUE!"}},{"$f":"LOWER('월간 대학 예산'!F27)","v":{"$error":"#VALUE!"}},{"$f":"LOWER('월간 대학 예산'!G27)","v":{"$error":"#VALUE!"}},{"$f":"LOWER('월간 대학 예산'!H27)","v":{"$error":"#VALUE!"}},{"$f":"LOWER('월간 대학 예산'!I27)","v":{"$error":"#VALUE!"}},{"$f":"LOWER('월간 대학 예산'!J27)","v":{"$error":"#VALUE!"}},{"$f":"LOWER('월간 대학 예산'!K27)","v":{"$error":"#VALUE!"}},{"$f":"LOWER('월간 대학 예산'!L27)","v":{"$error":"#VALUE!"}},{"$f":"LOWER('월간 대학 예산'!M27)","v":{"$error":"#VALUE!"}},{"$f":"LOWER('월간 대학 예산'!N27)","v":{"$error":"#VALUE!"}},{"$f":"LOWER('월간 대학 예산'!O27)","v":"연도  "}]
[null,null,"스크롤 막대 값 ",1]
[null,null,"현금 흐름 차트 ",{"$f":"IF(SelectedPeriod='월간 대학 예산'!C$31,IF('월간 대학 예산'!$C$28:$O$28>=0,'월간 대학 예산'!$C$28:$O$28,NA()),NA())","v":{"$error":"#VALUE!"}},{"$f":"IF(SelectedPeriod='월간 대학 예산'!D$31,IF('월간 대학 예산'!$C$28:$O$28>=0,'월간 대학 예산'!$C$28:$O$28,NA()),NA())","v":{"$error":"#VALUE!"}},{"$f":"IF(SelectedPeriod='월간 대학 예산'!E$31,IF('월간 대학 예산'!$C$28:$O$28>=0,'월간 대학 예산'!$C$28:$O$28,NA()),NA())","v":{"$error":"#VALUE!"}},{"$f":"IF(SelectedPeriod='월간 대학 예산'!F$31,IF('월간 대학 예산'!$C$28:$O$28>=0,'월간 대학 예산'!$C$28:$O$28,NA()),NA())","v":{"$error":"#VALUE!"}},{"$f":"IF(SelectedPeriod='월간 대학 예산'!G$31,IF('월간 대학 예산'!$C$28:$O$28>=0,'월간 대학 예산'!$C$28:$O$28,NA()),NA())","v":{"$error":"#VALUE!"}},{"$f":"IF(SelectedPeriod='월간 대학 예산'!H$31,IF('월간 대학 예산'!$C$28:$O$28>=0,'월간 대학 예산'!$C$28:$O$28,NA()),NA())","v":{"$error":"#VALUE!"}},{"$f":"IF(SelectedPeriod='월간 대학 예산'!I$31,IF('월간 대학 예산'!$C$28:$O$28>=0,'월간 대학 예산'!$C$28:$O$28,NA()),NA())","v":{"$error":"#VALUE!"}},{"$f":"IF(SelectedPeriod='월간 대학 예산'!J$31,IF('월간 대학 예산'!$C$28:$O$28>=0,'월간 대학 예산'!$C$28:$O$28,NA()),NA())","v":{"$error":"#VALUE!"}},{"$f":"IF(SelectedPeriod='월간 대학 예산'!K$31,IF('월간 대학 예산'!$C$28:$O$28>=0,'월간 대학 예산'!$C$28:$O$28,NA()),NA())","v":{"$error":"#VALUE!"}},{"$f":"IF(SelectedPeriod='월간 대학 예산'!L$31,IF('월간 대학 예산'!$C$28:$O$28>=0,'월간 대학 예산'!$C$28:$O$28,NA()),NA())","v":{"$error":"#VALUE!"}},{"$f":"IF(SelectedPeriod='월간 대학 예산'!M$31,IF('월간 대학 예산'!$C$28:$O$28>=0,'월간 대학 예산'!$C$28:$O$28,NA()),NA())","v":{"$error":"#VALUE!"}},{"$f":"IF(SelectedPeriod='월간 대학 예산'!N$31,IF('월간 대학 예산'!$C$28:$O$28>=0,'월간 대학 예산'!$C$28:$O$28,NA()),NA())","v":{"$error":"#VALUE!"}},{"$f":"IF(SelectedPeriod='월간 대학 예산'!O$31,IF('월간 대학 예산'!$C$28:$O$28>=0,'월간 대학 예산'!$C$28:$O$28,NA()),NA())","v":{"$error":"#VALUE!"}}]
[null,null,"누적: ",{"$f":"IF(SelectedPeriod='월간 대학 예산'!C$31,IF('월간 대학 예산'!$C$28:$O$28<0,'월간 대학 예산'!$C$28:$O$28,NA()),NA())","v":{"$error":"#VALUE!"}},{"$f":"IF(SelectedPeriod='월간 대학 예산'!D$31,IF('월간 대학 예산'!$C$28:$O$28<0,'월간 대학 예산'!$C$28:$O$28,NA()),NA())","v":{"$error":"#VALUE!"}},{"$f":"IF(SelectedPeriod='월간 대학 예산'!E$31,IF('월간 대학 예산'!$C$28:$O$28<0,'월간 대학 예산'!$C$28:$O$28,NA()),NA())","v":{"$error":"#VALUE!"}},{"$f":"IF(SelectedPeriod='월간 대학 예산'!F$31,IF('월간 대학 예산'!$C$28:$O$28<0,'월간 대학 예산'!$C$28:$O$28,NA()),NA())","v":{"$error":"#VALUE!"}},{"$f":"IF(SelectedPeriod='월간 대학 예산'!G$31,IF('월간 대학 예산'!$C$28:$O$28<0,'월간 대학 예산'!$C$28:$O$28,NA()),NA())","v":{"$error":"#VALUE!"}},{"$f":"IF(SelectedPeriod='월간 대학 예산'!H$31,IF('월간 대학 예산'!$C$28:$O$28<0,'월간 대학 예산'!$C$28:$O$28,NA()),NA())","v":{"$error":"#VALUE!"}},{"$f":"IF(SelectedPeriod='월간 대학 예산'!I$31,IF('월간 대학 예산'!$C$28:$O$28<0,'월간 대학 예산'!$C$28:$O$28,NA()),NA())","v":{"$error":"#VALUE!"}},{"$f":"IF(SelectedPeriod='월간 대학 예산'!J$31,IF('월간 대학 예산'!$C$28:$O$28<0,'월간 대학 예산'!$C$28:$O$28,NA()),NA())","v":{"$error":"#VALUE!"}},{"$f":"IF(SelectedPeriod='월간 대학 예산'!K$31,IF('월간 대학 예산'!$C$28:$O$28<0,'월간 대학 예산'!$C$28:$O$28,NA()),NA())","v":{"$error":"#VALUE!"}},{"$f":"IF(SelectedPeriod='월간 대학 예산'!L$31,IF('월간 대학 예산'!$C$28:$O$28<0,'월간 대학 예산'!$C$28:$O$28,NA()),NA())","v":{"$error":"#VALUE!"}},{"$f":"IF(SelectedPeriod='월간 대학 예산'!M$31,IF('월간 대학 예산'!$C$28:$O$28<0,'월간 대학 예산'!$C$28:$O$28,NA()),NA())","v":{"$error":"#VALUE!"}},{"$f":"IF(SelectedPeriod='월간 대학 예산'!N$31,IF('월간 대학 예산'!$C$28:$O$28<0,'월간 대학 예산'!$C$28:$O$28,NA()),NA())","v":{"$error":"#VALUE!"}},{"$f":"IF(SelectedPeriod='월간 대학 예산'!O$31,IF('월간 대학 예산'!$C$28:$O$28<0,'월간 대학 예산'!$C$28:$O$28,NA()),NA())","v":{"$error":"#VALUE!"}}]
[]
[]
[null,null,"수입 차트 데이터"]
[null,null,"지급되는 재정 보조금 (보조금, 장학금, 대출금)",{"$f":"'월간 대학 예산'!P32","v":{"$error":"#VALUE!"}}]
[null,null,"작업의 세후 급여",{"$f":"'월간 대학 예산'!P33","v":{"$error":"#VALUE!"}}]
[null,null,"가족의 재정 지원",{"$f":"'월간 대학 예산'!P34","v":{"$error":"#VALUE!"}}]
[null,null,"저축에서 인출",{"$f":"'월간 대학 예산'!P35","v":{"$error":"#VALUE!"}}]
[null,null,"기타 (아동 양육비, 공공 보조금, 선물 등)",{"$f":"'월간 대학 예산'!P36","v":{"$error":"#VALUE!"}}]