{"text_format":"3","workbook":"xlsx","n_sheets":2,"sheets":["직원 근무 시간 기록표","요일_조회"],"not_rendered":{"defined_names":27},"read":"whole","date_system":"1900"}

{"sheet":"직원 근무 시간 기록표","index":0,"n_rows":36,"n_cols":26,"rows_kept":36,"merged":[[0,1,2,4],[0,5,2,9],[0,10,2,14],[0,15,3,23],[0,24,3,24],[3,1,3,3],[3,5,3,9],[3,10,3,14],[4,1,6,3],[4,4,6,6],[5,14,7,14],[5,22,7,22],[5,23,7,23],[5,24,7,24],[21,1,21,6],[22,1,23,3],[22,4,23,6],[23,14,24,14],[23,22,24,22],[23,23,24,23],[23,24,24,24],[32,1,32,6],[32,24,33,24],[32,25,33,25],[33,1,33,6],[34,1,34,6],[35,1,35,3],[35,4,35,5],[35,6,35,7],[35,8,35,14],[35,15,35,16],[35,17,35,23]]}
[null,"운영 직원 근무 시간 기록표",{"$nulls":3},"직원 이름",{"$nulls":9},"초과 근무인 경우 오른쪽 셀에서 예 선택 \n승인 필요"]
[]
[]
[null,"급여 종료 날짜",null,null,{"$f":"V7","v":"2025-06-14"},"직원 번호:"]
[null,"정규 근무 시간:",null,null,"날짜:"]
[{"$nulls":14},"합계\n주 1\n정규 근무",{"$nulls":7},"합계\n주 2\n정규 근무","합계\n정규 근무\n시간","급여\n명세서 전용\n지급 코드"]
[{"$nulls":7},"2025-06-01",{"$f":"하루_일+1","v":"2025-06-02"},{"$f":"하루_일+2","v":"2025-06-03"},{"$f":"하루_일+3","v":"2025-06-04"},{"$f":"하루_일+4","v":"2025-06-05"},{"$f":"하루_일+5","v":"2025-06-06"},{"$f":"하루_일+6","v":"2025-06-07"},null,{"$f":"하루_일+7","v":"2025-06-08"},{"$f":"하루_일+8","v":"2025-06-09"},{"$f":"하루_일+9","v":"2025-06-10"},{"$f":"하루_일+10","v":"2025-06-11"},{"$f":"하루_일+11","v":"2025-06-12"},{"$f":"하루_일+12","v":"2025-06-13"},{"$f":"하루_일+13","v":"2025-06-14"}]
[null,"작업","위치","작업 지시서 번호","작업 설명","직위","직위 번호",{"$f":"VLOOKUP(WEEKDAY(하루_일),요일_조회!$B$2:$C$8,2)","v":"일"},{"$f":"VLOOKUP(WEEKDAY(I7),요일_조회!$B$2:$C$8,2)","v":"월"},{"$f":"VLOOKUP(WEEKDAY(J7),요일_조회!$B$2:$C$8,2)","v":"화"},{"$f":"VLOOKUP(WEEKDAY(K7),요일_조회!$B$2:$C$8,2)","v":"수"},{"$f":"VLOOKUP(WEEKDAY(L7),요일_조회!$B$2:$C$8,2)","v":"목"},{"$f":"VLOOKUP(WEEKDAY(M7),요일_조회!$B$2:$C$8,2)","v":"금"},{"$f":"VLOOKUP(WEEKDAY(N7),요일_조회!$B$2:$C$8,2)","v":"토"},null,{"$f":"VLOOKUP(WEEKDAY(P7),요일_조회!$B$2:$C$8,2)","v":"일"},{"$f":"VLOOKUP(WEEKDAY(Q7),요일_조회!$B$2:$C$8,2)","v":"월"},{"$f":"VLOOKUP(WEEKDAY(R7),요일_조회!$B$2:$C$8,2)","v":"화"},{"$f":"VLOOKUP(WEEKDAY(S7),요일_조회!$B$2:$C$8,2)","v":"수"},{"$f":"VLOOKUP(WEEKDAY(T7),요일_조회!$B$2:$C$8,2)","v":"목"},{"$f":"VLOOKUP(WEEKDAY(U7),요일_조회!$B$2:$C$8,2)","v":"금"},{"$f":"VLOOKUP(WEEKDAY(V7),요일_조회!$B$2:$C$8,2)","v":"토"}]
[{"$nulls":14},{"$f":"SUM(H9:N9)","v":{"v":0,"d":"0.00"}},{"$nulls":7},{"$f":"SUM(P9:V9)","v":{"v":0,"d":"0.00"}},{"$f":"O9+W9","v":{"v":0,"d":"0.00"}}]
[{"$nulls":14},{"v":0,"d":"0.00"},{"$nulls":7},{"v":0,"d":"0.00"},{"v":0,"d":"0.00"}]
[{"$nulls":14},{"v":0,"d":"0.00"},{"$nulls":7},{"v":0,"d":"0.00"},{"v":0,"d":"0.00"}]
[{"$nulls":14},{"v":0,"d":"0.00"},{"$nulls":7},{"v":0,"d":"0.00"},{"v":0,"d":"0.00"}]
[{"$nulls":14},{"v":0,"d":"0.00"},{"$nulls":7},{"v":0,"d":"0.00"},{"v":0,"d":"0.00"}]
[{"$nulls":14},{"v":0,"d":"0.00"},{"$nulls":7},{"v":0,"d":"0.00"},{"v":0,"d":"0.00"}]
[{"$nulls":14},{"v":0,"d":"0.00"},{"$nulls":7},{"v":0,"d":"0.00"},{"v":0,"d":"0.00"}]
[{"$nulls":14},{"$f":"SUM(H16:N16)","v":{"v":0,"d":"0.00"}},{"$nulls":7},{"$f":"SUM(P16:V16)","v":{"v":0,"d":"0.00"}},{"$f":"O16+W16","v":{"v":0,"d":"0.00"}}]
[{"$nulls":14},{"v":0,"d":"0.00"},{"$nulls":7},{"v":0,"d":"0.00"},{"v":0,"d":"0.00"}]
[{"$nulls":14},{"v":0,"d":"0.00"},{"$nulls":7},{"v":0,"d":"0.00"},{"v":0,"d":"0.00"}]
[{"$nulls":14},{"v":0,"d":"0.00"},{"$nulls":7},{"v":0,"d":"0.00"},{"v":0,"d":"0.00"}]
[{"$nulls":14},{"v":0,"d":"0.00"},{"$nulls":7},{"v":0,"d":"0.00"},{"v":0,"d":"0.00"}]
[{"$nulls":14},{"v":0,"d":"0.00"},{"$nulls":7},{"v":0,"d":"0.00"},{"v":0,"d":"0.00"}]
[null,"정규 근무 시간 합계   ",{"$nulls":5},{"$f":"SUM(H9:H21)","v":{"v":0,"d":"0.00"}},{"v":0,"d":"0.00"},{"v":0,"d":"0.00"},{"v":0,"d":"0.00"},{"v":0,"d":"0.00"},{"v":0,"d":"0.00"},{"v":0,"d":"0.00"},{"v":0,"d":"0.00"},{"v":0,"d":"0.00"},{"$f":"SUM(Q9:Q21)","v":{"v":0,"d":"0.00"}},{"v":0,"d":"0.00"},{"v":0,"d":"0.00"},{"v":0,"d":"0.00"},{"v":0,"d":"0.00"},{"v":0,"d":"0.00"},{"$f":"SUM(W9:W21)","v":{"v":0,"d":"0.00"}},{"$f":"SUM(X9:X21)","v":{"v":0,"d":"0.00"}}]
[null,"초과 근무 시간:",null,null,"날짜:"]
[{"$nulls":7},{"$f":"하루_일","v":"2025-06-01"},{"$f":"하루_일+1","v":"2025-06-02"},{"$f":"하루_일+2","v":"2025-06-03"},{"$f":"하루_일+3","v":"2025-06-04"},{"$f":"하루_일+4","v":"2025-06-05"},{"$f":"하루_일+5","v":"2025-06-06"},{"$f":"하루_일+6","v":"2025-06-07"},"주 1 초과 근무",{"$f":"하루_일+7","v":"2025-06-08"},{"$f":"하루_일+8","v":"2025-06-09"},{"$f":"하루_일+9","v":"2025-06-10"},{"$f":"하루_일+10","v":"2025-06-11"},{"$f":"하루_일+11","v":"2025-06-12"},{"$f":"하루_일+12","v":"2025-06-13"},{"$f":"하루_일+13","v":"2025-06-14"},"주 2 초과 근무","초과 근무 합계","초과 근무 \n시간 번호"]
[null,"작업","위치","작업 지시서 번호","작업 설명","직위","직위 번호",{"$f":"VLOOKUP(WEEKDAY(하루_일),요일_조회!$B$2:$C$8,2)","v":"일"},{"$f":"VLOOKUP(WEEKDAY(I24),요일_조회!$B$2:$C$8,2)","v":"월"},{"$f":"VLOOKUP(WEEKDAY(J24),요일_조회!$B$2:$C$8,2)","v":"화"},{"$f":"VLOOKUP(WEEKDAY(K24),요일_조회!$B$2:$C$8,2)","v":"수"},{"$f":"VLOOKUP(WEEKDAY(L24),요일_조회!$B$2:$C$8,2)","v":"목"},{"$f":"VLOOKUP(WEEKDAY(M24),요일_조회!$B$2:$C$8,2)","v":"금"},{"$f":"VLOOKUP(WEEKDAY(N24),요일_조회!$B$2:$C$8,2)","v":"토"},null,{"$f":"VLOOKUP(WEEKDAY(P24),요일_조회!$B$2:$C$8,2)","v":"일"},{"$f":"VLOOKUP(WEEKDAY(Q24),요일_조회!$B$2:$C$8,2)","v":"월"},{"$f":"VLOOKUP(WEEKDAY(R24),요일_조회!$B$2:$C$8,2)","v":"화"},{"$f":"VLOOKUP(WEEKDAY(S24),요일_조회!$B$2:$C$8,2)","v":"수"},{"$f":"VLOOKUP(WEEKDAY(T24),요일_조회!$B$2:$C$8,2)","v":"목"},{"$f":"VLOOKUP(WEEKDAY(U24),요일_조회!$B$2:$C$8,2)","v":"금"},{"$f":"VLOOKUP(WEEKDAY(V24),요일_조회!$B$2:$C$8,2)","v":"토"}]
[{"$nulls":14},{"$f":"SUM(H26:N26)","v":{"v":0,"d":"0.00"}},{"$nulls":7},{"$f":"SUM(P26:V26)","v":{"v":0,"d":"0.00"}},{"$f":"O26+W26","v":{"v":0,"d":"0.00"}}]
[{"$nulls":14},{"v":0,"d":"0.00"},{"$nulls":7},{"v":0,"d":"0.00"},{"v":0,"d":"0.00"}]
[{"$nulls":14},{"v":0,"d":"0.00"},{"$nulls":7},{"v":0,"d":"0.00"},{"v":0,"d":"0.00"}]
[{"$nulls":14},{"v":0,"d":"0.00"},{"$nulls":7},{"v":0,"d":"0.00"},{"v":0,"d":"0.00"}]
[{"$nulls":14},{"v":0,"d":"0.00"},{"$nulls":7},{"v":0,"d":"0.00"},{"v":0,"d":"0.00"}]
[{"$nulls":14},{"v":0,"d":"0.00"},{"$nulls":7},{"v":0,"d":"0.00"},{"v":0,"d":"0.00"}]
[{"$nulls":14},{"v":0,"d":"0.00"},{"$nulls":7},{"v":0,"d":"0.00"},{"v":0,"d":"0.00"}]
[null,"초과 근무 시간 합계     ",{"$nulls":5},{"$f":"SUM(H26:H32)","v":{"v":0,"d":"0.00"}},{"v":0,"d":"0.00"},{"v":0,"d":"0.00"},{"v":0,"d":"0.00"},{"v":0,"d":"0.00"},{"v":0,"d":"0.00"},{"v":0,"d":"0.00"},{"$f":"SUM(O26:O32)","v":{"v":0,"d":"0.00"}},{"v":0,"d":"0.00"},{"v":0,"d":"0.00"},{"v":0,"d":"0.00"},{"v":0,"d":"0.00"},{"v":0,"d":"0.00"},{"v":0,"d":"0.00"},{"v":0,"d":"0.00"},{"$f":"SUM(P33:V33)","v":{"v":0,"d":"0.00"}},{"$f":"SUM(X26:X32)","v":{"v":0,"d":"0.00"}},"합계 시간\n근무 시간","합계 시간\n기한"]
[null,"초과 근무 수당     ",{"$nulls":12},{"$f":"IF(SUM(H34:N34)<=O33,SUM(H34:N34),O33)","v":{"v":0,"d":"0.00"}},{"$nulls":7},{"$f":"IF(SUM(P34:V34)<=W33,SUM(P34:V34),W33)","v":{"v":0,"d":"0.00"}},{"$f":"IF(SUM(Q34:W34)<=X33,SUM(Q34:W34),X33)","v":{"v":0,"d":"0.00"}}]
[null,"초과 근무 지급     ",{"$nulls":5},{"$f":"IF(H33>=H34,H33-H34,H33)","v":{"v":0,"d":"0.00"}},{"$f":"IF(I33>=I34,I33-I34,I33)","v":{"v":0,"d":"0.00"}},{"v":0,"d":"0.00"},{"v":0,"d":"0.00"},{"v":0,"d":"0.00"},{"v":0,"d":"0.00"},{"v":0,"d":"0.00"},{"v":0,"d":"0.00"},{"v":0,"d":"0.00"},{"v":0,"d":"0.00"},{"v":0,"d":"0.00"},{"v":0,"d":"0.00"},{"v":0,"d":"0.00"},{"v":0,"d":"0.00"},{"v":0,"d":"0.00"},{"$f":"IF(W33>=W34,W33-W34,W33)","v":{"v":0,"d":"0.00"}},{"$f":"IF(X33>=X34,X33-X34,X33)","v":{"v":0,"d":"0.00"}},{"$f":"$X$22+$X$33","v":{"v":0,"d":"0.00"}},{"$f":"X22+X35","v":{"v":0,"d":"0.00"}}]
[null,"직원 ",{"$nulls":4},"관리자 ",{"$nulls":8},"관리자 "]

{"sheet":"요일_조회","index":1,"n_rows":8,"n_cols":3,"rows_kept":8}
[null,"요일\n번호","요일\n이니셜"]
[null,1,"일"]
[null,2,"월"]
[null,3,"화"]
[null,4,"수"]
[null,5,"목"]
[null,6,"금"]
[null,7,"토"]