{"text_format":"3","workbook":"xlsx","n_sheets":3,"sheets":["Оқыту ені","Курс тізімі","Қызметкер туралы ақпарат"],"not_rendered":{"defined_names":13},"read":"whole","date_system":"1900"}

{"sheet":"Оқыту ені","index":0,"n_rows":22,"n_cols":9,"rows_kept":22}
[]
[]
[null,null,"ОҚЫТУ ЖҰРНАЛЫ"]
{"$rows_empty":8}
[null,null,"ОҚУ КУРСЫНЫҢ КҮНІ","АТЫ","КУРС","ЖАТТЫҚТЫРУШЫ","ӨТКЕН","ТАПСЫРУ/ТАПСЫРМАУ","ЕСКЕРТПЕЛЕР"]
[null,null,"2012-06-01","Ахметов, Олжас","Қызметкерге кіріспе",{"$f":"IF(tblTrainingLog[[#This Row],[КУРС]]=\"\",\"\",IFERROR(VLOOKUP(tblTrainingLog[[#This Row],[КУРС]],'Курс тізімі'!$C$6:$F$10,2,0),\"Not Found\"))","v":"Сабит Бөгенбаев"},"Иә","Тапсыру","Тамаша жаттықтырушы."]
[null,null,"2012-06-02","Мұрат Көгенбаев","Қызметкерге кіріспе",{"$f":"IF(tblTrainingLog[[#This Row],[КУРС]]=\"\",\"\",IFERROR(VLOOKUP(tblTrainingLog[[#This Row],[КУРС]],'Курс тізімі'!$C$6:$F$10,2,0),\"Not Found\"))","v":"Сабит Бөгенбаев"},"Иә","Тапсырмау","Аяқтау мүмкін емес, ертерек кету қажет."]
[null,null,"2012-06-03","Олжас Нариманов","Қызметкерге кіріспе",{"$f":"IF(tblTrainingLog[[#This Row],[КУРС]]=\"\",\"\",IFERROR(VLOOKUP(tblTrainingLog[[#This Row],[КУРС]],'Курс тізімі'!$C$6:$F$10,2,0),\"Not Found\"))","v":"Сабит Бөгенбаев"},"Иә","Тапсыру","Осы тоқсандағы соңғы ұсыныс."]
[null,null,"2012-06-03","Мұрат Көгенбаев","Қызметкерге кіріспе",{"$f":"IF(tblTrainingLog[[#This Row],[КУРС]]=\"\",\"\",IFERROR(VLOOKUP(tblTrainingLog[[#This Row],[КУРС]],'Курс тізімі'!$C$6:$F$10,2,0),\"Not Found\"))","v":"Сабит Бөгенбаев"},"Иә","Тапсыру","Осы тоқсандағы соңғы ұсыныс."]
[null,null,"2012-06-04","Мұрат Көгенбаев","Қызметші әрекеттері",{"$f":"IF(tblTrainingLog[[#This Row],[КУРС]]=\"\",\"\",IFERROR(VLOOKUP(tblTrainingLog[[#This Row],[КУРС]],'Курс тізімі'!$C$6:$F$10,2,0),\"Not Found\"))","v":"Камшат Ақылбекова"},"Иә","Тапсыру","Осы тоқсандағы бастапқы ұсыныс."]
[null,null,"2012-06-04","Олжас Нариманов","Қызметші әрекеттері",{"$f":"IF(tblTrainingLog[[#This Row],[КУРС]]=\"\",\"\",IFERROR(VLOOKUP(tblTrainingLog[[#This Row],[КУРС]],'Курс тізімі'!$C$6:$F$10,2,0),\"Not Found\"))","v":"Камшат Ақылбекова"},"Иә","Тапсыру","Осы тоқсандағы бастапқы ұсыныс."]
[null,null,"2012-06-04","Олжас Нариманов","Аралық есеп",{"$f":"IF(tblTrainingLog[[#This Row],[КУРС]]=\"\",\"\",IFERROR(VLOOKUP(tblTrainingLog[[#This Row],[КУРС]],'Курс тізімі'!$C$6:$F$10,2,0),\"Not Found\"))","v":"Камшат Ақылбекова"},"Иә","Тапсыру","Тек қана жабық аудитория."]
[null,null,"2012-06-04","Ахметов, Олжас","Қызметші әрекеттері",{"$f":"IF(tblTrainingLog[[#This Row],[КУРС]]=\"\",\"\",IFERROR(VLOOKUP(tblTrainingLog[[#This Row],[КУРС]],'Курс тізімі'!$C$6:$F$10,2,0),\"Not Found\"))","v":"Камшат Ақылбекова"},"Иә","Тапсыру","Осы тоқсандағы бастапқы ұсыныс."]
[null,null,"2012-06-05","Ахметов, Олжас","Аралық есеп",{"$f":"IF(tblTrainingLog[[#This Row],[КУРС]]=\"\",\"\",IFERROR(VLOOKUP(tblTrainingLog[[#This Row],[КУРС]],'Курс тізімі'!$C$6:$F$10,2,0),\"Not Found\"))","v":"Камшат Ақылбекова"},"Жоқ","Келешек","Әлі орындалмаған."]
[null,null,"2012-06-05","Мұрат Көгенбаев","Қосымша есеп",{"$f":"IF(tblTrainingLog[[#This Row],[КУРС]]=\"\",\"\",IFERROR(VLOOKUP(tblTrainingLog[[#This Row],[КУРС]],'Курс тізімі'!$C$6:$F$10,2,0),\"Not Found\"))","v":"Сабит Бөгенбаев"},"Жоқ","Келешек","Әлі орындалмаған."]

{"sheet":"Курс тізімі","index":1,"n_rows":10,"n_cols":6,"rows_kept":10}
[]
[]
[null,null,"КУРС ТІЗІМІ"]
[]
[null,null,"ЛАУАЗЫМЫ","ЖАТТЫҚТЫРУШЫ","СИПАТТАМА","САҒАТ"]
[null,null,"Қызметкерге кіріспе","Сабит Бөгенбаев","Жаңа қызметкерлер үшін негізгі курсқа кіріспе. Уақыт жақтаулары мен шектері сияқты бөлім мақсаттары мен күтулерін анықтайды.",2]
[null,null,"Қызметші әрекеттері","Камшат Ақылбекова","Қызметкердің нұсқауын қамтитын негізгі қызметкер әрекеттері.",1]
[null,null,"Қызметші әрекеттері","Сабит Бөгенбаев","Негізгі есеп процедуралары мен нұсқаулары",1.5]
[null,null,"Аралық есеп","Камшат Ақылбекова","Аралық есеп процедуралары мен нұсқаулары",2]
[null,null,"Қосымша есеп","Сабит Бөгенбаев","Қосымша есеп процедуралары мен нұсқаулары",2]

{"sheet":"Қызметкер туралы ақпарат","index":2,"n_rows":9,"n_cols":5,"rows_kept":9}
[]
[]
[null,null,"ҚЫЗМЕТКЕРЛЕР АҚПАРАТЫ"]
[]
[null,null,"АТЫ","БӨЛІМ","ЛАУАЗЫМЫ"]
[null,null,"Ахметов, Олжас","Сатылымдар","Жетекші есепші"]
[null,null,"Мұрат Көгенбаев","Қаржылық","Есепші"]
[null,null,"Олжас Нариманов","Қаржылық","Есепші"]
[null,null,"Айгерім Шаманова","Қаржылық","Есепші"]