{"text_format":"3","workbook":"xlsx","n_sheets":6,"sheets":["家計記録","費目・適用表","家計分析","家計記録使い方","費目・適用表使い方","家計分析 使い方"],"not_rendered":{"charts":4,"defined_names":7,"comments":1},"read":"whole","date_system":"1900"}

{"sheet":"家計記録","index":0,"n_rows":163,"n_cols":9,"rows_kept":163,"merged":[[0,0,0,8],[2,6,2,7],[4,2,4,3],[4,5,4,6]]}
["家計支出記録ノート"]
[]
[null,"月分",{"$nulls":4},"合計金額",null,{"$f":"SUM(H6:H163)","v":{"v":0,"d":"¥0"}}]
[]
["NO","日付","費目",null,"詳細","適用",null,"金額","備考"]
[1,null,null,{"$f":"IF(C6=\"\",\"\",VLOOKUP(C6,費目・適用表!$A$3:$B$12,2,FALSE))","v":""},null,null,{"$f":"IF(F6=\"\",\"\",VLOOKUP(F6,費目・適用表!$A$16:$B$25,2,FALSE))","v":""}]
[2,null,null,{"$f":"IF(C7=\"\",\"\",VLOOKUP(C7,費目・適用表!$A$3:$B$12,2,FALSE))","v":""},null,null,{"$f":"IF(F7=\"\",\"\",VLOOKUP(F7,費目・適用表!$A$16:$B$25,2,FALSE))","v":""}]
[3,null,null,{"$f":"IF(C8=\"\",\"\",VLOOKUP(C8,費目・適用表!$A$3:$B$12,2,FALSE))","v":""},null,null,{"$f":"IF(F8=\"\",\"\",VLOOKUP(F8,費目・適用表!$A$16:$B$25,2,FALSE))","v":""}]
[4,null,null,{"$f":"IF(C9=\"\",\"\",VLOOKUP(C9,費目・適用表!$A$3:$B$12,2,FALSE))","v":""},null,null,{"$f":"IF(F9=\"\",\"\",VLOOKUP(F9,費目・適用表!$A$16:$B$25,2,FALSE))","v":""}]
[5,null,null,{"$f":"IF(C10=\"\",\"\",VLOOKUP(C10,費目・適用表!$A$3:$B$12,2,FALSE))","v":""},null,null,{"$f":"IF(F10=\"\",\"\",VLOOKUP(F10,費目・適用表!$A$16:$B$25,2,FALSE))","v":""}]
[6,null,null,{"$f":"IF(C11=\"\",\"\",VLOOKUP(C11,費目・適用表!$A$3:$B$12,2,FALSE))","v":""},null,null,{"$f":"IF(F11=\"\",\"\",VLOOKUP(F11,費目・適用表!$A$16:$B$25,2,FALSE))","v":""}]
[7,null,null,{"$f":"IF(C12=\"\",\"\",VLOOKUP(C12,費目・適用表!$A$3:$B$12,2,FALSE))","v":""},null,null,{"$f":"IF(F12=\"\",\"\",VLOOKUP(F12,費目・適用表!$A$16:$B$25,2,FALSE))","v":""}]
[8,null,null,{"$f":"IF(C13=\"\",\"\",VLOOKUP(C13,費目・適用表!$A$3:$B$12,2,FALSE))","v":""},null,null,{"$f":"IF(F13=\"\",\"\",VLOOKUP(F13,費目・適用表!$A$16:$B$25,2,FALSE))","v":""}]
[9,null,null,{"$f":"IF(C14=\"\",\"\",VLOOKUP(C14,費目・適用表!$A$3:$B$12,2,FALSE))","v":""},null,null,{"$f":"IF(F14=\"\",\"\",VLOOKUP(F14,費目・適用表!$A$16:$B$25,2,FALSE))","v":""}]
[10,null,null,{"$f":"IF(C15=\"\",\"\",VLOOKUP(C15,費目・適用表!$A$3:$B$12,2,FALSE))","v":""},null,null,{"$f":"IF(F15=\"\",\"\",VLOOKUP(F15,費目・適用表!$A$16:$B$25,2,FALSE))","v":""}]
[11,null,null,{"$f":"IF(C16=\"\",\"\",VLOOKUP(C16,費目・適用表!$A$3:$B$12,2,FALSE))","v":""},null,null,{"$f":"IF(F16=\"\",\"\",VLOOKUP(F16,費目・適用表!$A$16:$B$25,2,FALSE))","v":""}]
[12,null,null,{"$f":"IF(C17=\"\",\"\",VLOOKUP(C17,費目・適用表!$A$3:$B$12,2,FALSE))","v":""},null,null,{"$f":"IF(F17=\"\",\"\",VLOOKUP(F17,費目・適用表!$A$16:$B$25,2,FALSE))","v":""}]
[13,null,null,{"$f":"IF(C18=\"\",\"\",VLOOKUP(C18,費目・適用表!$A$3:$B$12,2,FALSE))","v":""},null,null,{"$f":"IF(F18=\"\",\"\",VLOOKUP(F18,費目・適用表!$A$16:$B$25,2,FALSE))","v":""}]
[14,null,null,{"$f":"IF(C19=\"\",\"\",VLOOKUP(C19,費目・適用表!$A$3:$B$12,2,FALSE))","v":""},null,null,{"$f":"IF(F19=\"\",\"\",VLOOKUP(F19,費目・適用表!$A$16:$B$25,2,FALSE))","v":""}]
[15,null,null,{"$f":"IF(C20=\"\",\"\",VLOOKUP(C20,費目・適用表!$A$3:$B$12,2,FALSE))","v":""},null,null,{"$f":"IF(F20=\"\",\"\",VLOOKUP(F20,費目・適用表!$A$16:$B$25,2,FALSE))","v":""}]
[16,null,null,{"$f":"IF(C21=\"\",\"\",VLOOKUP(C21,費目・適用表!$A$3:$B$12,2,FALSE))","v":""},null,null,{"$f":"IF(F21=\"\",\"\",VLOOKUP(F21,費目・適用表!$A$16:$B$25,2,FALSE))","v":""}]
[17,null,null,{"$f":"IF(C22=\"\",\"\",VLOOKUP(C22,費目・適用表!$A$3:$B$12,2,FALSE))","v":""},null,null,{"$f":"IF(F22=\"\",\"\",VLOOKUP(F22,費目・適用表!$A$16:$B$25,2,FALSE))","v":""}]
[18,null,null,{"$f":"IF(C23=\"\",\"\",VLOOKUP(C23,費目・適用表!$A$3:$B$12,2,FALSE))","v":""},null,null,{"$f":"IF(F23=\"\",\"\",VLOOKUP(F23,費目・適用表!$A$16:$B$25,2,FALSE))","v":""}]
[19,null,null,{"$f":"IF(C24=\"\",\"\",VLOOKUP(C24,費目・適用表!$A$3:$B$12,2,FALSE))","v":""},null,null,{"$f":"IF(F24=\"\",\"\",VLOOKUP(F24,費目・適用表!$A$16:$B$25,2,FALSE))","v":""}]
[20,null,null,{"$f":"IF(C25=\"\",\"\",VLOOKUP(C25,費目・適用表!$A$3:$B$12,2,FALSE))","v":""},null,null,{"$f":"IF(F25=\"\",\"\",VLOOKUP(F25,費目・適用表!$A$16:$B$25,2,FALSE))","v":""}]
[21,null,null,{"$f":"IF(C26=\"\",\"\",VLOOKUP(C26,費目・適用表!$A$3:$B$12,2,FALSE))","v":""},null,null,{"$f":"IF(F26=\"\",\"\",VLOOKUP(F26,費目・適用表!$A$16:$B$25,2,FALSE))","v":""}]
[22,null,null,{"$f":"IF(C27=\"\",\"\",VLOOKUP(C27,費目・適用表!$A$3:$B$12,2,FALSE))","v":""},null,null,{"$f":"IF(F27=\"\",\"\",VLOOKUP(F27,費目・適用表!$A$16:$B$25,2,FALSE))","v":""}]
[23,null,null,{"$f":"IF(C28=\"\",\"\",VLOOKUP(C28,費目・適用表!$A$3:$B$12,2,FALSE))","v":""},null,null,{"$f":"IF(F28=\"\",\"\",VLOOKUP(F28,費目・適用表!$A$16:$B$25,2,FALSE))","v":""}]
[24,null,null,{"$f":"IF(C29=\"\",\"\",VLOOKUP(C29,費目・適用表!$A$3:$B$12,2,FALSE))","v":""},null,null,{"$f":"IF(F29=\"\",\"\",VLOOKUP(F29,費目・適用表!$A$16:$B$25,2,FALSE))","v":""}]
[25,null,null,{"$f":"IF(C30=\"\",\"\",VLOOKUP(C30,費目・適用表!$A$3:$B$12,2,FALSE))","v":""},null,null,{"$f":"IF(F30=\"\",\"\",VLOOKUP(F30,費目・適用表!$A$16:$B$25,2,FALSE))","v":""}]
[26,null,null,{"$f":"IF(C31=\"\",\"\",VLOOKUP(C31,費目・適用表!$A$3:$B$12,2,FALSE))","v":""},null,null,{"$f":"IF(F31=\"\",\"\",VLOOKUP(F31,費目・適用表!$A$16:$B$25,2,FALSE))","v":""}]
[27,null,null,{"$f":"IF(C32=\"\",\"\",VLOOKUP(C32,費目・適用表!$A$3:$B$12,2,FALSE))","v":""},null,null,{"$f":"IF(F32=\"\",\"\",VLOOKUP(F32,費目・適用表!$A$16:$B$25,2,FALSE))","v":""}]
[28,null,null,{"$f":"IF(C33=\"\",\"\",VLOOKUP(C33,費目・適用表!$A$3:$B$12,2,FALSE))","v":""},null,null,{"$f":"IF(F33=\"\",\"\",VLOOKUP(F33,費目・適用表!$A$16:$B$25,2,FALSE))","v":""}]
[29,null,null,{"$f":"IF(C34=\"\",\"\",VLOOKUP(C34,費目・適用表!$A$3:$B$12,2,FALSE))","v":""},null,null,{"$f":"IF(F34=\"\",\"\",VLOOKUP(F34,費目・適用表!$A$16:$B$25,2,FALSE))","v":""}]
[30,null,null,{"$f":"IF(C35=\"\",\"\",VLOOKUP(C35,費目・適用表!$A$3:$B$12,2,FALSE))","v":""},null,null,{"$f":"IF(F35=\"\",\"\",VLOOKUP(F35,費目・適用表!$A$16:$B$25,2,FALSE))","v":""}]
[31,null,null,{"$f":"IF(C36=\"\",\"\",VLOOKUP(C36,費目・適用表!$A$3:$B$12,2,FALSE))","v":""},null,null,{"$f":"IF(F36=\"\",\"\",VLOOKUP(F36,費目・適用表!$A$16:$B$25,2,FALSE))","v":""}]
[32,null,null,{"$f":"IF(C37=\"\",\"\",VLOOKUP(C37,費目・適用表!$A$3:$B$12,2,FALSE))","v":""},null,null,{"$f":"IF(F37=\"\",\"\",VLOOKUP(F37,費目・適用表!$A$16:$B$25,2,FALSE))","v":""}]
[33,null,null,{"$f":"IF(C38=\"\",\"\",VLOOKUP(C38,費目・適用表!$A$3:$B$12,2,FALSE))","v":""},null,null,{"$f":"IF(F38=\"\",\"\",VLOOKUP(F38,費目・適用表!$A$16:$B$25,2,FALSE))","v":""}]
[34,null,null,{"$f":"IF(C39=\"\",\"\",VLOOKUP(C39,費目・適用表!$A$3:$B$12,2,FALSE))","v":""},null,null,{"$f":"IF(F39=\"\",\"\",VLOOKUP(F39,費目・適用表!$A$16:$B$25,2,FALSE))","v":""}]
[35,null,null,{"$f":"IF(C40=\"\",\"\",VLOOKUP(C40,費目・適用表!$A$3:$B$12,2,FALSE))","v":""},null,null,{"$f":"IF(F40=\"\",\"\",VLOOKUP(F40,費目・適用表!$A$16:$B$25,2,FALSE))","v":""}]
{"$rows_left_out":124}
{"sheet":"費目・適用表","index":1,"n_rows":25,"n_cols":6,"rows_kept":25,"merged":[[1,5,4,5]]}
["費目表"]
["NO","費目名","分類","内容",null,"※薄い黄色のセルに自由に入力してください。\n\n※分類は 10 種類までに抑えましょう。\n\n※「NO」欄の数字は計算に使用していますので変更しないでください。"]
[1]
[2]
[3]
[4]
[5]
[6]
[7]
[8]
[9]
[10]
[]
["適用表"]
["NO","費目名","分類","内容"]
[1]
[2]
[3]
[4]
[5]
[6]
[7]
[8]
[9]
[10]

{"sheet":"家計分析","index":2,"n_rows":28,"n_cols":13,"rows_kept":28,"merged":[[1,12,3,14],[12,1,12,2],[27,1,27,2]]}
[null,"費目分析"]
[null,"NO","費目名","金額","構成比",{"$nulls":7},"※このシートは家計記録シートのデータから結果を表示するシートです。何も入力しません。"]
[null,1,{"$f":"IF(費目・適用表!B3=\"\",\"\",費目・適用表!B3)","v":""},{"$f":"SUMIF(家計記録!$C$6:$D$163,1,家計記録!$H$6:$H$163)","v":0},{"$f":"IF($D$13=0,\"\",D3/$D$13)","v":""}]
[null,2,{"$f":"IF(費目・適用表!B4=\"\",\"\",費目・適用表!B4)","v":""},{"$f":"SUMIF(家計記録!$C$6:$D$163,2,家計記録!$H$6:$H$163)","v":0},{"$f":"IF($D$13=0,\"\",D4/$D$13)","v":""}]
[null,3,{"$f":"IF(費目・適用表!B5=\"\",\"\",費目・適用表!B5)","v":""},{"$f":"SUMIF(家計記録!$C$6:$D$163,3,家計記録!$H$6:$H$163)","v":0},""]
[null,4,{"$f":"IF(費目・適用表!B6=\"\",\"\",費目・適用表!B6)","v":""},{"$f":"SUMIF(家計記録!$C$6:$D$163,4,家計記録!$H$6:$H$163)","v":0},""]
[null,5,{"$f":"IF(費目・適用表!B7=\"\",\"\",費目・適用表!B7)","v":""},{"$f":"SUMIF(家計記録!$C$6:$D$163,5,家計記録!$H$6:$H$163)","v":0},""]
[null,6,{"$f":"IF(費目・適用表!B8=\"\",\"\",費目・適用表!B8)","v":""},{"$f":"SUMIF(家計記録!$C$6:$D$163,6,家計記録!$H$6:$H$163)","v":0},""]
[null,7,{"$f":"IF(費目・適用表!B9=\"\",\"\",費目・適用表!B9)","v":""},{"$f":"SUMIF(家計記録!$C$6:$D$163,7,家計記録!$H$6:$H$163)","v":0},""]
[null,8,{"$f":"IF(費目・適用表!B10=\"\",\"\",費目・適用表!B10)","v":""},{"$f":"SUMIF(家計記録!$C$6:$D$163,8,家計記録!$H$6:$H$163)","v":0},""]
[null,9,{"$f":"IF(費目・適用表!B11=\"\",\"\",費目・適用表!B11)","v":""},{"$f":"SUMIF(家計記録!$C$6:$D$163,9,家計記録!$H$6:$H$163)","v":0},""]
[null,10,{"$f":"IF(費目・適用表!B12=\"\",\"\",費目・適用表!B12)","v":""},{"$f":"SUMIF(家計記録!$C$6:$D$163,10,家計記録!$H$6:$H$163)","v":0},""]
[null,"合計",null,{"$f":"SUM(D3:D12)","v":0},""]
[]
[]
[null,"適用分析"]
[null,"NO","費目名","金額","構成比"]
[null,1,{"$f":"IF(費目・適用表!B16=\"\",\"\",費目・適用表!B16)","v":""},{"$f":"SUMIF(家計記録!$F$6:$G$163,1,家計記録!$H$6:$H$163)","v":0},{"$f":"IF($D$28=0,\"\",D18/$D$28)","v":""}]
[null,2,{"$f":"IF(費目・適用表!B17=\"\",\"\",費目・適用表!B17)","v":""},{"$f":"SUMIF(家計記録!$F$6:$G$163,2,家計記録!$H$6:$H$163)","v":0},{"$f":"IF($D$28=0,\"\",D19/$D$28)","v":""}]
[null,3,{"$f":"IF(費目・適用表!B18=\"\",\"\",費目・適用表!B18)","v":""},{"$f":"SUMIF(家計記録!$F$6:$G$163,3,家計記録!$H$6:$H$163)","v":0},""]
[null,4,{"$f":"IF(費目・適用表!B19=\"\",\"\",費目・適用表!B19)","v":""},{"$f":"SUMIF(家計記録!$F$6:$G$163,4,家計記録!$H$6:$H$163)","v":0},""]
[null,5,{"$f":"IF(費目・適用表!B20=\"\",\"\",費目・適用表!B20)","v":""},{"$f":"SUMIF(家計記録!$F$6:$G$163,5,家計記録!$H$6:$H$163)","v":0},""]
[null,6,{"$f":"IF(費目・適用表!B21=\"\",\"\",費目・適用表!B21)","v":""},{"$f":"SUMIF(家計記録!$F$6:$G$163,6,家計記録!$H$6:$H$163)","v":0},""]
[null,7,{"$f":"IF(費目・適用表!B22=\"\",\"\",費目・適用表!B22)","v":""},{"$f":"SUMIF(家計記録!$F$6:$G$163,7,家計記録!$H$6:$H$163)","v":0},""]
[null,8,{"$f":"IF(費目・適用表!B23=\"\",\"\",費目・適用表!B23)","v":""},{"$f":"SUMIF(家計記録!$F$6:$G$163,8,家計記録!$H$6:$H$163)","v":0},""]
[null,9,{"$f":"IF(費目・適用表!B24=\"\",\"\",費目・適用表!B24)","v":""},{"$f":"SUMIF(家計記録!$F$6:$G$163,9,家計記録!$H$6:$H$163)","v":0},""]
[null,10,{"$f":"IF(費目・適用表!B25=\"\",\"\",費目・適用表!B25)","v":""},{"$f":"SUMIF(家計記録!$F$6:$G$163,10,家計記録!$H$6:$H$163)","v":0},""]
[null,"合計",null,{"$f":"SUM(D18:D27)","v":0},{"$f":"IF($D$28=0,\"\",D28/$D$28)","v":""}]

{"sheet":"家計記録使い方","index":3,"n_rows":163,"n_cols":9,"rows_kept":163,"merged":[[0,0,0,8],[2,6,2,7],[4,2,4,3],[4,5,4,6]]}
["家計支出記録ノート"]
[]
[6,"月分",{"$nulls":4},"合計金額",null,{"$f":"SUM(H6:H163)","v":{"v":171150,"d":"¥171,150"}}]
[]
["NO","日付","費目",null,"詳細","適用",null,"金額","備考"]
[1,"2008-06-01",1,{"$f":"IF(C6=\"\",\"\",VLOOKUP(C6,費目・適用表使い方!$A$3:$B$12,2,FALSE))","v":"日常費"},"○○スーパー",1,{"$f":"IF(F6=\"\",\"\",VLOOKUP(F6,費目・適用表使い方!$A$16:$B$25,2,FALSE))","v":"家計費"},{"v":2800,"d":"¥2,800"}]
[2,"2008-06-01",1,{"$f":"IF(C7=\"\",\"\",VLOOKUP(C7,費目・適用表使い方!$A$3:$B$12,2,FALSE))","v":"日常費"},"○×ドラッグ",1,{"$f":"IF(F7=\"\",\"\",VLOOKUP(F7,費目・適用表使い方!$A$16:$B$25,2,FALSE))","v":"家計費"},{"v":1850,"d":"¥1,850"}]
[3,"2008-06-02",2,{"$f":"IF(C8=\"\",\"\",VLOOKUP(C8,費目・適用表使い方!$A$3:$B$12,2,FALSE))","v":"住居費"},"家賃",1,{"$f":"IF(F8=\"\",\"\",VLOOKUP(F8,費目・適用表使い方!$A$16:$B$25,2,FALSE))","v":"家計費"},{"v":88000,"d":"¥88,000"}]
[4,"2008-06-02",2,{"$f":"IF(C9=\"\",\"\",VLOOKUP(C9,費目・適用表使い方!$A$3:$B$12,2,FALSE))","v":"住居費"},"駐車場代",1,{"$f":"IF(F9=\"\",\"\",VLOOKUP(F9,費目・適用表使い方!$A$16:$B$25,2,FALSE))","v":"家計費"},{"v":10000,"d":"¥10,000"}]
[5,"2008-06-03",3,{"$f":"IF(C10=\"\",\"\",VLOOKUP(C10,費目・適用表使い方!$A$3:$B$12,2,FALSE))","v":"光熱・通信費"},"電気代",1,{"$f":"IF(F10=\"\",\"\",VLOOKUP(F10,費目・適用表使い方!$A$16:$B$25,2,FALSE))","v":"家計費"},{"v":8800,"d":"¥8,800"}]
[6,"2008-06-03",4,{"$f":"IF(C11=\"\",\"\",VLOOKUP(C11,費目・適用表使い方!$A$3:$B$12,2,FALSE))","v":"子供費"},"スイミング月謝",4,{"$f":"IF(F11=\"\",\"\",VLOOKUP(F11,費目・適用表使い方!$A$16:$B$25,2,FALSE))","v":"一郎"},{"v":6500,"d":"¥6,500"}]
[7,"2008-06-03",4,{"$f":"IF(C12=\"\",\"\",VLOOKUP(C12,費目・適用表使い方!$A$3:$B$12,2,FALSE))","v":"子供費"},"スイミング月謝",5,{"$f":"IF(F12=\"\",\"\",VLOOKUP(F12,費目・適用表使い方!$A$16:$B$25,2,FALSE))","v":"花子"},{"v":6500,"d":"¥6,500"}]
[8,"2008-06-04",5,{"$f":"IF(C13=\"\",\"\",VLOOKUP(C13,費目・適用表使い方!$A$3:$B$12,2,FALSE))","v":"その他"},"美容院",3,{"$f":"IF(F13=\"\",\"\",VLOOKUP(F13,費目・適用表使い方!$A$16:$B$25,2,FALSE))","v":"わたし"},{"v":4500,"d":"¥4,500"}]
[9,"2008-06-06",5,{"$f":"IF(C14=\"\",\"\",VLOOKUP(C14,費目・適用表使い方!$A$3:$B$12,2,FALSE))","v":"その他"},"ゴルフ",2,{"$f":"IF(F14=\"\",\"\",VLOOKUP(F14,費目・適用表使い方!$A$16:$B$25,2,FALSE))","v":"お父さん"},{"v":20000,"d":"¥20,000"}]
[10,"2008-06-07",1,{"$f":"IF(C15=\"\",\"\",VLOOKUP(C15,費目・適用表使い方!$A$3:$B$12,2,FALSE))","v":"日常費"},"○○スーパー",1,{"$f":"IF(F15=\"\",\"\",VLOOKUP(F15,費目・適用表使い方!$A$16:$B$25,2,FALSE))","v":"家計費"},{"v":3200,"d":"¥3,200"}]
[11,"2008-06-08",5,{"$f":"IF(C16=\"\",\"\",VLOOKUP(C16,費目・適用表使い方!$A$3:$B$12,2,FALSE))","v":"その他"},"ランチ",3,{"$f":"IF(F16=\"\",\"\",VLOOKUP(F16,費目・適用表使い方!$A$16:$B$25,2,FALSE))","v":"わたし"},{"v":1200,"d":"¥1,200"},"○○サークル"]
[12,"2008-06-09",4,{"$f":"IF(C17=\"\",\"\",VLOOKUP(C17,費目・適用表使い方!$A$3:$B$12,2,FALSE))","v":"子供費"},"遠足おかし",4,{"$f":"IF(F17=\"\",\"\",VLOOKUP(F17,費目・適用表使い方!$A$16:$B$25,2,FALSE))","v":"一郎"},{"v":300,"d":"¥300"}]
[13,"2008-06-12",4,{"$f":"IF(C18=\"\",\"\",VLOOKUP(C18,費目・適用表使い方!$A$3:$B$12,2,FALSE))","v":"子供費"},"遠足おかし",5,{"$f":"IF(F18=\"\",\"\",VLOOKUP(F18,費目・適用表使い方!$A$16:$B$25,2,FALSE))","v":"花子"},{"v":200,"d":"¥200"}]
[14,"2008-06-15",5,{"$f":"IF(C19=\"\",\"\",VLOOKUP(C19,費目・適用表使い方!$A$3:$B$12,2,FALSE))","v":"その他"},"インターネット代",1,{"$f":"IF(F19=\"\",\"\",VLOOKUP(F19,費目・適用表使い方!$A$16:$B$25,2,FALSE))","v":"家計費"},{"v":1800,"d":"¥1,800"}]
[15,"2008-06-16",3,{"$f":"IF(C20=\"\",\"\",VLOOKUP(C20,費目・適用表使い方!$A$3:$B$12,2,FALSE))","v":"光熱・通信費"},"電話代",1,{"$f":"IF(F20=\"\",\"\",VLOOKUP(F20,費目・適用表使い方!$A$16:$B$25,2,FALSE))","v":"家計費"},{"v":6500,"d":"¥6,500"}]
[16,"2008-06-18",5,{"$f":"IF(C21=\"\",\"\",VLOOKUP(C21,費目・適用表使い方!$A$3:$B$12,2,FALSE))","v":"その他"},"携帯電話",2,{"$f":"IF(F21=\"\",\"\",VLOOKUP(F21,費目・適用表使い方!$A$16:$B$25,2,FALSE))","v":"お父さん"},{"v":5800,"d":"¥5,800"}]
[17,"2008-06-18",5,{"$f":"IF(C22=\"\",\"\",VLOOKUP(C22,費目・適用表使い方!$A$3:$B$12,2,FALSE))","v":"その他"},"携帯電話",3,{"$f":"IF(F22=\"\",\"\",VLOOKUP(F22,費目・適用表使い方!$A$16:$B$25,2,FALSE))","v":"わたし"},{"v":3200,"d":"¥3,200"}]
[18,null,null,{"$f":"IF(C23=\"\",\"\",VLOOKUP(C23,費目・適用表使い方!$A$3:$B$12,2,FALSE))","v":""},null,null,{"$f":"IF(F23=\"\",\"\",VLOOKUP(F23,費目・適用表使い方!$A$16:$B$25,2,FALSE))","v":""}]
[19,null,null,{"$f":"IF(C24=\"\",\"\",VLOOKUP(C24,費目・適用表使い方!$A$3:$B$12,2,FALSE))","v":""},null,null,{"$f":"IF(F24=\"\",\"\",VLOOKUP(F24,費目・適用表使い方!$A$16:$B$25,2,FALSE))","v":""}]
[20,null,null,{"$f":"IF(C25=\"\",\"\",VLOOKUP(C25,費目・適用表使い方!$A$3:$B$12,2,FALSE))","v":""},null,null,{"$f":"IF(F25=\"\",\"\",VLOOKUP(F25,費目・適用表使い方!$A$16:$B$25,2,FALSE))","v":""}]
[21,null,null,{"$f":"IF(C26=\"\",\"\",VLOOKUP(C26,費目・適用表使い方!$A$3:$B$12,2,FALSE))","v":""},null,null,{"$f":"IF(F26=\"\",\"\",VLOOKUP(F26,費目・適用表使い方!$A$16:$B$25,2,FALSE))","v":""}]
[22,null,null,{"$f":"IF(C27=\"\",\"\",VLOOKUP(C27,費目・適用表使い方!$A$3:$B$12,2,FALSE))","v":""},null,null,{"$f":"IF(F27=\"\",\"\",VLOOKUP(F27,費目・適用表使い方!$A$16:$B$25,2,FALSE))","v":""}]
[23,null,null,{"$f":"IF(C28=\"\",\"\",VLOOKUP(C28,費目・適用表使い方!$A$3:$B$12,2,FALSE))","v":""},null,null,{"$f":"IF(F28=\"\",\"\",VLOOKUP(F28,費目・適用表使い方!$A$16:$B$25,2,FALSE))","v":""}]
[24,null,null,{"$f":"IF(C29=\"\",\"\",VLOOKUP(C29,費目・適用表使い方!$A$3:$B$12,2,FALSE))","v":""},null,null,{"$f":"IF(F29=\"\",\"\",VLOOKUP(F29,費目・適用表使い方!$A$16:$B$25,2,FALSE))","v":""}]
[25,null,null,{"$f":"IF(C30=\"\",\"\",VLOOKUP(C30,費目・適用表使い方!$A$3:$B$12,2,FALSE))","v":""},null,null,{"$f":"IF(F30=\"\",\"\",VLOOKUP(F30,費目・適用表使い方!$A$16:$B$25,2,FALSE))","v":""}]
[26,null,null,{"$f":"IF(C31=\"\",\"\",VLOOKUP(C31,費目・適用表使い方!$A$3:$B$12,2,FALSE))","v":""},null,null,{"$f":"IF(F31=\"\",\"\",VLOOKUP(F31,費目・適用表使い方!$A$16:$B$25,2,FALSE))","v":""}]
[27,null,null,{"$f":"IF(C32=\"\",\"\",VLOOKUP(C32,費目・適用表使い方!$A$3:$B$12,2,FALSE))","v":""},null,null,{"$f":"IF(F32=\"\",\"\",VLOOKUP(F32,費目・適用表使い方!$A$16:$B$25,2,FALSE))","v":""}]
[28,null,null,{"$f":"IF(C33=\"\",\"\",VLOOKUP(C33,費目・適用表使い方!$A$3:$B$12,2,FALSE))","v":""},null,null,{"$f":"IF(F33=\"\",\"\",VLOOKUP(F33,費目・適用表使い方!$A$16:$B$25,2,FALSE))","v":""}]
[29,null,null,{"$f":"IF(C34=\"\",\"\",VLOOKUP(C34,費目・適用表使い方!$A$3:$B$12,2,FALSE))","v":""},null,null,{"$f":"IF(F34=\"\",\"\",VLOOKUP(F34,費目・適用表使い方!$A$16:$B$25,2,FALSE))","v":""}]
[30,null,null,{"$f":"IF(C35=\"\",\"\",VLOOKUP(C35,費目・適用表使い方!$A$3:$B$12,2,FALSE))","v":""},null,null,{"$f":"IF(F35=\"\",\"\",VLOOKUP(F35,費目・適用表使い方!$A$16:$B$25,2,FALSE))","v":""}]
[31,null,null,{"$f":"IF(C36=\"\",\"\",VLOOKUP(C36,費目・適用表使い方!$A$3:$B$12,2,FALSE))","v":""},null,null,{"$f":"IF(F36=\"\",\"\",VLOOKUP(F36,費目・適用表使い方!$A$16:$B$25,2,FALSE))","v":""}]
[32,null,null,{"$f":"IF(C37=\"\",\"\",VLOOKUP(C37,費目・適用表使い方!$A$3:$B$12,2,FALSE))","v":""},null,null,{"$f":"IF(F37=\"\",\"\",VLOOKUP(F37,費目・適用表使い方!$A$16:$B$25,2,FALSE))","v":""}]
[33,null,null,{"$f":"IF(C38=\"\",\"\",VLOOKUP(C38,費目・適用表使い方!$A$3:$B$12,2,FALSE))","v":""},null,null,{"$f":"IF(F38=\"\",\"\",VLOOKUP(F38,費目・適用表使い方!$A$16:$B$25,2,FALSE))","v":""}]
[34,null,null,{"$f":"IF(C39=\"\",\"\",VLOOKUP(C39,費目・適用表使い方!$A$3:$B$12,2,FALSE))","v":""},null,null,{"$f":"IF(F39=\"\",\"\",VLOOKUP(F39,費目・適用表使い方!$A$16:$B$25,2,FALSE))","v":""}]
[35,null,null,{"$f":"IF(C40=\"\",\"\",VLOOKUP(C40,費目・適用表使い方!$A$3:$B$12,2,FALSE))","v":""},null,null,{"$f":"IF(F40=\"\",\"\",VLOOKUP(F40,費目・適用表使い方!$A$16:$B$25,2,FALSE))","v":""}]
{"$rows_left_out":124}
{"sheet":"費目・適用表使い方","index":4,"n_rows":25,"n_cols":4,"rows_kept":25,"merged":[[1,5,4,5]]}
["費目表"]
["NO","費目名","分類","内容"]
[1,"日常費","食費・日用雑貨","食品、衛生、新聞"]
[2,"住居費","住居関係（固定支出）","家賃、駐車場代、管理費、家具用品"]
[3,"光熱・通信費","住居関係（流動支出）","電気、ガス、水道、電話"]
[4,"子供費","子供関係全般","教育、おこづかい、おけいこ、服"]
[5,"その他","衣服、保険、通信、等上記以外すべて","被服費（子供以外）、保険、趣味、レジャー"]
[6]
[7]
[8]
[9]
[10]
[]
["適用表"]
["NO","費目名","分類","内容"]
[1,"家計費","家族全体に関わる費用"]
[2,"お父さん","お父さんにかかる費用","こづかい、交際費、趣味、レジャー"]
[3,"わたし","わたしにかかる費用","こづかい、交際費、趣味、レジャー、美容"]
[4,"一郎","一郎にかかる費用","こづかい、給食費、学用費、塾・おけいこ"]
[5,"花子","花子にかかる費用","こづかい、給食費、学用費、塾・おけいこ"]
[6]
[7]
[8]
[9]
[10]

{"sheet":"家計分析 使い方","index":5,"n_rows":28,"n_cols":5,"rows_kept":28,"merged":[[1,12,3,14],[12,1,12,2],[27,1,27,2]]}
[null,"費目分析"]
[null,"NO","費目名","金額","構成比"]
[null,1,{"$f":"IF(費目・適用表!B3=\"\",\"\",費目・適用表!B3)","v":""},{"$f":"SUMIF(家計記録使い方!$C$6:$D$163,1,家計記録使い方!$H$6:$H$163)","v":7850},{"$f":"IF($D$13=0,\"\",D3/$D$13)","v":{"v":0.04586619924043237,"d":"5%"}}]
[null,2,{"$f":"IF(費目・適用表!B4=\"\",\"\",費目・適用表!B4)","v":""},{"$f":"SUMIF(家計記録使い方!$C$6:$D$163,2,家計記録使い方!$H$6:$H$163)","v":98000},{"$f":"IF($D$13=0,\"\",D4/$D$13)","v":{"v":0.5725971370143149,"d":"57%"}}]
[null,3,{"$f":"IF(費目・適用表!B5=\"\",\"\",費目・適用表!B5)","v":""},{"$f":"SUMIF(家計記録使い方!$C$6:$D$163,3,家計記録使い方!$H$6:$H$163)","v":15300},{"v":0.08939526730937773,"d":"9%"}]
[null,4,{"$f":"IF(費目・適用表!B6=\"\",\"\",費目・適用表!B6)","v":""},{"$f":"SUMIF(家計記録使い方!$C$6:$D$163,4,家計記録使い方!$H$6:$H$163)","v":13500},{"v":0.07887817703768624,"d":"8%"}]
[null,5,{"$f":"IF(費目・適用表!B7=\"\",\"\",費目・適用表!B7)","v":""},{"$f":"SUMIF(家計記録使い方!$C$6:$D$163,5,家計記録使い方!$H$6:$H$163)","v":36500},{"v":0.21326321939818874,"d":"21%"}]
[null,6,{"$f":"IF(費目・適用表!B8=\"\",\"\",費目・適用表!B8)","v":""},{"$f":"SUMIF(家計記録使い方!$C$6:$D$163,6,家計記録使い方!$H$6:$H$163)","v":0},{"v":0,"d":"0%"}]
[null,7,{"$f":"IF(費目・適用表!B9=\"\",\"\",費目・適用表!B9)","v":""},{"$f":"SUMIF(家計記録使い方!$C$6:$D$163,7,家計記録使い方!$H$6:$H$163)","v":0},{"v":0,"d":"0%"}]
[null,8,{"$f":"IF(費目・適用表!B10=\"\",\"\",費目・適用表!B10)","v":""},{"$f":"SUMIF(家計記録使い方!$C$6:$D$163,8,家計記録使い方!$H$6:$H$163)","v":0},{"v":0,"d":"0%"}]
[null,9,{"$f":"IF(費目・適用表!B11=\"\",\"\",費目・適用表!B11)","v":""},{"$f":"SUMIF(家計記録使い方!$C$6:$D$163,9,家計記録使い方!$H$6:$H$163)","v":0},{"v":0,"d":"0%"}]
[null,10,{"$f":"IF(費目・適用表!B12=\"\",\"\",費目・適用表!B12)","v":""},{"$f":"SUMIF(家計記録使い方!$C$6:$D$163,10,家計記録使い方!$H$6:$H$163)","v":0},{"v":0,"d":"0%"}]
[null,"合計",null,{"$f":"SUM(D3:D12)","v":171150},{"v":1,"d":"100%"}]
[]
[]
[null,"適用分析"]
[null,"NO","費目名","金額","構成比"]
[null,1,{"$f":"IF(費目・適用表!B16=\"\",\"\",費目・適用表!B16)","v":""},{"$f":"SUMIF(家計記録使い方!$F$6:$G$163,1,家計記録使い方!$H$6:$H$163)","v":122950},{"$f":"IF($D$28=0,\"\",D18/$D$28)","v":{"v":0.7183756938358166,"d":"72%"}}]
[null,2,{"$f":"IF(費目・適用表!B17=\"\",\"\",費目・適用表!B17)","v":""},{"$f":"SUMIF(家計記録使い方!$F$6:$G$163,2,家計記録使い方!$H$6:$H$163)","v":25800},{"$f":"IF($D$28=0,\"\",D19/$D$28)","v":{"v":0.15074496056091147,"d":"15%"}}]
[null,3,{"$f":"IF(費目・適用表!B18=\"\",\"\",費目・適用表!B18)","v":""},{"$f":"SUMIF(家計記録使い方!$F$6:$G$163,3,家計記録使い方!$H$6:$H$163)","v":8900},{"v":0.052001168565585745,"d":"5%"}]
[null,4,{"$f":"IF(費目・適用表!B19=\"\",\"\",費目・適用表!B19)","v":""},{"$f":"SUMIF(家計記録使い方!$F$6:$G$163,4,家計記録使い方!$H$6:$H$163)","v":6800},{"v":0.039731229915279,"d":"4%"}]
[null,5,{"$f":"IF(費目・適用表!B20=\"\",\"\",費目・適用表!B20)","v":""},{"$f":"SUMIF(家計記録使い方!$F$6:$G$163,5,家計記録使い方!$H$6:$H$163)","v":6700},{"v":0.039146947122407245,"d":"4%"}]
[null,6,{"$f":"IF(費目・適用表!B21=\"\",\"\",費目・適用表!B21)","v":""},{"$f":"SUMIF(家計記録使い方!$F$6:$G$163,6,家計記録使い方!$H$6:$H$163)","v":0},{"v":0,"d":"0%"}]
[null,7,{"$f":"IF(費目・適用表!B22=\"\",\"\",費目・適用表!B22)","v":""},{"$f":"SUMIF(家計記録使い方!$F$6:$G$163,7,家計記録使い方!$H$6:$H$163)","v":0},{"v":0,"d":"0%"}]
[null,8,{"$f":"IF(費目・適用表!B23=\"\",\"\",費目・適用表!B23)","v":""},{"$f":"SUMIF(家計記録使い方!$F$6:$G$163,8,家計記録使い方!$H$6:$H$163)","v":0},{"v":0,"d":"0%"}]
[null,9,{"$f":"IF(費目・適用表!B24=\"\",\"\",費目・適用表!B24)","v":""},{"$f":"SUMIF(家計記録使い方!$F$6:$G$163,9,家計記録使い方!$H$6:$H$163)","v":0},{"v":0,"d":"0%"}]
[null,10,{"$f":"IF(費目・適用表!B25=\"\",\"\",費目・適用表!B25)","v":""},{"$f":"SUMIF(家計記録使い方!$F$6:$G$163,10,家計記録使い方!$H$6:$H$163)","v":0},{"v":0,"d":"0%"}]
[null,"合計",null,{"$f":"SUM(D18:D27)","v":171150},{"$f":"IF($D$28=0,\"\",D28/$D$28)","v":{"v":1,"d":"100%"}}]