{"text_format":"3","workbook":"xlsx","n_sheets":4,"sheets":["イベント","カレンダー","印刷版","管理者"],"not_rendered":{"defined_names":18},"read":"whole","date_system":"1900"}

{"sheet":"イベント","index":0,"n_rows":38,"n_cols":5,"rows_kept":38}
[]
[null,"月間コミュニティ"]
[null,"イベント計画表"]
[]
[]
[]
[]
[null,"日付","曜日","月","イベント名"]
[null,"2016-07-01",{"$f":"IF(ISBLANK(tblEvents[[#This Row],[日付]]),\"\",UPPER(TEXT(tblEvents[[#This Row],[日付]],\"aaa\")))","v":"金"},{"$f":"IF(ISBLANK(tblEvents[[#This Row],[日付]]),\"\",LOOKUP(_xlfn.NUMBERVALUE(TEXT(tblEvents[[#This Row],[日付]],\"m\")),tblMonths[数],tblMonths[月]))","v":"07 月"},"コミュニティ ガーデン"]
[null,"2016-07-01",{"$f":"IF(ISBLANK(tblEvents[[#This Row],[日付]]),\"\",UPPER(TEXT(tblEvents[[#This Row],[日付]],\"aaa\")))","v":"金"},{"$f":"IF(ISBLANK(tblEvents[[#This Row],[日付]]),\"\",LOOKUP(_xlfn.NUMBERVALUE(TEXT(tblEvents[[#This Row],[日付]],\"m\")),tblMonths[数],tblMonths[月]))","v":"07 月"},"市議会"]
[null,"2016-07-02",{"$f":"IF(ISBLANK(tblEvents[[#This Row],[日付]]),\"\",UPPER(TEXT(tblEvents[[#This Row],[日付]],\"aaa\")))","v":"土"},{"$f":"IF(ISBLANK(tblEvents[[#This Row],[日付]]),\"\",LOOKUP(_xlfn.NUMBERVALUE(TEXT(tblEvents[[#This Row],[日付]],\"m\")),tblMonths[数],tblMonths[月]))","v":"07 月"},"コミュニティ ガーデン"]
[null,"2016-07-03",{"$f":"IF(ISBLANK(tblEvents[[#This Row],[日付]]),\"\",UPPER(TEXT(tblEvents[[#This Row],[日付]],\"aaa\")))","v":"日"},{"$f":"IF(ISBLANK(tblEvents[[#This Row],[日付]]),\"\",LOOKUP(_xlfn.NUMBERVALUE(TEXT(tblEvents[[#This Row],[日付]],\"m\")),tblMonths[数],tblMonths[月]))","v":"07 月"},"公園でのナイト ショー"]
[null,"2016-07-08",{"$f":"IF(ISBLANK(tblEvents[[#This Row],[日付]]),\"\",UPPER(TEXT(tblEvents[[#This Row],[日付]],\"aaa\")))","v":"金"},{"$f":"IF(ISBLANK(tblEvents[[#This Row],[日付]]),\"\",LOOKUP(_xlfn.NUMBERVALUE(TEXT(tblEvents[[#This Row],[日付]],\"m\")),tblMonths[数],tblMonths[月]))","v":"07 月"},"市議会"]
[null,"2016-07-11",{"$f":"IF(ISBLANK(tblEvents[[#This Row],[日付]]),\"\",UPPER(TEXT(tblEvents[[#This Row],[日付]],\"aaa\")))","v":"月"},{"$f":"IF(ISBLANK(tblEvents[[#This Row],[日付]]),\"\",LOOKUP(_xlfn.NUMBERVALUE(TEXT(tblEvents[[#This Row],[日付]],\"m\")),tblMonths[数],tblMonths[月]))","v":"07 月"},"コミュニティの議会 昼食会"]
[null,"2016-07-12",{"$f":"IF(ISBLANK(tblEvents[[#This Row],[日付]]),\"\",UPPER(TEXT(tblEvents[[#This Row],[日付]],\"aaa\")))","v":"火"},{"$f":"IF(ISBLANK(tblEvents[[#This Row],[日付]]),\"\",LOOKUP(_xlfn.NUMBERVALUE(TEXT(tblEvents[[#This Row],[日付]],\"m\")),tblMonths[数],tblMonths[月]))","v":"07 月"},"アンティーク展示会"]
[null,"2016-07-14",{"$f":"IF(ISBLANK(tblEvents[[#This Row],[日付]]),\"\",UPPER(TEXT(tblEvents[[#This Row],[日付]],\"aaa\")))","v":"木"},{"$f":"IF(ISBLANK(tblEvents[[#This Row],[日付]]),\"\",LOOKUP(_xlfn.NUMBERVALUE(TEXT(tblEvents[[#This Row],[日付]],\"m\")),tblMonths[数],tblMonths[月]))","v":"07 月"},"コミュニティ ワークショップ"]
[null,"2016-07-15",{"$f":"IF(ISBLANK(tblEvents[[#This Row],[日付]]),\"\",UPPER(TEXT(tblEvents[[#This Row],[日付]],\"aaa\")))","v":"金"},{"$f":"IF(ISBLANK(tblEvents[[#This Row],[日付]]),\"\",LOOKUP(_xlfn.NUMBERVALUE(TEXT(tblEvents[[#This Row],[日付]],\"m\")),tblMonths[数],tblMonths[月]))","v":"07 月"},"市議会"]
[null,"2016-07-19",{"$f":"IF(ISBLANK(tblEvents[[#This Row],[日付]]),\"\",UPPER(TEXT(tblEvents[[#This Row],[日付]],\"aaa\")))","v":"火"},{"$f":"IF(ISBLANK(tblEvents[[#This Row],[日付]]),\"\",LOOKUP(_xlfn.NUMBERVALUE(TEXT(tblEvents[[#This Row],[日付]],\"m\")),tblMonths[数],tblMonths[月]))","v":"07 月"},"戦略的計画ワークショップ"]
[null,"2016-07-20",{"$f":"IF(ISBLANK(tblEvents[[#This Row],[日付]]),\"\",UPPER(TEXT(tblEvents[[#This Row],[日付]],\"aaa\")))","v":"水"},{"$f":"IF(ISBLANK(tblEvents[[#This Row],[日付]]),\"\",LOOKUP(_xlfn.NUMBERVALUE(TEXT(tblEvents[[#This Row],[日付]],\"m\")),tblMonths[数],tblMonths[月]))","v":"07 月"},"公園の掃除"]
[null,"2016-07-22",{"$f":"IF(ISBLANK(tblEvents[[#This Row],[日付]]),\"\",UPPER(TEXT(tblEvents[[#This Row],[日付]],\"aaa\")))","v":"金"},{"$f":"IF(ISBLANK(tblEvents[[#This Row],[日付]]),\"\",LOOKUP(_xlfn.NUMBERVALUE(TEXT(tblEvents[[#This Row],[日付]],\"m\")),tblMonths[数],tblMonths[月]))","v":"07 月"},"市議会"]
{"$rows_left_out":19}
{"sheet":"カレンダー","index":1,"n_rows":35,"n_cols":21,"rows_kept":35,"merged":[[1,5,1,11],[30,8,34,20]]}
[]
[null,null,{"v":2016,"d":"2016 年"},null,null,{"$f":"LOOKUP(MonthNum,tblMonths[数],tblMonths[月])","v":"07 月"}]
[null,null,7,null,null,{"$f":"DATE(ViewYear,MonthNum,1)","v":"2016-07-01"},null,null,{"$f":"WEEKDAY(StartDate)","v":6}]
[null,null,"日",null,null,"月",null,null,"火",null,null,"水",null,null,"木",null,null,"金",null,null,"土"]
[]
[null,null,{"$f":"StartDate-(WEEKDAY(StartDate)-1)+{0;1;2;3;4;5}*7 +{1,2,3,4,5,6,7}-3+COLUMN(B1)","v":"2016-06-26"},null,null,{"$f":"StartDate-(WEEKDAY(StartDate)-1)+{0;1;2;3;4;5}*7 +{1,2,3,4,5,6,7}-3+COLUMN(C1)","v":"2016-06-27"},null,null,{"$f":"StartDate-(WEEKDAY(StartDate)-1)+{0;1;2;3;4;5}*7 +{1,2,3,4,5,6,7}-3+COLUMN(D1)","v":"2016-06-28"},null,null,{"$f":"StartDate-(WEEKDAY(StartDate)-1)+{0;1;2;3;4;5}*7 +{1,2,3,4,5,6,7}-3+COLUMN(E1)","v":"2016-06-29"},null,null,{"$f":"StartDate-(WEEKDAY(StartDate)-1)+{0;1;2;3;4;5}*7 +{1,2,3,4,5,6,7}-3+COLUMN(F1)","v":"2016-06-30"},null,null,{"$f":"StartDate-(WEEKDAY(StartDate)-1)+{0;1;2;3;4;5}*7 +{1,2,3,4,5,6,7}-3+COLUMN(G1)","v":"2016-07-01"},null,null,{"$f":"StartDate-(WEEKDAY(StartDate)-1)+{0;1;2;3;4;5}*7 +{1,2,3,4,5,6,7}-3+COLUMN(H1)","v":"2016-07-02"}]
[null,null,{"$f":"IFERROR(INDEX(tblEvents[],SMALL(IF(Dates=C$6,ROW(Dates)),ROW(1:1))-TableRowStart,4),\"\")","v":""},null,null,{"$f":"IFERROR(INDEX(tblEvents[],SMALL(IF(Dates=F$6,ROW(Dates)),ROW(1:1))-TableRowStart,4),\"\")","v":""},null,null,{"$f":"IFERROR(INDEX(tblEvents[],SMALL(IF(Dates=I$6,ROW(Dates)),ROW(1:1))-TableRowStart,4),\"\")","v":""},null,null,{"$f":"IFERROR(INDEX(tblEvents[],SMALL(IF(Dates=L$6,ROW(Dates)),ROW(1:1))-TableRowStart,4),\"\")","v":""},null,null,{"$f":"IFERROR(INDEX(tblEvents[],SMALL(IF(Dates=O$6,ROW(Dates)),ROW(1:1))-TableRowStart,4),\"\")","v":""},null,null,{"$f":"IFERROR(INDEX(tblEvents[],SMALL(IF(Dates=R$6,ROW(Dates)),ROW(1:1))-TableRowStart,4),\"\")","v":"コミュニティ ガーデン"},null,null,{"$f":"IFERROR(INDEX(tblEvents[],SMALL(IF(Dates=U$6,ROW(Dates)),ROW(1:1))-TableRowStart,4),\"\")","v":"コミュニティ ガーデン"}]
[null,null,{"$f":"IFERROR(INDEX(tblEvents[],SMALL(IF(Dates=C$6,ROW(Dates)),ROW(2:2))-TableRowStart,4),\"\")","v":""},null,null,{"$f":"IFERROR(INDEX(tblEvents[],SMALL(IF(Dates=F$6,ROW(Dates)),ROW(2:2))-TableRowStart,4),\"\")","v":""},null,null,{"$f":"IFERROR(INDEX(tblEvents[],SMALL(IF(Dates=I$6,ROW(Dates)),ROW(2:2))-TableRowStart,4),\"\")","v":""},null,null,{"$f":"IFERROR(INDEX(tblEvents[],SMALL(IF(Dates=L$6,ROW(Dates)),ROW(2:2))-TableRowStart,4),\"\")","v":""},null,null,{"$f":"IFERROR(INDEX(tblEvents[],SMALL(IF(Dates=O$6,ROW(Dates)),ROW(2:2))-TableRowStart,4),\"\")","v":""},null,null,{"$f":"IFERROR(INDEX(tblEvents[],SMALL(IF(Dates=R$6,ROW(Dates)),ROW(2:2))-TableRowStart,4),\"\")","v":"市議会"},null,null,{"$f":"IFERROR(INDEX(tblEvents[],SMALL(IF(Dates=U$6,ROW(Dates)),ROW(2:2))-TableRowStart,4),\"\")","v":""}]
[null,null,{"$f":"IFERROR(INDEX(tblEvents[],SMALL(IF(Dates=C$6,ROW(Dates)),ROW(3:3))-TableRowStart,4),\"\")","v":""},null,null,{"$f":"IFERROR(INDEX(tblEvents[],SMALL(IF(Dates=F$6,ROW(Dates)),ROW(3:3))-TableRowStart,4),\"\")","v":""},null,null,{"$f":"IFERROR(INDEX(tblEvents[],SMALL(IF(Dates=I$6,ROW(Dates)),ROW(3:3))-TableRowStart,4),\"\")","v":""},null,null,{"$f":"IFERROR(INDEX(tblEvents[],SMALL(IF(Dates=L$6,ROW(Dates)),ROW(3:3))-TableRowStart,4),\"\")","v":""},null,null,{"$f":"IFERROR(INDEX(tblEvents[],SMALL(IF(Dates=O$6,ROW(Dates)),ROW(3:3))-TableRowStart,4),\"\")","v":""},null,null,{"$f":"IFERROR(INDEX(tblEvents[],SMALL(IF(Dates=R$6,ROW(Dates)),ROW(3:3))-TableRowStart,4),\"\")","v":""},null,null,{"$f":"IFERROR(INDEX(tblEvents[],SMALL(IF(Dates=U$6,ROW(Dates)),ROW(3:3))-TableRowStart,4),\"\")","v":""}]
[null,null,{"$f":"IFERROR(INDEX(tblEvents[],SMALL(IF(Dates=C$6,ROW(Dates)),ROW(#REF!))-TableRowStart,4),\"\")","v":""},null,null,{"$f":"IFERROR(INDEX(tblEvents[],SMALL(IF(Dates=F$6,ROW(Dates)),ROW(#REF!))-TableRowStart,4),\"\")","v":""},null,null,{"$f":"IFERROR(INDEX(tblEvents[],SMALL(IF(Dates=I$6,ROW(Dates)),ROW(#REF!))-TableRowStart,4),\"\")","v":""},null,null,{"$f":"IFERROR(INDEX(tblEvents[],SMALL(IF(Dates=L$6,ROW(Dates)),ROW(#REF!))-TableRowStart,4),\"\")","v":""},null,null,{"$f":"IFERROR(INDEX(tblEvents[],SMALL(IF(Dates=O$6,ROW(Dates)),ROW(#REF!))-TableRowStart,4),\"\")","v":""},null,null,{"$f":"IFERROR(INDEX(tblEvents[],SMALL(IF(Dates=R$6,ROW(Dates)),ROW(#REF!))-TableRowStart,4),\"\")","v":""},null,null,{"$f":"IFERROR(INDEX(tblEvents[],SMALL(IF(Dates=U$6,ROW(Dates)),ROW(#REF!))-TableRowStart,4),\"\")","v":""}]
[null,null,{"$f":"U6+1","v":"2016-07-03"},null,null,{"$f":"C11+1","v":"2016-07-04"},null,null,{"$f":"F11+1","v":"2016-07-05"},null,null,{"$f":"I11+1","v":"2016-07-06"},null,null,{"$f":"L11+1","v":"2016-07-07"},null,null,{"$f":"O11+1","v":"2016-07-08"},null,null,{"$f":"R11+1","v":"2016-07-09"}]
[null,null,{"$f":"IFERROR(INDEX(tblEvents[],SMALL(IF(Dates=C$11,ROW(Dates)),ROW(1:1))-TableRowStart,4),\"\")","v":"公園でのナイト ショー"},null,null,{"$f":"IFERROR(INDEX(tblEvents[],SMALL(IF(Dates=F$11,ROW(Dates)),ROW(1:1))-TableRowStart,4),\"\")","v":""},null,null,{"$f":"IFERROR(INDEX(tblEvents[],SMALL(IF(Dates=I$11,ROW(Dates)),ROW(1:1))-TableRowStart,4),\"\")","v":""},null,null,{"$f":"IFERROR(INDEX(tblEvents[],SMALL(IF(Dates=L$11,ROW(Dates)),ROW(1:1))-TableRowStart,4),\"\")","v":""},null,null,{"$f":"IFERROR(INDEX(tblEvents[],SMALL(IF(Dates=O$11,ROW(Dates)),ROW(1:1))-TableRowStart,4),\"\")","v":""},null,null,{"$f":"IFERROR(INDEX(tblEvents[],SMALL(IF(Dates=R$11,ROW(Dates)),ROW(1:1))-TableRowStart,4),\"\")","v":"市議会"},null,null,{"$f":"IFERROR(INDEX(tblEvents[],SMALL(IF(Dates=U$11,ROW(Dates)),ROW(1:1))-TableRowStart,4),\"\")","v":""}]
[null,null,{"$f":"IFERROR(INDEX(tblEvents[],SMALL(IF(Dates=C$11,ROW(Dates)),ROW(2:2))-TableRowStart,4),\"\")","v":""},null,null,{"$f":"IFERROR(INDEX(tblEvents[],SMALL(IF(Dates=F$11,ROW(Dates)),ROW(2:2))-TableRowStart,4),\"\")","v":""},null,null,{"$f":"IFERROR(INDEX(tblEvents[],SMALL(IF(Dates=I$11,ROW(Dates)),ROW(2:2))-TableRowStart,4),\"\")","v":""},null,null,{"$f":"IFERROR(INDEX(tblEvents[],SMALL(IF(Dates=L$11,ROW(Dates)),ROW(2:2))-TableRowStart,4),\"\")","v":""},null,null,{"$f":"IFERROR(INDEX(tblEvents[],SMALL(IF(Dates=O$11,ROW(Dates)),ROW(2:2))-TableRowStart,4),\"\")","v":""},null,null,{"$f":"IFERROR(INDEX(tblEvents[],SMALL(IF(Dates=R$11,ROW(Dates)),ROW(2:2))-TableRowStart,4),\"\")","v":""},null,null,{"$f":"IFERROR(INDEX(tblEvents[],SMALL(IF(Dates=U$11,ROW(Dates)),ROW(2:2))-TableRowStart,4),\"\")","v":""}]
[null,null,{"$f":"IFERROR(INDEX(tblEvents[],SMALL(IF(Dates=C$11,ROW(Dates)),ROW(3:3))-TableRowStart,4),\"\")","v":""},null,null,{"$f":"IFERROR(INDEX(tblEvents[],SMALL(IF(Dates=F$11,ROW(Dates)),ROW(3:3))-TableRowStart,4),\"\")","v":""},null,null,{"$f":"IFERROR(INDEX(tblEvents[],SMALL(IF(Dates=I$11,ROW(Dates)),ROW(3:3))-TableRowStart,4),\"\")","v":""},null,null,{"$f":"IFERROR(INDEX(tblEvents[],SMALL(IF(Dates=L$11,ROW(Dates)),ROW(3:3))-TableRowStart,4),\"\")","v":""},null,null,{"$f":"IFERROR(INDEX(tblEvents[],SMALL(IF(Dates=O$11,ROW(Dates)),ROW(3:3))-TableRowStart,4),\"\")","v":""},null,null,{"$f":"IFERROR(INDEX(tblEvents[],SMALL(IF(Dates=R$11,ROW(Dates)),ROW(3:3))-TableRowStart,4),\"\")","v":""},null,null,{"$f":"IFERROR(INDEX(tblEvents[],SMALL(IF(Dates=U$11,ROW(Dates)),ROW(3:3))-TableRowStart,4),\"\")","v":""}]
[null,null,{"$f":"IFERROR(INDEX(tblEvents[],SMALL(IF(Dates=C$11,ROW(Dates)),ROW(#REF!))-TableRowStart,4),\"\")","v":""},null,null,{"$f":"IFERROR(INDEX(tblEvents[],SMALL(IF(Dates=F$11,ROW(Dates)),ROW(#REF!))-TableRowStart,4),\"\")","v":""},null,null,{"$f":"IFERROR(INDEX(tblEvents[],SMALL(IF(Dates=I$11,ROW(Dates)),ROW(#REF!))-TableRowStart,4),\"\")","v":""},null,null,{"$f":"IFERROR(INDEX(tblEvents[],SMALL(IF(Dates=L$11,ROW(Dates)),ROW(#REF!))-TableRowStart,4),\"\")","v":""},null,null,{"$f":"IFERROR(INDEX(tblEvents[],SMALL(IF(Dates=O$11,ROW(Dates)),ROW(#REF!))-TableRowStart,4),\"\")","v":""},null,null,{"$f":"IFERROR(INDEX(tblEvents[],SMALL(IF(Dates=R$11,ROW(Dates)),ROW(#REF!))-TableRowStart,4),\"\")","v":""},null,null,{"$f":"IFERROR(INDEX(tblEvents[],SMALL(IF(Dates=U$11,ROW(Dates)),ROW(#REF!))-TableRowStart,4),\"\")","v":""}]
[null,null,{"$f":"U11+1","v":"2016-07-10"},null,null,{"$f":"C16+1","v":"2016-07-11"},null,null,{"$f":"F16+1","v":"2016-07-12"},null,null,{"$f":"I16+1","v":"2016-07-13"},null,null,{"$f":"L16+1","v":"2016-07-14"},null,null,{"$f":"O16+1","v":"2016-07-15"},null,null,{"$f":"R16+1","v":"2016-07-16"}]
[null,null,{"$f":"IFERROR(INDEX(tblEvents[],SMALL(IF(Dates=C$16,ROW(Dates)),ROW(1:1))-TableRowStart,4),\"\")","v":""},null,null,{"$f":"IFERROR(INDEX(tblEvents[],SMALL(IF(Dates=F$16,ROW(Dates)),ROW(1:1))-TableRowStart,4),\"\")","v":"コミュニティの議会 昼食会"},null,null,{"$f":"IFERROR(INDEX(tblEvents[],SMALL(IF(Dates=I$16,ROW(Dates)),ROW(1:1))-TableRowStart,4),\"\")","v":"アンティーク展示会"},null,null,{"$f":"IFERROR(INDEX(tblEvents[],SMALL(IF(Dates=L$16,ROW(Dates)),ROW(1:1))-TableRowStart,4),\"\")","v":""},null,null,{"$f":"IFERROR(INDEX(tblEvents[],SMALL(IF(Dates=O$16,ROW(Dates)),ROW(1:1))-TableRowStart,4),\"\")","v":"コミュニティ ワークショップ"},null,null,{"$f":"IFERROR(INDEX(tblEvents[],SMALL(IF(Dates=R$16,ROW(Dates)),ROW(1:1))-TableRowStart,4),\"\")","v":"市議会"},null,null,{"$f":"IFERROR(INDEX(tblEvents[],SMALL(IF(Dates=U$16,ROW(Dates)),ROW(1:1))-TableRowStart,4),\"\")","v":""}]
[null,null,{"$f":"IFERROR(INDEX(tblEvents[],SMALL(IF(Dates=C$16,ROW(Dates)),ROW(2:2))-TableRowStart,4),\"\")","v":""},null,null,{"$f":"IFERROR(INDEX(tblEvents[],SMALL(IF(Dates=F$16,ROW(Dates)),ROW(2:2))-TableRowStart,4),\"\")","v":""},null,null,{"$f":"IFERROR(INDEX(tblEvents[],SMALL(IF(Dates=I$16,ROW(Dates)),ROW(2:2))-TableRowStart,4),\"\")","v":""},null,null,{"$f":"IFERROR(INDEX(tblEvents[],SMALL(IF(Dates=L$16,ROW(Dates)),ROW(2:2))-TableRowStart,4),\"\")","v":""},null,null,{"$f":"IFERROR(INDEX(tblEvents[],SMALL(IF(Dates=O$16,ROW(Dates)),ROW(2:2))-TableRowStart,4),\"\")","v":""},null,null,{"$f":"IFERROR(INDEX(tblEvents[],SMALL(IF(Dates=R$16,ROW(Dates)),ROW(2:2))-TableRowStart,4),\"\")","v":""},null,null,{"$f":"IFERROR(INDEX(tblEvents[],SMALL(IF(Dates=U$16,ROW(Dates)),ROW(2:2))-TableRowStart,4),\"\")","v":""}]
[null,null,{"$f":"IFERROR(INDEX(tblEvents[],SMALL(IF(Dates=C$16,ROW(Dates)),ROW(3:3))-TableRowStart,4),\"\")","v":""},null,null,{"$f":"IFERROR(INDEX(tblEvents[],SMALL(IF(Dates=F$16,ROW(Dates)),ROW(3:3))-TableRowStart,4),\"\")","v":""},null,null,{"$f":"IFERROR(INDEX(tblEvents[],SMALL(IF(Dates=I$16,ROW(Dates)),ROW(3:3))-TableRowStart,4),\"\")","v":""},null,null,{"$f":"IFERROR(INDEX(tblEvents[],SMALL(IF(Dates=L$16,ROW(Dates)),ROW(3:3))-TableRowStart,4),\"\")","v":""},null,null,{"$f":"IFERROR(INDEX(tblEvents[],SMALL(IF(Dates=O$16,ROW(Dates)),ROW(3:3))-TableRowStart,4),\"\")","v":""},null,null,{"$f":"IFERROR(INDEX(tblEvents[],SMALL(IF(Dates=R$16,ROW(Dates)),ROW(3:3))-TableRowStart,4),\"\")","v":""},null,null,{"$f":"IFERROR(INDEX(tblEvents[],SMALL(IF(Dates=U$16,ROW(Dates)),ROW(3:3))-TableRowStart,4),\"\")","v":""}]
[null,null,{"$f":"IFERROR(INDEX(tblEvents[],SMALL(IF(Dates=C$16,ROW(Dates)),ROW(#REF!))-TableRowStart,4),\"\")","v":""},null,null,{"$f":"IFERROR(INDEX(tblEvents[],SMALL(IF(Dates=F$16,ROW(Dates)),ROW(#REF!))-TableRowStart,4),\"\")","v":""},null,null,{"$f":"IFERROR(INDEX(tblEvents[],SMALL(IF(Dates=I$16,ROW(Dates)),ROW(#REF!))-TableRowStart,4),\"\")","v":""},null,null,{"$f":"IFERROR(INDEX(tblEvents[],SMALL(IF(Dates=L$16,ROW(Dates)),ROW(#REF!))-TableRowStart,4),\"\")","v":""},null,null,{"$f":"IFERROR(INDEX(tblEvents[],SMALL(IF(Dates=O$16,ROW(Dates)),ROW(#REF!))-TableRowStart,4),\"\")","v":""},null,null,{"$f":"IFERROR(INDEX(tblEvents[],SMALL(IF(Dates=R$16,ROW(Dates)),ROW(#REF!))-TableRowStart,4),\"\")","v":""},null,null,{"$f":"IFERROR(INDEX(tblEvents[],SMALL(IF(Dates=U$16,ROW(Dates)),ROW(#REF!))-TableRowStart,4),\"\")","v":""}]
{"$rows_left_out":16}
{"sheet":"印刷版","index":2,"n_rows":35,"n_cols":21,"rows_kept":35,"merged":[[1,5,1,11],[30,8,34,20]]}
[]
[null,null,{"$f":"ViewYear","v":{"v":2016,"d":"2016 年"}},null,null,{"$f":"ViewMonth","v":"07 月"},{"$f":"カレンダー!G2","v":0},{"$f":"カレンダー!H2","v":0},{"$f":"カレンダー!I2","v":0},{"$f":"カレンダー!J2","v":0},{"$f":"カレンダー!K2","v":0},{"$f":"カレンダー!L2","v":0}]
[]
[null,null,"日",null,null,"月",null,null,"火",null,null,"水",null,null,"木",null,null,"金",null,null,"土"]
[]
[null,null,{"$f":"カレンダー!C6","v":"2016-06-26"},{"$f":"カレンダー!D6","v":0},{"$f":"カレンダー!E6","v":0},{"$f":"カレンダー!F6","v":"2016-06-27"},{"$f":"カレンダー!G6","v":0},{"$f":"カレンダー!H6","v":0},{"$f":"カレンダー!I6","v":"2016-06-28"},{"$f":"カレンダー!J6","v":0},{"$f":"カレンダー!K6","v":0},{"$f":"カレンダー!L6","v":"2016-06-29"},{"$f":"カレンダー!M6","v":0},{"$f":"カレンダー!N6","v":0},{"$f":"カレンダー!O6","v":"2016-06-30"},{"$f":"カレンダー!P6","v":0},{"$f":"カレンダー!Q6","v":0},{"$f":"カレンダー!R6","v":"2016-07-01"},{"$f":"カレンダー!S6","v":0},{"$f":"カレンダー!T6","v":0},{"$f":"カレンダー!U6","v":"2016-07-02"}]
[null,null,{"$f":"カレンダー!C7","v":""},{"$f":"カレンダー!D7","v":0},{"$f":"カレンダー!E7","v":0},{"$f":"カレンダー!F7","v":""},{"$f":"カレンダー!G7","v":0},{"$f":"カレンダー!H7","v":0},{"$f":"カレンダー!I7","v":""},{"$f":"カレンダー!J7","v":0},{"$f":"カレンダー!K7","v":0},{"$f":"カレンダー!L7","v":""},{"$f":"カレンダー!M7","v":0},{"$f":"カレンダー!N7","v":0},{"$f":"カレンダー!O7","v":""},{"$f":"カレンダー!P7","v":0},{"$f":"カレンダー!Q7","v":0},{"$f":"カレンダー!R7","v":"コミュニティ ガーデン"},{"$f":"カレンダー!S7","v":0},{"$f":"カレンダー!T7","v":0},{"$f":"カレンダー!U7","v":"コミュニティ ガーデン"}]
[null,null,{"$f":"カレンダー!C8","v":""},{"$f":"カレンダー!D8","v":"00:00:00"},{"$f":"カレンダー!E8","v":"00:00:00"},{"$f":"カレンダー!F8","v":""},{"$f":"カレンダー!G8","v":"00:00:00"},{"$f":"カレンダー!H8","v":"00:00:00"},{"$f":"カレンダー!I8","v":""},{"$f":"カレンダー!J8","v":"00:00:00"},{"$f":"カレンダー!K8","v":"00:00:00"},{"$f":"カレンダー!L8","v":""},{"$f":"カレンダー!M8","v":"00:00:00"},{"$f":"カレンダー!N8","v":"00:00:00"},{"$f":"カレンダー!O8","v":""},{"$f":"カレンダー!P8","v":"00:00:00"},{"$f":"カレンダー!Q8","v":"00:00:00"},{"$f":"カレンダー!R8","v":"市議会"},{"$f":"カレンダー!S8","v":"00:00:00"},{"$f":"カレンダー!T8","v":"00:00:00"},{"$f":"カレンダー!U8","v":""}]
[null,null,{"$f":"カレンダー!C9","v":""},{"$f":"カレンダー!D9","v":0},{"$f":"カレンダー!E9","v":0},{"$f":"カレンダー!F9","v":""},{"$f":"カレンダー!G9","v":0},{"$f":"カレンダー!H9","v":0},{"$f":"カレンダー!I9","v":""},{"$f":"カレンダー!J9","v":0},{"$f":"カレンダー!K9","v":0},{"$f":"カレンダー!L9","v":""},{"$f":"カレンダー!M9","v":0},{"$f":"カレンダー!N9","v":0},{"$f":"カレンダー!O9","v":""},{"$f":"カレンダー!P9","v":0},{"$f":"カレンダー!Q9","v":0},{"$f":"カレンダー!R9","v":""},{"$f":"カレンダー!S9","v":0},{"$f":"カレンダー!T9","v":0},{"$f":"カレンダー!U9","v":""}]
[null,null,{"$f":"カレンダー!C10","v":""},{"$f":"カレンダー!D10","v":0},{"$f":"カレンダー!E10","v":0},{"$f":"カレンダー!F10","v":""},{"$f":"カレンダー!G10","v":0},{"$f":"カレンダー!H10","v":0},{"$f":"カレンダー!I10","v":""},{"$f":"カレンダー!J10","v":0},{"$f":"カレンダー!K10","v":0},{"$f":"カレンダー!L10","v":""},{"$f":"カレンダー!M10","v":0},{"$f":"カレンダー!N10","v":0},{"$f":"カレンダー!O10","v":""},{"$f":"カレンダー!P10","v":0},{"$f":"カレンダー!Q10","v":0},{"$f":"カレンダー!R10","v":""},{"$f":"カレンダー!S10","v":0},{"$f":"カレンダー!T10","v":0},{"$f":"カレンダー!U10","v":""}]
[null,null,{"$f":"カレンダー!C11","v":"2016-07-03"},{"$f":"カレンダー!D11","v":0},{"$f":"カレンダー!E11","v":0},{"$f":"カレンダー!F11","v":"2016-07-04"},{"$f":"カレンダー!G11","v":0},{"$f":"カレンダー!H11","v":0},{"$f":"カレンダー!I11","v":"2016-07-05"},{"$f":"カレンダー!J11","v":0},{"$f":"カレンダー!K11","v":0},{"$f":"カレンダー!L11","v":"2016-07-06"},{"$f":"カレンダー!M11","v":0},{"$f":"カレンダー!N11","v":0},{"$f":"カレンダー!O11","v":"2016-07-07"},{"$f":"カレンダー!P11","v":0},{"$f":"カレンダー!Q11","v":0},{"$f":"カレンダー!R11","v":"2016-07-08"},{"$f":"カレンダー!S11","v":0},{"$f":"カレンダー!T11","v":0},{"$f":"カレンダー!U11","v":"2016-07-09"}]
[null,null,{"$f":"カレンダー!C12","v":"公園でのナイト ショー"},{"$f":"カレンダー!D12","v":0},{"$f":"カレンダー!E12","v":0},{"$f":"カレンダー!F12","v":""},{"$f":"カレンダー!G12","v":0},{"$f":"カレンダー!H12","v":0},{"$f":"カレンダー!I12","v":""},{"$f":"カレンダー!J12","v":0},{"$f":"カレンダー!K12","v":0},{"$f":"カレンダー!L12","v":""},{"$f":"カレンダー!M12","v":0},{"$f":"カレンダー!N12","v":0},{"$f":"カレンダー!O12","v":""},{"$f":"カレンダー!P12","v":0},{"$f":"カレンダー!Q12","v":0},{"$f":"カレンダー!R12","v":"市議会"},{"$f":"カレンダー!S12","v":0},{"$f":"カレンダー!T12","v":0},{"$f":"カレンダー!U12","v":""}]
[null,null,{"$f":"カレンダー!C13","v":""},{"$f":"カレンダー!D13","v":0},{"$f":"カレンダー!E13","v":0},{"$f":"カレンダー!F13","v":""},{"$f":"カレンダー!G13","v":0},{"$f":"カレンダー!H13","v":0},{"$f":"カレンダー!I13","v":""},{"$f":"カレンダー!J13","v":0},{"$f":"カレンダー!K13","v":0},{"$f":"カレンダー!L13","v":""},{"$f":"カレンダー!M13","v":0},{"$f":"カレンダー!N13","v":0},{"$f":"カレンダー!O13","v":""},{"$f":"カレンダー!P13","v":0},{"$f":"カレンダー!Q13","v":0},{"$f":"カレンダー!R13","v":""},{"$f":"カレンダー!S13","v":0},{"$f":"カレンダー!T13","v":0},{"$f":"カレンダー!U13","v":""}]
[null,null,{"$f":"カレンダー!C14","v":""},{"$f":"カレンダー!D14","v":0},{"$f":"カレンダー!E14","v":0},{"$f":"カレンダー!F14","v":""},{"$f":"カレンダー!G14","v":0},{"$f":"カレンダー!H14","v":0},{"$f":"カレンダー!I14","v":""},{"$f":"カレンダー!J14","v":0},{"$f":"カレンダー!K14","v":0},{"$f":"カレンダー!L14","v":""},{"$f":"カレンダー!M14","v":0},{"$f":"カレンダー!N14","v":0},{"$f":"カレンダー!O14","v":""},{"$f":"カレンダー!P14","v":0},{"$f":"カレンダー!Q14","v":0},{"$f":"カレンダー!R14","v":""},{"$f":"カレンダー!S14","v":0},{"$f":"カレンダー!T14","v":0},{"$f":"カレンダー!U14","v":""}]
[null,null,{"$f":"カレンダー!C15","v":""},{"$f":"カレンダー!D15","v":0},{"$f":"カレンダー!E15","v":0},{"$f":"カレンダー!F15","v":""},{"$f":"カレンダー!G15","v":0},{"$f":"カレンダー!H15","v":0},{"$f":"カレンダー!I15","v":""},{"$f":"カレンダー!J15","v":0},{"$f":"カレンダー!K15","v":0},{"$f":"カレンダー!L15","v":""},{"$f":"カレンダー!M15","v":0},{"$f":"カレンダー!N15","v":0},{"$f":"カレンダー!O15","v":""},{"$f":"カレンダー!P15","v":0},{"$f":"カレンダー!Q15","v":0},{"$f":"カレンダー!R15","v":""},{"$f":"カレンダー!S15","v":0},{"$f":"カレンダー!T15","v":0},{"$f":"カレンダー!U15","v":""}]
[null,null,{"$f":"カレンダー!C16","v":"2016-07-10"},{"$f":"カレンダー!D16","v":0},{"$f":"カレンダー!E16","v":0},{"$f":"カレンダー!F16","v":"2016-07-11"},{"$f":"カレンダー!G16","v":0},{"$f":"カレンダー!H16","v":0},{"$f":"カレンダー!I16","v":"2016-07-12"},{"$f":"カレンダー!J16","v":0},{"$f":"カレンダー!K16","v":0},{"$f":"カレンダー!L16","v":"2016-07-13"},{"$f":"カレンダー!M16","v":0},{"$f":"カレンダー!N16","v":0},{"$f":"カレンダー!O16","v":"2016-07-14"},{"$f":"カレンダー!P16","v":0},{"$f":"カレンダー!Q16","v":0},{"$f":"カレンダー!R16","v":"2016-07-15"},{"$f":"カレンダー!S16","v":0},{"$f":"カレンダー!T16","v":0},{"$f":"カレンダー!U16","v":"2016-07-16"}]
[null,null,{"$f":"カレンダー!C17","v":""},{"$f":"カレンダー!D17","v":0},{"$f":"カレンダー!E17","v":0},{"$f":"カレンダー!F17","v":"コミュニティの議会 昼食会"},{"$f":"カレンダー!G17","v":0},{"$f":"カレンダー!H17","v":0},{"$f":"カレンダー!I17","v":"アンティーク展示会"},{"$f":"カレンダー!J17","v":0},{"$f":"カレンダー!K17","v":0},{"$f":"カレンダー!L17","v":""},{"$f":"カレンダー!M17","v":0},{"$f":"カレンダー!N17","v":0},{"$f":"カレンダー!O17","v":"コミュニティ ワークショップ"},{"$f":"カレンダー!P17","v":0},{"$f":"カレンダー!Q17","v":0},{"$f":"カレンダー!R17","v":"市議会"},{"$f":"カレンダー!S17","v":0},{"$f":"カレンダー!T17","v":0},{"$f":"カレンダー!U17","v":""}]
[null,null,{"$f":"カレンダー!C18","v":""},{"$f":"カレンダー!D18","v":0},{"$f":"カレンダー!E18","v":0},{"$f":"カレンダー!F18","v":""},{"$f":"カレンダー!G18","v":0},{"$f":"カレンダー!H18","v":0},{"$f":"カレンダー!I18","v":""},{"$f":"カレンダー!J18","v":0},{"$f":"カレンダー!K18","v":0},{"$f":"カレンダー!L18","v":""},{"$f":"カレンダー!M18","v":0},{"$f":"カレンダー!N18","v":0},{"$f":"カレンダー!O18","v":""},{"$f":"カレンダー!P18","v":0},{"$f":"カレンダー!Q18","v":0},{"$f":"カレンダー!R18","v":""},{"$f":"カレンダー!S18","v":0},{"$f":"カレンダー!T18","v":0},{"$f":"カレンダー!U18","v":""}]
[null,null,{"$f":"カレンダー!C19","v":""},{"$f":"カレンダー!D19","v":0},{"$f":"カレンダー!E19","v":0},{"$f":"カレンダー!F19","v":""},{"$f":"カレンダー!G19","v":0},{"$f":"カレンダー!H19","v":0},{"$f":"カレンダー!I19","v":""},{"$f":"カレンダー!J19","v":0},{"$f":"カレンダー!K19","v":0},{"$f":"カレンダー!L19","v":""},{"$f":"カレンダー!M19","v":0},{"$f":"カレンダー!N19","v":0},{"$f":"カレンダー!O19","v":""},{"$f":"カレンダー!P19","v":0},{"$f":"カレンダー!Q19","v":0},{"$f":"カレンダー!R19","v":""},{"$f":"カレンダー!S19","v":0},{"$f":"カレンダー!T19","v":0},{"$f":"カレンダー!U19","v":""}]
[null,null,{"$f":"カレンダー!C20","v":""},{"$f":"カレンダー!D20","v":0},{"$f":"カレンダー!E20","v":0},{"$f":"カレンダー!F20","v":""},{"$f":"カレンダー!G20","v":0},{"$f":"カレンダー!H20","v":0},{"$f":"カレンダー!I20","v":""},{"$f":"カレンダー!J20","v":0},{"$f":"カレンダー!K20","v":0},{"$f":"カレンダー!L20","v":""},{"$f":"カレンダー!M20","v":0},{"$f":"カレンダー!N20","v":0},{"$f":"カレンダー!O20","v":""},{"$f":"カレンダー!P20","v":0},{"$f":"カレンダー!Q20","v":0},{"$f":"カレンダー!R20","v":""},{"$f":"カレンダー!S20","v":0},{"$f":"カレンダー!T20","v":0},{"$f":"カレンダー!U20","v":""}]
{"$rows_left_out":16}
{"sheet":"管理者","index":3,"n_rows":14,"n_cols":3,"rows_kept":14,"hidden":true}
[]
[null,"月","数"]
[null,"01 月",1]
[null,"02 月",2]
[null,"03 月",3]
[null,"04 月",4]
[null,"05 月",5]
[null,"06 月",6]
[null,"07 月",7]
[null,"08 月",8]
[null,"09 月",9]
[null,"10 月",10]
[null,"11 月",11]
[null,"12 月",12]