{"text_format":"3","workbook":"xlsx","n_sheets":2,"sheets":["従業員のタイムシート","平日_検索"],"not_rendered":{"defined_names":27},"read":"whole","date_system":"1900"}

{"sheet":"従業員のタイムシート","index":0,"n_rows":36,"n_cols":26,"rows_kept":36,"merged":[[0,1,2,4],[0,5,2,9],[0,10,2,14],[0,15,3,23],[0,24,3,24],[3,1,3,3],[3,5,3,9],[3,10,3,14],[4,1,6,3],[4,4,6,6],[5,14,7,14],[5,22,7,22],[5,23,7,23],[5,24,7,24],[21,1,21,6],[22,1,23,3],[22,4,23,6],[23,14,24,14],[23,22,24,22],[23,23,24,23],[23,24,24,24],[32,1,32,6],[32,24,33,24],[32,25,33,25],[33,1,33,6],[34,1,34,6],[35,1,35,3],[35,4,35,5],[35,6,35,7],[35,8,35,14],[35,15,35,16],[35,17,35,23]]}
[null,"従業員業務タイムカード",{"$nulls":3},"従業員名",{"$nulls":9},"残業の承認が必要な場合は、\n右側にあるセルで [はい] を選択します"]
[]
[]
[null,"給与の終了日",null,null,{"$f":"V7","v":"2025-06-14"},"従業員番号"]
[null,"所定労働時間",null,null,"日付:"]
[{"$nulls":14},"合計\n週 1\n所定労働",{"$nulls":7},"合計\n週 2\n所定労働","合計\n所定労働\n時間","給与では\n支払コード\nのみを使用"]
[{"$nulls":7},"2025-06-01",{"$f":"日_1+1","v":"2025-06-02"},{"$f":"日_1+2","v":"2025-06-03"},{"$f":"日_1+3","v":"2025-06-04"},{"$f":"日_1+4","v":"2025-06-05"},{"$f":"日_1+5","v":"2025-06-06"},{"$f":"日_1+6","v":"2025-06-07"},null,{"$f":"日_1+7","v":"2025-06-08"},{"$f":"日_1+8","v":"2025-06-09"},{"$f":"日_1+9","v":"2025-06-10"},{"$f":"日_1+10","v":"2025-06-11"},{"$f":"日_1+11","v":"2025-06-12"},{"$f":"日_1+12","v":"2025-06-13"},{"$f":"日_1+13","v":"2025-06-14"}]
[null,"タスク","場所","作業番号","仕事の説明","役職","所有権証明書番号",{"$f":"VLOOKUP(WEEKDAY(日_1),'平日_検索'!$B$2:$C$8,2)","v":"日"},{"$f":"VLOOKUP(WEEKDAY(I7),'平日_検索'!$B$2:$C$8,2)","v":"月"},{"$f":"VLOOKUP(WEEKDAY(J7),'平日_検索'!$B$2:$C$8,2)","v":"火"},{"$f":"VLOOKUP(WEEKDAY(K7),'平日_検索'!$B$2:$C$8,2)","v":"水"},{"$f":"VLOOKUP(WEEKDAY(L7),'平日_検索'!$B$2:$C$8,2)","v":"木"},{"$f":"VLOOKUP(WEEKDAY(M7),'平日_検索'!$B$2:$C$8,2)","v":"金"},{"$f":"VLOOKUP(WEEKDAY(N7),'平日_検索'!$B$2:$C$8,2)","v":"土"},null,{"$f":"VLOOKUP(WEEKDAY(P7),'平日_検索'!$B$2:$C$8,2)","v":"日"},{"$f":"VLOOKUP(WEEKDAY(Q7),'平日_検索'!$B$2:$C$8,2)","v":"月"},{"$f":"VLOOKUP(WEEKDAY(R7),'平日_検索'!$B$2:$C$8,2)","v":"火"},{"$f":"VLOOKUP(WEEKDAY(S7),'平日_検索'!$B$2:$C$8,2)","v":"水"},{"$f":"VLOOKUP(WEEKDAY(T7),'平日_検索'!$B$2:$C$8,2)","v":"木"},{"$f":"VLOOKUP(WEEKDAY(U7),'平日_検索'!$B$2:$C$8,2)","v":"金"},{"$f":"VLOOKUP(WEEKDAY(V7),'平日_検索'!$B$2:$C$8,2)","v":"土"}]
[{"$nulls":14},{"$f":"SUM(H9:N9)","v":{"v":0,"d":"0.00"}},{"$nulls":7},{"$f":"SUM(P9:V9)","v":{"v":0,"d":"0.00"}},{"$f":"O9+W9","v":{"v":0,"d":"0.00"}}]
[{"$nulls":14},{"v":0,"d":"0.00"},{"$nulls":7},{"v":0,"d":"0.00"},{"v":0,"d":"0.00"}]
[{"$nulls":14},{"v":0,"d":"0.00"},{"$nulls":7},{"v":0,"d":"0.00"},{"v":0,"d":"0.00"}]
[{"$nulls":14},{"v":0,"d":"0.00"},{"$nulls":7},{"v":0,"d":"0.00"},{"v":0,"d":"0.00"}]
[{"$nulls":14},{"v":0,"d":"0.00"},{"$nulls":7},{"v":0,"d":"0.00"},{"v":0,"d":"0.00"}]
[{"$nulls":14},{"v":0,"d":"0.00"},{"$nulls":7},{"v":0,"d":"0.00"},{"v":0,"d":"0.00"}]
[{"$nulls":14},{"v":0,"d":"0.00"},{"$nulls":7},{"v":0,"d":"0.00"},{"v":0,"d":"0.00"}]
[{"$nulls":14},{"$f":"SUM(H16:N16)","v":{"v":0,"d":"0.00"}},{"$nulls":7},{"$f":"SUM(P16:V16)","v":{"v":0,"d":"0.00"}},{"$f":"O16+W16","v":{"v":0,"d":"0.00"}}]
[{"$nulls":14},{"v":0,"d":"0.00"},{"$nulls":7},{"v":0,"d":"0.00"},{"v":0,"d":"0.00"}]
[{"$nulls":14},{"v":0,"d":"0.00"},{"$nulls":7},{"v":0,"d":"0.00"},{"v":0,"d":"0.00"}]
[{"$nulls":14},{"v":0,"d":"0.00"},{"$nulls":7},{"v":0,"d":"0.00"},{"v":0,"d":"0.00"}]
[{"$nulls":14},{"v":0,"d":"0.00"},{"$nulls":7},{"v":0,"d":"0.00"},{"v":0,"d":"0.00"}]
[{"$nulls":14},{"v":0,"d":"0.00"},{"$nulls":7},{"v":0,"d":"0.00"},{"v":0,"d":"0.00"}]
[null,"所定労働時間合計   ",{"$nulls":5},{"$f":"SUM(H9:H21)","v":{"v":0,"d":"0.00"}},{"v":0,"d":"0.00"},{"v":0,"d":"0.00"},{"v":0,"d":"0.00"},{"v":0,"d":"0.00"},{"v":0,"d":"0.00"},{"v":0,"d":"0.00"},{"v":0,"d":"0.00"},{"v":0,"d":"0.00"},{"$f":"SUM(Q9:Q21)","v":{"v":0,"d":"0.00"}},{"v":0,"d":"0.00"},{"v":0,"d":"0.00"},{"v":0,"d":"0.00"},{"v":0,"d":"0.00"},{"v":0,"d":"0.00"},{"$f":"SUM(W9:W21)","v":{"v":0,"d":"0.00"}},{"$f":"SUM(X9:X21)","v":{"v":0,"d":"0.00"}}]
[null,"残業時間",null,null,"日付:"]
[{"$nulls":7},{"$f":"日_1","v":"2025-06-01"},{"$f":"日_1+1","v":"2025-06-02"},{"$f":"日_1+2","v":"2025-06-03"},{"$f":"日_1+3","v":"2025-06-04"},{"$f":"日_1+4","v":"2025-06-05"},{"$f":"日_1+5","v":"2025-06-06"},{"$f":"日_1+6","v":"2025-06-07"},"週 1 O/T",{"$f":"日_1+7","v":"2025-06-08"},{"$f":"日_1+8","v":"2025-06-09"},{"$f":"日_1+9","v":"2025-06-10"},{"$f":"日_1+10","v":"2025-06-11"},{"$f":"日_1+11","v":"2025-06-12"},{"$f":"日_1+12","v":"2025-06-13"},{"$f":"日_1+13","v":"2025-06-14"},"週 2 O/T","合計 O/T","残業\nコード"]
[null,"タスク","場所","作業番号","仕事の説明","役職","所有権証明書番号",{"$f":"VLOOKUP(WEEKDAY(日_1),'平日_検索'!$B$2:$C$8,2)","v":"日"},{"$f":"VLOOKUP(WEEKDAY(I24),'平日_検索'!$B$2:$C$8,2)","v":"月"},{"$f":"VLOOKUP(WEEKDAY(J24),'平日_検索'!$B$2:$C$8,2)","v":"火"},{"$f":"VLOOKUP(WEEKDAY(K24),'平日_検索'!$B$2:$C$8,2)","v":"水"},{"$f":"VLOOKUP(WEEKDAY(L24),'平日_検索'!$B$2:$C$8,2)","v":"木"},{"$f":"VLOOKUP(WEEKDAY(M24),'平日_検索'!$B$2:$C$8,2)","v":"金"},{"$f":"VLOOKUP(WEEKDAY(N24),'平日_検索'!$B$2:$C$8,2)","v":"土"},null,{"$f":"VLOOKUP(WEEKDAY(P24),'平日_検索'!$B$2:$C$8,2)","v":"日"},{"$f":"VLOOKUP(WEEKDAY(Q24),'平日_検索'!$B$2:$C$8,2)","v":"月"},{"$f":"VLOOKUP(WEEKDAY(R24),'平日_検索'!$B$2:$C$8,2)","v":"火"},{"$f":"VLOOKUP(WEEKDAY(S24),'平日_検索'!$B$2:$C$8,2)","v":"水"},{"$f":"VLOOKUP(WEEKDAY(T24),'平日_検索'!$B$2:$C$8,2)","v":"木"},{"$f":"VLOOKUP(WEEKDAY(U24),'平日_検索'!$B$2:$C$8,2)","v":"金"},{"$f":"VLOOKUP(WEEKDAY(V24),'平日_検索'!$B$2:$C$8,2)","v":"土"}]
[{"$nulls":14},{"$f":"SUM(H26:N26)","v":{"v":0,"d":"0.00"}},{"$nulls":7},{"$f":"SUM(P26:V26)","v":{"v":0,"d":"0.00"}},{"$f":"O26+W26","v":{"v":0,"d":"0.00"}}]
[{"$nulls":14},{"v":0,"d":"0.00"},{"$nulls":7},{"v":0,"d":"0.00"},{"v":0,"d":"0.00"}]
[{"$nulls":14},{"v":0,"d":"0.00"},{"$nulls":7},{"v":0,"d":"0.00"},{"v":0,"d":"0.00"}]
[{"$nulls":14},{"v":0,"d":"0.00"},{"$nulls":7},{"v":0,"d":"0.00"},{"v":0,"d":"0.00"}]
[{"$nulls":14},{"v":0,"d":"0.00"},{"$nulls":7},{"v":0,"d":"0.00"},{"v":0,"d":"0.00"}]
[{"$nulls":14},{"v":0,"d":"0.00"},{"$nulls":7},{"v":0,"d":"0.00"},{"v":0,"d":"0.00"}]
[{"$nulls":14},{"v":0,"d":"0.00"},{"$nulls":7},{"v":0,"d":"0.00"},{"v":0,"d":"0.00"}]
[null,"残業時間合計     ",{"$nulls":5},{"$f":"SUM(H26:H32)","v":{"v":0,"d":"0.00"}},{"v":0,"d":"0.00"},{"v":0,"d":"0.00"},{"v":0,"d":"0.00"},{"v":0,"d":"0.00"},{"v":0,"d":"0.00"},{"v":0,"d":"0.00"},{"$f":"SUM(O26:O32)","v":{"v":0,"d":"0.00"}},{"v":0,"d":"0.00"},{"v":0,"d":"0.00"},{"v":0,"d":"0.00"},{"v":0,"d":"0.00"},{"v":0,"d":"0.00"},{"v":0,"d":"0.00"},{"v":0,"d":"0.00"},{"$f":"SUM(P33:V33)","v":{"v":0,"d":"0.00"}},{"$f":"SUM(X26:X32)","v":{"v":0,"d":"0.00"}},"勤務\n時間\n合計","支払われる\n時間\n合計"]
[null,"超過勤務手当     ",{"$nulls":12},{"$f":"IF(SUM(H34:N34)<=O33,SUM(H34:N34),O33)","v":{"v":0,"d":"0.00"}},{"$nulls":7},{"$f":"IF(SUM(P34:V34)<=W33,SUM(P34:V34),W33)","v":{"v":0,"d":"0.00"}},{"$f":"IF(SUM(Q34:W34)<=X33,SUM(Q34:W34),X33)","v":{"v":0,"d":"0.00"}}]
[null,"支払われる残業代     ",{"$nulls":5},{"$f":"IF(H33>=H34,H33-H34,H33)","v":{"v":0,"d":"0.00"}},{"$f":"IF(I33>=I34,I33-I34,I33)","v":{"v":0,"d":"0.00"}},{"v":0,"d":"0.00"},{"v":0,"d":"0.00"},{"v":0,"d":"0.00"},{"v":0,"d":"0.00"},{"v":0,"d":"0.00"},{"v":0,"d":"0.00"},{"v":0,"d":"0.00"},{"v":0,"d":"0.00"},{"v":0,"d":"0.00"},{"v":0,"d":"0.00"},{"v":0,"d":"0.00"},{"v":0,"d":"0.00"},{"v":0,"d":"0.00"},{"$f":"IF(W33>=W34,W33-W34,W33)","v":{"v":0,"d":"0.00"}},{"$f":"IF(X33>=X34,X33-X34,X33)","v":{"v":0,"d":"0.00"}},{"$f":"$X$22+$X$33","v":{"v":0,"d":"0.00"}},{"$f":"X22+X35","v":{"v":0,"d":"0.00"}}]
[null,"従業員 ",{"$nulls":4},"監督者 ",{"$nulls":8},"監督者 "]

{"sheet":"平日_検索","index":1,"n_rows":8,"n_cols":3,"rows_kept":8}
[null,"週日\n整数","週日\nイニシャル"]
[null,1,"日"]
[null,2,"月"]
[null,3,"火"]
[null,4,"水"]
[null,5,"木"]
[null,6,"金"]
[null,7,"土"]