{"text_format":"3","workbook":"xlsx","n_sheets":4,"sheets":["Dati grafico","Diagramma di Gantt","Dati grafico dinamici nascosto","Informazioni"],"not_rendered":{"charts":1,"defined_names":4},"read":"whole","date_system":"1900"}

{"sheet":"Dati grafico","index":0,"n_rows":26,"n_cols":11,"rows_kept":26,"merged":[[1,1,1,2]]}
["Creare un diagramma di Gantt per il monitoraggio delle date in questo foglio di lavoro.\nIl titolo di questo foglio di lavoro si trova nella cella B1. \nLe informazioni su come usare questo foglio di lavoro, con istruzioni per le utilità per la lettura dello schermo, si trovano nel foglio di lavoro Informazioni.\nContinuare a spostarsi verso il basso nella colonna A per altre istruzioni.","Diagramma di Gantt per il monitoraggio delle date"]
["Selezionare l'opzione Sì nella cella D2 se si desidera evidenziare la data di oggi nel foglio di lavoro Diagramma di Gantt. \nSelezionare l'opzione No nella cella D2 se non si desidera evidenziare la data di oggi nel foglio di lavoro Diagramma di Gantt.\nNella cella D2, selezionare ALT+Freccia in giù per le opzioni.","Monitorare la data odierna?",null,"Sì"]
["L'intestazione Attività cardine per la relativa tabella si trova nella cella B3.\nL'intestazione Attività per la relativa tabella si trova nella cella G3.","Attività cardine",{"$nulls":4},"Attività"]
["Le informazioni sulle colonne nella tabella delle attività cardine si trovano in questa riga dalla cella B4 alla cella E4.\nLe informazioni sulle colonne nella tabella delle attività si trovano in questa riga dalla cella G4 alla cella J4.","Questa colonna deve essere ordinata in sequenza.","Colonna Posizione, le attività cardine all'interno del diagramma delle attività.","Immettere la data per un'attività cardine in questa colonna.","Immettere la descrizione di un'attività cardine in questa colonna. Queste descrizioni vengono visualizzare nel diagramma.",null,"Questa colonna deve essere ordinata in sequenza.","Immettere la data di inizio per ogni attività di seguito. Per risultati ottimali ordinare questa colonna in ordine crescente.","Immettere la data di fine per ogni attività di seguito, in questa colonna.","Immettere le attività in questa colonna.","Colonna calcolata automaticamente utilizzata per inserire nel diagramma la durata di ogni attività. Non eliminare o modificare."]
["Le intestazioni della tabella Attività cardine si trovano dalla cella B5 alla cella E5. Le intestazioni della tabella Attività si trovano dalla cella G5 alla cella K5.\nI dati di esempio delle attività cardine si trovano dalla cella B6 alla cella E17. \nI dati di esempio delle attività si trovano dalla cella G6 alla cella J17.\nL'istruzione successiva si trova nella cella A21.","N.","Posizione","data","Attività cardine",null,"N.","Data di inizio","Data di fine","Attività","Durata in giorni"]
[null,1,1,{"$f":"Data_iniziale+10","v":"2018-08-25"},"Attività cardine 1",null,1,{"$f":"TODAY()-1","v":"2018-08-15"},{"$f":"Attività_1[[#This Row],[Data di inizio]]+1","v":"2018-08-16"},"Attività 1",{"$f":"IFERROR(IF(LEN(Attività_1[[#This Row],[Data di inizio]])=0,\"\",(INT(Attività_1[[#This Row],[Data di fine]])-INT(Attività_1[[#This Row],[Data di inizio]]))-(INT(Attività_1[[#This Row],[Data di inizio]])-INT(Attività_1[[#This Row],[Data di inizio]]))+1),\"\")","v":2}]
[null,2,1,{"$f":"TODAY()+25","v":"2018-09-10"},"Attività cardine 2",null,2,{"$f":"TODAY()","v":"2018-08-16"},{"$f":"Attività_1[[#This Row],[Data di inizio]]+1","v":"2018-08-17"},"Attività 2",{"$f":"IFERROR(IF(LEN(Attività_1[[#This Row],[Data di inizio]])=0,\"\",(INT(Attività_1[[#This Row],[Data di fine]])-INT(Attività_1[[#This Row],[Data di inizio]]))-(INT(Attività_1[[#This Row],[Data di inizio]])-INT(Attività_1[[#This Row],[Data di inizio]]))+1),\"\")","v":2}]
[null,3,1,{"$f":"TODAY()+35","v":"2018-09-20"},"Attività cardine 3",null,3,{"$f":"TODAY()","v":"2018-08-16"},{"$f":"Attività_1[[#This Row],[Data di inizio]]+5","v":"2018-08-21"},"Attività 3",{"$f":"IFERROR(IF(LEN(Attività_1[[#This Row],[Data di inizio]])=0,\"\",(INT(Attività_1[[#This Row],[Data di fine]])-INT(Attività_1[[#This Row],[Data di inizio]]))-(INT(Attività_1[[#This Row],[Data di inizio]])-INT(Attività_1[[#This Row],[Data di inizio]]))+1),\"\")","v":6}]
[null,4,1,{"$f":"TODAY()+45","v":"2018-09-30"},"Attività cardine 4",null,4,{"$f":"TODAY()+1","v":"2018-08-17"},{"$f":"Attività_1[[#This Row],[Data di inizio]]+7","v":"2018-08-24"},"Attività 4",{"$f":"IFERROR(IF(LEN(Attività_1[[#This Row],[Data di inizio]])=0,\"\",(INT(Attività_1[[#This Row],[Data di fine]])-INT(Attività_1[[#This Row],[Data di inizio]]))-(INT(Attività_1[[#This Row],[Data di inizio]])-INT(Attività_1[[#This Row],[Data di inizio]]))+1),\"\")","v":8}]
[null,5,1,{"$f":"TODAY()+60","v":"2018-10-15"},"Attività cardine 5",null,5,{"$f":"TODAY()+8","v":"2018-08-24"},{"$f":"Attività_1[[#This Row],[Data di inizio]]+10","v":"2018-09-03"},"Attività 5",{"$f":"IFERROR(IF(LEN(Attività_1[[#This Row],[Data di inizio]])=0,\"\",(INT(Attività_1[[#This Row],[Data di fine]])-INT(Attività_1[[#This Row],[Data di inizio]]))-(INT(Attività_1[[#This Row],[Data di inizio]])-INT(Attività_1[[#This Row],[Data di inizio]]))+1),\"\")","v":11}]
[null,6,1,{"$f":"TODAY()+70","v":"2018-10-25"},"Attività cardine 6",null,6,{"$f":"TODAY()+12","v":"2018-08-28"},{"$f":"Attività_1[[#This Row],[Data di inizio]]+30","v":"2018-09-27"},"Attività 6",{"$f":"IFERROR(IF(LEN(Attività_1[[#This Row],[Data di inizio]])=0,\"\",(INT(Attività_1[[#This Row],[Data di fine]])-INT(Attività_1[[#This Row],[Data di inizio]]))-(INT(Attività_1[[#This Row],[Data di inizio]])-INT(Attività_1[[#This Row],[Data di inizio]]))+1),\"\")","v":31}]
[{"$nulls":6},7,{"$f":"TODAY()+15","v":"2018-08-31"},{"$f":"Attività_1[[#This Row],[Data di inizio]]+15","v":"2018-09-15"},"Attività 7",{"$f":"IFERROR(IF(LEN(Attività_1[[#This Row],[Data di inizio]])=0,\"\",(INT(Attività_1[[#This Row],[Data di fine]])-INT(Attività_1[[#This Row],[Data di inizio]]))-(INT(Attività_1[[#This Row],[Data di inizio]])-INT(Attività_1[[#This Row],[Data di inizio]]))+1),\"\")","v":16}]
[{"$nulls":6},8,{"$f":"TODAY()+25","v":"2018-09-10"},{"$f":"Attività_1[[#This Row],[Data di inizio]]+5","v":"2018-09-15"},"Attività 8",{"$f":"IFERROR(IF(LEN(Attività_1[[#This Row],[Data di inizio]])=0,\"\",(INT(Attività_1[[#This Row],[Data di fine]])-INT(Attività_1[[#This Row],[Data di inizio]]))-(INT(Attività_1[[#This Row],[Data di inizio]])-INT(Attività_1[[#This Row],[Data di inizio]]))+1),\"\")","v":6}]
[{"$nulls":6},9,{"$f":"TODAY()+34","v":"2018-09-19"},{"$f":"Attività_1[[#This Row],[Data di inizio]]+2","v":"2018-09-21"},"Attività 9",{"$f":"IFERROR(IF(LEN(Attività_1[[#This Row],[Data di inizio]])=0,\"\",(INT(Attività_1[[#This Row],[Data di fine]])-INT(Attività_1[[#This Row],[Data di inizio]]))-(INT(Attività_1[[#This Row],[Data di inizio]])-INT(Attività_1[[#This Row],[Data di inizio]]))+1),\"\")","v":3}]
[{"$nulls":6},10,{"$f":"TODAY()+40","v":"2018-09-25"},{"$f":"Attività_1[[#This Row],[Data di inizio]]+30","v":"2018-10-25"},"Attività 10",{"$f":"IFERROR(IF(LEN(Attività_1[[#This Row],[Data di inizio]])=0,\"\",(INT(Attività_1[[#This Row],[Data di fine]])-INT(Attività_1[[#This Row],[Data di inizio]]))-(INT(Attività_1[[#This Row],[Data di inizio]])-INT(Attività_1[[#This Row],[Data di inizio]]))+1),\"\")","v":31}]
[{"$nulls":6},11,{"$f":"TODAY()+42","v":"2018-09-27"},{"$f":"Attività_1[[#This Row],[Data di inizio]]+23","v":"2018-10-20"},"Attività 11",{"$f":"IFERROR(IF(LEN(Attività_1[[#This Row],[Data di inizio]])=0,\"\",(INT(Attività_1[[#This Row],[Data di fine]])-INT(Attività_1[[#This Row],[Data di inizio]]))-(INT(Attività_1[[#This Row],[Data di inizio]])-INT(Attività_1[[#This Row],[Data di inizio]]))+1),\"\")","v":24}]
[{"$nulls":6},12,{"$f":"TODAY()+50","v":"2018-10-05"},{"$f":"Attività_1[[#This Row],[Data di inizio]]+5","v":"2018-10-10"},"Attività 12",{"$f":"IFERROR(IF(LEN(Attività_1[[#This Row],[Data di inizio]])=0,\"\",(INT(Attività_1[[#This Row],[Data di fine]])-INT(Attività_1[[#This Row],[Data di inizio]]))-(INT(Attività_1[[#This Row],[Data di inizio]])-INT(Attività_1[[#This Row],[Data di inizio]]))+1),\"\")","v":6}]
[{"$nulls":10},{"$f":"IFERROR(IF(LEN(Attività_1[[#This Row],[Data di inizio]])=0,\"\",(INT(Attività_1[[#This Row],[Data di fine]])-INT(Attività_1[[#This Row],[Data di inizio]]))-(INT(Attività_1[[#This Row],[Data di inizio]])-INT(Attività_1[[#This Row],[Data di inizio]]))+1),\"\")","v":""}]
[{"$nulls":10},{"$f":"IFERROR(IF(LEN(Attività_1[[#This Row],[Data di inizio]])=0,\"\",(INT(Attività_1[[#This Row],[Data di fine]])-INT(Attività_1[[#This Row],[Data di inizio]]))-(INT(Attività_1[[#This Row],[Data di inizio]])-INT(Attività_1[[#This Row],[Data di inizio]]))+1),\"\")","v":""}]
[{"$nulls":10},{"$f":"IFERROR(IF(LEN(Attività_1[[#This Row],[Data di inizio]])=0,\"\",(INT(Attività_1[[#This Row],[Data di fine]])-INT(Attività_1[[#This Row],[Data di inizio]]))-(INT(Attività_1[[#This Row],[Data di inizio]])-INT(Attività_1[[#This Row],[Data di inizio]]))+1),\"\")","v":""}]
{"$rows_left_out":7}
{"sheet":"Diagramma di Gantt","index":1,"n_rows":1,"n_cols":1,"rows_kept":1}
["Il diagramma di Gantt con Oggi, Attività cardine e Attività all'interno di un intervallo di date si trova in questo foglio di lavoro. \nUna barra di scorrimento si trova nella riga 1 dalla cella B1 alla cella R1 e incrementa l'intervallo di date mostrando le attività cardine future.\nIl diagramma è rappresentato nelle celle da B2 a R3.\nQuesta è l'ultima istruzione in questo foglio di lavoro."]

{"sheet":"Dati grafico dinamici nascosto","index":2,"n_rows":32,"n_cols":10,"rows_kept":32,"hidden":true}
["Il titolo di questo foglio di lavoro si trova nella cella B1.","Dati grafico dinamici: NON modificare o eliminare questo foglio di lavoro!"]
["Il titolo della tabella si trova nella cella B2 e nella cella C2.",{"$f":"IF(TODAY()>=MIN(DynamicTaskData[Data di inizio]),\"Oggi\",\"\")","v":"Oggi"},"evidenziazione"]
["L'intestazione della tabella si trova nella cella B3 e nella cella C3. Queste coordinate consentono di mettere in Oggi evidenziazione nel diagramma.\nLa prima colonna contrassegna il giorno, la seconda indica la linea da disegnare per evidenziare Oggi.\nLa data della prima colonna può cambiare affinché l'intervallo di date del diagramma rimanga leggibile con l'avanzamento delle date, tuttavia, una coordinata y pari a 0 indica che non è presente nessuna linea.\nNon modificare o eliminare questo contenuto, altrimenti il diagramma potrebbe dare errore. Per non evidenziare più la data di Oggi, selezionare semplicemente \"No\" nel foglio di lavoro Dati grafico nella cella D2.\nL'istruzione successiva si trova nella cella A7.","coordinata x evidenziazione oggi","coordinata y"]
[null,{"$f":"IFERROR(IF(TODAY()<MIN(DynamicTaskData[Data di inizio]),MIN($B$11,MIN(DynamicTaskData[Data di inizio])),TODAY()),TODAY())","v":"2018-08-16"},{"$f":"IFERROR(IF(Traccia_Oggi=\"Sì\",IF(TODAY()<MIN(DynamicTaskData[Data di inizio]),0,9),0),0)","v":9}]
[null,{"$f":"IFERROR(IF(TODAY()<MIN(DynamicTaskData[Data di inizio]),MIN($B$11,MIN(DynamicTaskData[Data di inizio])),TODAY()),TODAY())","v":"2018-08-16"},{"$f":"IFERROR(IF(Traccia_Oggi=\"Sì\",IF(TODAY()<MIN(DynamicTaskData[Data di inizio]),0,9),0),0)","v":9}]
[]
["L'intestazione della tabella si trova nella cella B7.\nL'incremento di scorrimento nella cella B8 indica i dati rappresentati nel grafico e che vengono visualizzati nel Diagramma di Gantt in qualsiasi momento. \nUsando la barra di scorrimento nella parte superiore del diagramma nella riga 1 del foglio di lavoro Diagramma di Gantt, questo numero aumenta.\nIl diagramma funziona meglio con incrementi singoli.\nL'istruzione successiva si trova nella cella A10.","incremento di scorrimento"]
[null,0]
[]
["L'intestazione della tabella si trova nella cella B10 e nella cella D10.\nL'intervallo di creazione del diagramma consente di selezionare il corretto intervallo di attività e attività cardine. Non modificare questi campi.\nIl numero di ageing fa in modo che il diagramma sia leggibile programmando le attività tramite ageing dall'intervallo e tracciando solo quelle comprese nell'intervallo. Non modificare questo numero.\nL'istruzione successiva si trova nella cella A14.\n\n","Intervallo di creazione del diagramma",null,"ageoff"]
[null,{"$f":"IFERROR(IF(ScrollingIncrement[incremento di scorrimento]=0,Data_iniziale,IF(Data_iniziale+ScrollingIncrement[incremento di scorrimento]*15<Data_finale,Data_iniziale+ScrollingIncrement[incremento di scorrimento]*15,Data_finale-1)),\"\")","v":"2018-08-15"},null,45]
[null,{"$f":"IFERROR(IF($B$11+15<Data_finale,$B$11+15,Data_finale),\"\")","v":"2018-08-30"}]
[]
["L'intestazione della tabella relativa ai dati delle attività cardine dinamici si trova dalla cella B14 alla cella E14. Una nota si trova nella cella F14.\nQuesta tabella consente di creare il Diagramma di Gantt nel foglio di lavoro Diagramma di Gantt, tracciando 7 attività cardine alla volta.\nI dati in questo grafico vengono generati automaticamente sulla base del contenuto nella tabella di cui sopra. \nNon modificare o eliminare questa tabella o il relativo contenuto.\nL'istruzione successiva si trova nella cella A17.","Attività","Data di inizio","Durata attività in giorni","posizione","<-- questa tabella consente di creare il diagramma di Gantt, inserendo 7 attività cardine alla volta"]
[null,{"$f":"IFERROR(IF(LEN(OFFSET('Dati grafico'!$H6,ScrollingIncrement[incremento di scorrimento],0,1,1))=0,\"\",IF(OR(OFFSET('Dati grafico'!$I6,ScrollingIncrement[incremento di scorrimento],0,1,1)<=$B$12,OFFSET('Dati grafico'!$H6,ScrollingIncrement[incremento di scorrimento],0,1,1)>=($B$11-$D$11)),INDEX(Attività_1[],OFFSET('Dati grafico'!$G6,ScrollingIncrement[incremento di scorrimento],0,1,1),4),\"\")),\"\")","v":"Attività 1"},{"$f":"IFERROR(IF(LEN(DynamicTaskData[[#This Row],[Attività]])=0,$B$11,INDEX(Attività_1[],OFFSET('Dati grafico'!$G6,ScrollingIncrement[incremento di scorrimento],0,1,1),2)),\"\")","v":"2018-08-15"},{"$f":"IFERROR(IF(LEN(DynamicTaskData[[#This Row],[Attività]])=0,0,IF(AND('Dati grafico'!$H6<=$B$12,'Dati grafico'!$I6>=$B$12),ABS(OFFSET('Dati grafico'!$H6,ScrollingIncrement[incremento di scorrimento],0,1,1)-$B$12)+1,OFFSET('Dati grafico'!$K6,ScrollingIncrement[incremento di scorrimento],0,1,1))),\"\")","v":2},{"$f":"IFERROR(IF(LEN(DynamicTaskData[[#This Row],[Attività]])=0,\"\",8),\"\")","v":8}]
[null,{"$f":"IFERROR(IF(LEN(OFFSET('Dati grafico'!$H7,ScrollingIncrement[incremento di scorrimento],0,1,1))=0,\"\",IF(OR(OFFSET('Dati grafico'!$I7,ScrollingIncrement[incremento di scorrimento],0,1,1)<=$B$12,OFFSET('Dati grafico'!$H7,ScrollingIncrement[incremento di scorrimento],0,1,1)>=($B$11-$D$11)),INDEX(Attività_1[],OFFSET('Dati grafico'!$G7,ScrollingIncrement[incremento di scorrimento],0,1,1),4),\"\")),\"\")","v":"Attività 2"},{"$f":"IFERROR(IF(LEN(DynamicTaskData[[#This Row],[Attività]])=0,$B$11,INDEX(Attività_1[],OFFSET('Dati grafico'!$G7,ScrollingIncrement[incremento di scorrimento],0,1,1),2)),\"\")","v":"2018-08-16"},{"$f":"IFERROR(IF(LEN(DynamicTaskData[[#This Row],[Attività]])=0,0,IF(AND('Dati grafico'!$H7<=$B$12,'Dati grafico'!$I7>=$B$12),ABS(OFFSET('Dati grafico'!$H7,ScrollingIncrement[incremento di scorrimento],0,1,1)-$B$12)+1,OFFSET('Dati grafico'!$K7,ScrollingIncrement[incremento di scorrimento],0,1,1))),\"\")","v":2},{"$f":"IFERROR(IF(LEN(DynamicTaskData[[#This Row],[Attività]])=0,\"\",7),\"\")","v":7},null,"Tracciare le attività cardine"]
["Le intestazioni della tabella relativa ai dati delle attività cardine dinamici si trovano dalla cella G15 alla cella I15. \nI dati forniti in questa tabella potrebbero apparire vuoti, le date potrebbero risultare errate, non compilare, eliminare o modificare in altro modo questi dati per non rischiare di sovrascrivere le formule e compromettere la capacità di rappresentare i dati nel diagramma.\nLa tabella consente di inserire nel diagramma 15 attività cardine. Per aggiungerne altre, basta espandere la tabella secondo necessità. Nota: aggiungere le attività cardine solo nel foglio di lavoro Dati grafico. Non aggiungere contenuti a questa tabella.\nUna nota si trova nella cella J15.\nL'istruzione successiva si trova nella cella A32.",{"$f":"IFERROR(IF(LEN(OFFSET('Dati grafico'!$H8,ScrollingIncrement[incremento di scorrimento],0,1,1))=0,\"\",IF(OR(OFFSET('Dati grafico'!$I8,ScrollingIncrement[incremento di scorrimento],0,1,1)<=$B$12,OFFSET('Dati grafico'!$H8,ScrollingIncrement[incremento di scorrimento],0,1,1)>=($B$11-$D$11)),INDEX(Attività_1[],OFFSET('Dati grafico'!$G8,ScrollingIncrement[incremento di scorrimento],0,1,1),4),\"\")),\"\")","v":"Attività 3"},{"$f":"IFERROR(IF(LEN(DynamicTaskData[[#This Row],[Attività]])=0,$B$11,INDEX(Attività_1[],OFFSET('Dati grafico'!$G8,ScrollingIncrement[incremento di scorrimento],0,1,1),2)),\"\")","v":"2018-08-16"},{"$f":"IFERROR(IF(LEN(DynamicTaskData[[#This Row],[Attività]])=0,0,IF(AND('Dati grafico'!$H8<=$B$12,'Dati grafico'!$I8>=$B$12),ABS(OFFSET('Dati grafico'!$H8,ScrollingIncrement[incremento di scorrimento],0,1,1)-$B$12)+1,OFFSET('Dati grafico'!$K8,ScrollingIncrement[incremento di scorrimento],0,1,1))),\"\")","v":6},{"$f":"IFERROR(IF(LEN(DynamicTaskData[[#This Row],[Attività]])=0,\"\",6),\"\")","v":6},null,"Attività cardine","Data","Linea di base","<-- questa tabella consente di creare gli indicatori delle attività cardine nel diagramma di Gantt, inserendo solo quelle che rientrano nell'intervallo di date visualizzato (fino a 15 attività cardine)"]
[null,{"$f":"IFERROR(IF(LEN(OFFSET('Dati grafico'!$H9,ScrollingIncrement[incremento di scorrimento],0,1,1))=0,\"\",IF(OR(OFFSET('Dati grafico'!$I9,ScrollingIncrement[incremento di scorrimento],0,1,1)<=$B$12,OFFSET('Dati grafico'!$H9,ScrollingIncrement[incremento di scorrimento],0,1,1)>=($B$11-$D$11)),INDEX(Attività_1[],OFFSET('Dati grafico'!$G9,ScrollingIncrement[incremento di scorrimento],0,1,1),4),\"\")),\"\")","v":"Attività 4"},{"$f":"IFERROR(IF(LEN(DynamicTaskData[[#This Row],[Attività]])=0,$B$11,INDEX(Attività_1[],OFFSET('Dati grafico'!$G9,ScrollingIncrement[incremento di scorrimento],0,1,1),2)),\"\")","v":"2018-08-17"},{"$f":"IFERROR(IF(LEN(DynamicTaskData[[#This Row],[Attività]])=0,0,IF(AND('Dati grafico'!$H9<=$B$12,'Dati grafico'!$I9>=$B$12),ABS(OFFSET('Dati grafico'!$H9,ScrollingIncrement[incremento di scorrimento],0,1,1)-$B$12)+1,OFFSET('Dati grafico'!$K9,ScrollingIncrement[incremento di scorrimento],0,1,1))),\"\")","v":8},{"$f":"IFERROR(IF(LEN(DynamicTaskData[[#This Row],[Attività]])=0,\"\",5),\"\")","v":5},null,{"$f":"IFERROR(IF(LEN('Dati grafico'!D6)=0,\"\",IF(AND('Dati grafico'!D6<=$B$12,'Dati grafico'!D6>=$B$11-$D$11),'Dati grafico'!E6,\"\")),\"\")","v":"Attività cardine 1"},{"$f":"IFERROR(IF(LEN(DynamicMilestoneData[[#This Row],[Attività cardine]])=0,$B$12,'Dati grafico'!$D6),2)","v":"2018-08-25"},{"$f":"IFERROR(IF(LEN(DynamicMilestoneData[[#This Row],[Attività cardine]])=0,\"\",'Dati grafico'!$C6),\"\")","v":1}]
[null,{"$f":"IFERROR(IF(LEN(OFFSET('Dati grafico'!$H10,ScrollingIncrement[incremento di scorrimento],0,1,1))=0,\"\",IF(OR(OFFSET('Dati grafico'!$I10,ScrollingIncrement[incremento di scorrimento],0,1,1)<=$B$12,OFFSET('Dati grafico'!$H10,ScrollingIncrement[incremento di scorrimento],0,1,1)>=($B$11-$D$11)),INDEX(Attività_1[],OFFSET('Dati grafico'!$G10,ScrollingIncrement[incremento di scorrimento],0,1,1),4),\"\")),\"\")","v":"Attività 5"},{"$f":"IFERROR(IF(LEN(DynamicTaskData[[#This Row],[Attività]])=0,$B$11,INDEX(Attività_1[],OFFSET('Dati grafico'!$G10,ScrollingIncrement[incremento di scorrimento],0,1,1),2)),\"\")","v":"2018-08-24"},{"$f":"IFERROR(IF(LEN(DynamicTaskData[[#This Row],[Attività]])=0,0,IF(AND('Dati grafico'!$H10<=$B$12,'Dati grafico'!$I10>=$B$12),ABS(OFFSET('Dati grafico'!$H10,ScrollingIncrement[incremento di scorrimento],0,1,1)-$B$12)+1,OFFSET('Dati grafico'!$K10,ScrollingIncrement[incremento di scorrimento],0,1,1))),\"\")","v":7},{"$f":"IFERROR(IF(LEN(DynamicTaskData[[#This Row],[Attività]])=0,\"\",4),\"\")","v":4},null,{"$f":"IFERROR(IF(LEN('Dati grafico'!D7)=0,\"\",IF(AND('Dati grafico'!D7<=$B$12,'Dati grafico'!D7>=$B$11-$D$11),'Dati grafico'!E7,\"\")),\"\")","v":""},{"$f":"IFERROR(IF(LEN(DynamicMilestoneData[[#This Row],[Attività cardine]])=0,$B$12,'Dati grafico'!$D7),2)","v":"2018-08-30"},{"$f":"IFERROR(IF(LEN(DynamicMilestoneData[[#This Row],[Attività cardine]])=0,\"\",'Dati grafico'!$C7),\"\")","v":""}]
[null,{"$f":"IFERROR(IF(LEN(OFFSET('Dati grafico'!$H11,ScrollingIncrement[incremento di scorrimento],0,1,1))=0,\"\",IF(OR(OFFSET('Dati grafico'!$I11,ScrollingIncrement[incremento di scorrimento],0,1,1)<=$B$12,OFFSET('Dati grafico'!$H11,ScrollingIncrement[incremento di scorrimento],0,1,1)>=($B$11-$D$11)),INDEX(Attività_1[],OFFSET('Dati grafico'!$G11,ScrollingIncrement[incremento di scorrimento],0,1,1),4),\"\")),\"\")","v":"Attività 6"},{"$f":"IFERROR(IF(LEN(DynamicTaskData[[#This Row],[Attività]])=0,$B$11,INDEX(Attività_1[],OFFSET('Dati grafico'!$G11,ScrollingIncrement[incremento di scorrimento],0,1,1),2)),\"\")","v":"2018-08-28"},{"$f":"IFERROR(IF(LEN(DynamicTaskData[[#This Row],[Attività]])=0,0,IF(AND('Dati grafico'!$H11<=$B$12,'Dati grafico'!$I11>=$B$12),ABS(OFFSET('Dati grafico'!$H11,ScrollingIncrement[incremento di scorrimento],0,1,1)-$B$12)+1,OFFSET('Dati grafico'!$K11,ScrollingIncrement[incremento di scorrimento],0,1,1))),\"\")","v":3},{"$f":"IFERROR(IF(LEN(DynamicTaskData[[#This Row],[Attività]])=0,\"\",3),\"\")","v":3},null,{"$f":"IFERROR(IF(LEN('Dati grafico'!D8)=0,\"\",IF(AND('Dati grafico'!D8<=$B$12,'Dati grafico'!D8>=$B$11-$D$11),'Dati grafico'!E8,\"\")),\"\")","v":""},{"$f":"IFERROR(IF(LEN(DynamicMilestoneData[[#This Row],[Attività cardine]])=0,$B$12,'Dati grafico'!$D8),2)","v":"2018-08-30"},{"$f":"IFERROR(IF(LEN(DynamicMilestoneData[[#This Row],[Attività cardine]])=0,\"\",'Dati grafico'!$C8),\"\")","v":""}]
{"$rows_left_out":13}
{"sheet":"Informazioni","index":3,"n_rows":11,"n_cols":1,"rows_kept":11}
["Informazioni su questa cartella di lavoro"]
["Immettere informazioni sulle attività cardine e sulle attività nel foglio di lavoro Dati grafico. Per inserire nel diagramma le attività cardine lungo la sequenza temporale, inserire 0 nella colonna N., quindi fare in modo che l'etichetta venga visualizzata \"di seguito\" per evitare sovrapposizioni.\n\nLa colonna Posizione nella tabella Attività cardine consente di inserire le attività cardine all'interno del diagramma Attività nella stessa riga o in righe impilate. Per inserirle nel diagramma sulla stessa riga, immettere lo stesso numero per ogni attività cardine in questa colonna. Per inserirle nel diagramma su righe diverse, immettere numeri diversi. Dati di esempio inserisce tutte le attività cardine nella riga 2.\n"]
["Guida per le utilità per la lettura dello schermo"]
["\nQuesta cartella di lavoro contiene 4 fogli di lavoro. \n\nDati grafico\nDiagramma di Gantt\nDati grafico dinamici (nascosto)\nInformazioni\n\nLe istruzioni per ogni foglio di lavoro si trovano nella colonna A a partire dalla cella A1 di ogni foglio di lavoro. Sono scritte con testo nascosto. Ogni passaggio descrive le informazioni presenti nella riga corrispondente. Ogni passaggio successivo continua nella cella A2, A3 e così via, salvo diversa indicazione esplicita. Ad esempio, l'istruzione potrebbe indicare di \"passare alla cella A6\" per il passaggio successivo. \n\nIl testo nascosto non verrà stampato.\nPer rimuovere queste istruzioni da un foglio di lavoro, è sufficiente eliminare la colonna A.\n"]
["Dati grafico dinamici (nascosto)"]
["\nNon eliminare o modificare il contenuto del foglio di lavoro nascosto. Ciò potrebbe compromettere l'integrità del diagramma di Gantt.\n\nI dati potrebbero apparire vuoti, le date potrebbero risultare errate, non compilare, eliminare o modificare in altro modo questi dati per non rischiare di sovrascrivere le formule e compromettere la capacità di rappresentare i dati nel diagramma.\n\nLa tabella DynamicMilestone consente di inserire nel diagramma 15 attività cardine. Per aggiungerne altre, basta espandere la tabella secondo necessità. Nota: aggiungere i dati delle attività cardine effettive solo nel foglio di lavoro Dati grafico.\n"]
["Suggerimenti"]
["\nPer impostazione predefinita, le attività cardine vengono inserite nella riga 1 del diagramma di Gantt tramite la colonna Posizione nel foglio di lavoro Dati grafico, a partire dalla cella C5. Per inserire nel diagramma le attività cardine su righe diverse, è sufficiente modificare il numero. \n"]
["Per impostazione predefinita, viene evidenziata la data di oggi nel Diagramma di Gantt. Per non evidenziare più la data di Oggi, selezionare semplicemente \"No\" nel foglio di lavoro Dati grafico nella cella D2.\n"]
["La sequenza temporale delle date nel diagramma di Gantt è inserita con uno scarto di 5 date tra una e l'altra. Per modificare questa impostazione, selezionare la sequenza temporale nel foglio di lavoro Diagramma di Gantt e selezionare Formato asse. Modificare l'unità principale da 5 a 1 o 10, ad esempio. \n"]
["Questa è l'ultima istruzione in questo foglio di lavoro."]