{"text_format":"3","workbook":"xlsx","n_sheets":4,"sheets":["PERTANDINGAN","KALENDER","VERSI CETAK","ADMIN"],"not_rendered":{"defined_names":18},"read":"whole","date_system":"1900"}

{"sheet":"PERTANDINGAN","index":0,"n_rows":38,"n_cols":5,"rows_kept":38}
[]
[null,"PERENCANA ACARA"]
[null,"KOMUNITAS BULANAN"]
[]
[]
[]
[]
[null,"TANGGAL","HARI","BULAN","NAMA ACARA"]
[null,"2016-07-01",{"$f":"IF(ISBLANK(tblEvents[[#This Row],[TANGGAL]]),\"\",UPPER(TEXT(tblEvents[[#This Row],[TANGGAL]],\"[$-421]ddd\")))","v":"JUM"},{"$f":"IF(ISBLANK(tblEvents[[#This Row],[TANGGAL]]),\"\",UPPER(TEXT(tblEvents[[#This Row],[TANGGAL]],\"[$-421]mmm\")))","v":"JUL"},"Kebun Komunitas"]
[null,"2016-07-01",{"$f":"IF(ISBLANK(tblEvents[[#This Row],[TANGGAL]]),\"\",UPPER(TEXT(tblEvents[[#This Row],[TANGGAL]],\"[$-421]ddd\")))","v":"JUM"},{"$f":"IF(ISBLANK(tblEvents[[#This Row],[TANGGAL]]),\"\",UPPER(TEXT(tblEvents[[#This Row],[TANGGAL]],\"[$-421]mmm\")))","v":"JUL"},"Dewan Kota"]
[null,"2016-07-02",{"$f":"IF(ISBLANK(tblEvents[[#This Row],[TANGGAL]]),\"\",UPPER(TEXT(tblEvents[[#This Row],[TANGGAL]],\"[$-421]ddd\")))","v":"SAB"},{"$f":"IF(ISBLANK(tblEvents[[#This Row],[TANGGAL]]),\"\",UPPER(TEXT(tblEvents[[#This Row],[TANGGAL]],\"[$-421]mmm\")))","v":"JUL"},"Kebun Komunitas"]
[null,"2016-07-03",{"$f":"IF(ISBLANK(tblEvents[[#This Row],[TANGGAL]]),\"\",UPPER(TEXT(tblEvents[[#This Row],[TANGGAL]],\"[$-421]ddd\")))","v":"MGG"},{"$f":"IF(ISBLANK(tblEvents[[#This Row],[TANGGAL]]),\"\",UPPER(TEXT(tblEvents[[#This Row],[TANGGAL]],\"[$-421]mmm\")))","v":"JUL"},"Malam Film di Taman"]
[null,"2016-07-08",{"$f":"IF(ISBLANK(tblEvents[[#This Row],[TANGGAL]]),\"\",UPPER(TEXT(tblEvents[[#This Row],[TANGGAL]],\"[$-421]ddd\")))","v":"JUM"},{"$f":"IF(ISBLANK(tblEvents[[#This Row],[TANGGAL]]),\"\",UPPER(TEXT(tblEvents[[#This Row],[TANGGAL]],\"[$-421]mmm\")))","v":"JUL"},"Dewan Kota"]
[null,"2016-07-11",{"$f":"IF(ISBLANK(tblEvents[[#This Row],[TANGGAL]]),\"\",UPPER(TEXT(tblEvents[[#This Row],[TANGGAL]],\"[$-421]ddd\")))","v":"SEN"},{"$f":"IF(ISBLANK(tblEvents[[#This Row],[TANGGAL]]),\"\",UPPER(TEXT(tblEvents[[#This Row],[TANGGAL]],\"[$-421]mmm\")))","v":"JUL"},"Makan Siang Kamar Dagang"]
[null,"2016-07-12",{"$f":"IF(ISBLANK(tblEvents[[#This Row],[TANGGAL]]),\"\",UPPER(TEXT(tblEvents[[#This Row],[TANGGAL]],\"[$-421]ddd\")))","v":"SEL"},{"$f":"IF(ISBLANK(tblEvents[[#This Row],[TANGGAL]]),\"\",UPPER(TEXT(tblEvents[[#This Row],[TANGGAL]],\"[$-421]mmm\")))","v":"JUL"},"Pameran Barang Antik"]
[null,"2016-07-14",{"$f":"IF(ISBLANK(tblEvents[[#This Row],[TANGGAL]]),\"\",UPPER(TEXT(tblEvents[[#This Row],[TANGGAL]],\"[$-421]ddd\")))","v":"KAM"},{"$f":"IF(ISBLANK(tblEvents[[#This Row],[TANGGAL]]),\"\",UPPER(TEXT(tblEvents[[#This Row],[TANGGAL]],\"[$-421]mmm\")))","v":"JUL"},"Lokakarya Komunitas"]
[null,"2016-07-15",{"$f":"IF(ISBLANK(tblEvents[[#This Row],[TANGGAL]]),\"\",UPPER(TEXT(tblEvents[[#This Row],[TANGGAL]],\"[$-421]ddd\")))","v":"JUM"},{"$f":"IF(ISBLANK(tblEvents[[#This Row],[TANGGAL]]),\"\",UPPER(TEXT(tblEvents[[#This Row],[TANGGAL]],\"[$-421]mmm\")))","v":"JUL"},"Dewan Kota"]
[null,"2016-07-19",{"$f":"IF(ISBLANK(tblEvents[[#This Row],[TANGGAL]]),\"\",UPPER(TEXT(tblEvents[[#This Row],[TANGGAL]],\"[$-421]ddd\")))","v":"SEL"},{"$f":"IF(ISBLANK(tblEvents[[#This Row],[TANGGAL]]),\"\",UPPER(TEXT(tblEvents[[#This Row],[TANGGAL]],\"[$-421]mmm\")))","v":"JUL"},"Lokakarya Perencanaan Strategis"]
[null,"2016-07-20",{"$f":"IF(ISBLANK(tblEvents[[#This Row],[TANGGAL]]),\"\",UPPER(TEXT(tblEvents[[#This Row],[TANGGAL]],\"[$-421]ddd\")))","v":"RAB"},{"$f":"IF(ISBLANK(tblEvents[[#This Row],[TANGGAL]]),\"\",UPPER(TEXT(tblEvents[[#This Row],[TANGGAL]],\"[$-421]mmm\")))","v":"JUL"},"Pembersihan Taman"]
[null,"2016-07-22",{"$f":"IF(ISBLANK(tblEvents[[#This Row],[TANGGAL]]),\"\",UPPER(TEXT(tblEvents[[#This Row],[TANGGAL]],\"[$-421]ddd\")))","v":"JUM"},{"$f":"IF(ISBLANK(tblEvents[[#This Row],[TANGGAL]]),\"\",UPPER(TEXT(tblEvents[[#This Row],[TANGGAL]],\"[$-421]mmm\")))","v":"JUL"},"Dewan Kota"]
{"$rows_left_out":19}
{"sheet":"KALENDER","index":1,"n_rows":35,"n_cols":21,"rows_kept":35,"merged":[[1,5,1,11],[30,8,34,20]]}
[]
[null,null,2016,null,null,{"$f":"LOOKUP(MonthNum,tblMonths[NUMBER],tblMonths[MONTH])","v":"JULI"}]
[null,null,7,null,null,{"$f":"DATE(ViewYear,MonthNum,1)","v":"2016-07-01"},null,null,{"$f":"WEEKDAY(StartDate)","v":6}]
[null,null,"SEN",null,null,"SEL",null,null,"RAB",null,null,"KAM",null,null,"JUM",null,null,"SAB",null,null,"MIN"]
[]
[null,null,{"$f":"StartDate-(WEEKDAY(StartDate,2))+{0;1;2;3;4;5}*7 +{2,3,4,5,6,7,1}-3+COLUMN(B1)","v":"2016-06-27"},null,null,{"$f":"StartDate-(WEEKDAY(StartDate,2))+{0;1;2;3;4;5}*7 +{2,3,4,5,6,7,1}-3+COLUMN(C1)","v":"2016-06-28"},null,null,{"$f":"StartDate-(WEEKDAY(StartDate,2))+{0;1;2;3;4;5}*7 +{2,3,4,5,6,7,1}-3+COLUMN(D1)","v":"2016-06-29"},null,null,{"$f":"StartDate-(WEEKDAY(StartDate,2))+{0;1;2;3;4;5}*7 +{2,3,4,5,6,7,1}-3+COLUMN(E1)","v":"2016-06-30"},null,null,{"$f":"StartDate-(WEEKDAY(StartDate,2))+{0;1;2;3;4;5}*7 +{2,3,4,5,6,7,1}-3+COLUMN(F1)","v":"2016-07-01"},null,null,{"$f":"StartDate-(WEEKDAY(StartDate,2))+{0;1;2;3;4;5}*7 +{2,3,4,5,6,7,1}-3+COLUMN(G1)","v":"2016-07-02"},null,null,{"$f":"StartDate-(WEEKDAY(StartDate,2))+{0;1;2;3;4;5}*7 +{2,3,4,5,6,7,1}-3+COLUMN(H1)","v":"2016-07-03"}]
[null,null,{"$f":"IFERROR(INDEX(tblEvents[],SMALL(IF(Dates=C$6,ROW(Dates)),ROW(1:1))-TableRowStart,4),\"\")","v":""},null,null,{"$f":"IFERROR(INDEX(tblEvents[],SMALL(IF(Dates=F$6,ROW(Dates)),ROW(1:1))-TableRowStart,4),\"\")","v":""},null,null,{"$f":"IFERROR(INDEX(tblEvents[],SMALL(IF(Dates=I$6,ROW(Dates)),ROW(1:1))-TableRowStart,4),\"\")","v":""},null,null,{"$f":"IFERROR(INDEX(tblEvents[],SMALL(IF(Dates=L$6,ROW(Dates)),ROW(1:1))-TableRowStart,4),\"\")","v":""},null,null,{"$f":"IFERROR(INDEX(tblEvents[],SMALL(IF(Dates=O$6,ROW(Dates)),ROW(1:1))-TableRowStart,4),\"\")","v":"Kebun Komunitas"},null,null,{"$f":"IFERROR(INDEX(tblEvents[],SMALL(IF(Dates=R$6,ROW(Dates)),ROW(1:1))-TableRowStart,4),\"\")","v":"Kebun Komunitas"},null,null,{"$f":"IFERROR(INDEX(tblEvents[],SMALL(IF(Dates=U$6,ROW(Dates)),ROW(1:1))-TableRowStart,4),\"\")","v":"Malam Film di Taman"}]
[null,null,{"$f":"IFERROR(INDEX(tblEvents[],SMALL(IF(Dates=C$6,ROW(Dates)),ROW(2:2))-TableRowStart,4),\"\")","v":""},null,null,{"$f":"IFERROR(INDEX(tblEvents[],SMALL(IF(Dates=F$6,ROW(Dates)),ROW(2:2))-TableRowStart,4),\"\")","v":""},null,null,{"$f":"IFERROR(INDEX(tblEvents[],SMALL(IF(Dates=I$6,ROW(Dates)),ROW(2:2))-TableRowStart,4),\"\")","v":""},null,null,{"$f":"IFERROR(INDEX(tblEvents[],SMALL(IF(Dates=L$6,ROW(Dates)),ROW(2:2))-TableRowStart,4),\"\")","v":""},null,null,{"$f":"IFERROR(INDEX(tblEvents[],SMALL(IF(Dates=O$6,ROW(Dates)),ROW(2:2))-TableRowStart,4),\"\")","v":"Dewan Kota"},null,null,{"$f":"IFERROR(INDEX(tblEvents[],SMALL(IF(Dates=R$6,ROW(Dates)),ROW(2:2))-TableRowStart,4),\"\")","v":""},null,null,{"$f":"IFERROR(INDEX(tblEvents[],SMALL(IF(Dates=U$6,ROW(Dates)),ROW(2:2))-TableRowStart,4),\"\")","v":""}]
[null,null,{"$f":"IFERROR(INDEX(tblEvents[],SMALL(IF(Dates=C$6,ROW(Dates)),ROW(3:3))-TableRowStart,4),\"\")","v":""},null,null,{"$f":"IFERROR(INDEX(tblEvents[],SMALL(IF(Dates=F$6,ROW(Dates)),ROW(3:3))-TableRowStart,4),\"\")","v":""},null,null,{"$f":"IFERROR(INDEX(tblEvents[],SMALL(IF(Dates=I$6,ROW(Dates)),ROW(3:3))-TableRowStart,4),\"\")","v":""},null,null,{"$f":"IFERROR(INDEX(tblEvents[],SMALL(IF(Dates=L$6,ROW(Dates)),ROW(3:3))-TableRowStart,4),\"\")","v":""},null,null,{"$f":"IFERROR(INDEX(tblEvents[],SMALL(IF(Dates=O$6,ROW(Dates)),ROW(3:3))-TableRowStart,4),\"\")","v":""},null,null,{"$f":"IFERROR(INDEX(tblEvents[],SMALL(IF(Dates=R$6,ROW(Dates)),ROW(3:3))-TableRowStart,4),\"\")","v":""},null,null,{"$f":"IFERROR(INDEX(tblEvents[],SMALL(IF(Dates=U$6,ROW(Dates)),ROW(3:3))-TableRowStart,4),\"\")","v":""}]
[null,null,{"$f":"IFERROR(INDEX(tblEvents[],SMALL(IF(Dates=C$6,ROW(Dates)),ROW(#REF!))-TableRowStart,4),\"\")","v":""},null,null,{"$f":"IFERROR(INDEX(tblEvents[],SMALL(IF(Dates=F$6,ROW(Dates)),ROW(#REF!))-TableRowStart,4),\"\")","v":""},null,null,{"$f":"IFERROR(INDEX(tblEvents[],SMALL(IF(Dates=I$6,ROW(Dates)),ROW(#REF!))-TableRowStart,4),\"\")","v":""},null,null,{"$f":"IFERROR(INDEX(tblEvents[],SMALL(IF(Dates=L$6,ROW(Dates)),ROW(#REF!))-TableRowStart,4),\"\")","v":""},null,null,{"$f":"IFERROR(INDEX(tblEvents[],SMALL(IF(Dates=O$6,ROW(Dates)),ROW(#REF!))-TableRowStart,4),\"\")","v":""},null,null,{"$f":"IFERROR(INDEX(tblEvents[],SMALL(IF(Dates=R$6,ROW(Dates)),ROW(#REF!))-TableRowStart,4),\"\")","v":""},null,null,{"$f":"IFERROR(INDEX(tblEvents[],SMALL(IF(Dates=U$6,ROW(Dates)),ROW(#REF!))-TableRowStart,4),\"\")","v":""}]
[null,null,{"$f":"U6+1","v":"2016-07-04"},null,null,{"$f":"C11+1","v":"2016-07-05"},null,null,{"$f":"F11+1","v":"2016-07-06"},null,null,{"$f":"I11+1","v":"2016-07-07"},null,null,{"$f":"L11+1","v":"2016-07-08"},null,null,{"$f":"O11+1","v":"2016-07-09"},null,null,{"$f":"R11+1","v":"2016-07-10"}]
[null,null,{"$f":"IFERROR(INDEX(tblEvents[],SMALL(IF(Dates=C$11,ROW(Dates)),ROW(1:1))-TableRowStart,4),\"\")","v":""},null,null,{"$f":"IFERROR(INDEX(tblEvents[],SMALL(IF(Dates=F$11,ROW(Dates)),ROW(1:1))-TableRowStart,4),\"\")","v":""},null,null,{"$f":"IFERROR(INDEX(tblEvents[],SMALL(IF(Dates=I$11,ROW(Dates)),ROW(1:1))-TableRowStart,4),\"\")","v":""},null,null,{"$f":"IFERROR(INDEX(tblEvents[],SMALL(IF(Dates=L$11,ROW(Dates)),ROW(1:1))-TableRowStart,4),\"\")","v":""},null,null,{"$f":"IFERROR(INDEX(tblEvents[],SMALL(IF(Dates=O$11,ROW(Dates)),ROW(1:1))-TableRowStart,4),\"\")","v":"Dewan Kota"},null,null,{"$f":"IFERROR(INDEX(tblEvents[],SMALL(IF(Dates=R$11,ROW(Dates)),ROW(1:1))-TableRowStart,4),\"\")","v":""},null,null,{"$f":"IFERROR(INDEX(tblEvents[],SMALL(IF(Dates=U$11,ROW(Dates)),ROW(1:1))-TableRowStart,4),\"\")","v":""}]
[null,null,{"$f":"IFERROR(INDEX(tblEvents[],SMALL(IF(Dates=C$11,ROW(Dates)),ROW(2:2))-TableRowStart,4),\"\")","v":""},null,null,{"$f":"IFERROR(INDEX(tblEvents[],SMALL(IF(Dates=F$11,ROW(Dates)),ROW(2:2))-TableRowStart,4),\"\")","v":""},null,null,{"$f":"IFERROR(INDEX(tblEvents[],SMALL(IF(Dates=I$11,ROW(Dates)),ROW(2:2))-TableRowStart,4),\"\")","v":""},null,null,{"$f":"IFERROR(INDEX(tblEvents[],SMALL(IF(Dates=L$11,ROW(Dates)),ROW(2:2))-TableRowStart,4),\"\")","v":""},null,null,{"$f":"IFERROR(INDEX(tblEvents[],SMALL(IF(Dates=O$11,ROW(Dates)),ROW(2:2))-TableRowStart,4),\"\")","v":""},null,null,{"$f":"IFERROR(INDEX(tblEvents[],SMALL(IF(Dates=R$11,ROW(Dates)),ROW(2:2))-TableRowStart,4),\"\")","v":""},null,null,{"$f":"IFERROR(INDEX(tblEvents[],SMALL(IF(Dates=U$11,ROW(Dates)),ROW(2:2))-TableRowStart,4),\"\")","v":""}]
[null,null,{"$f":"IFERROR(INDEX(tblEvents[],SMALL(IF(Dates=C$11,ROW(Dates)),ROW(3:3))-TableRowStart,4),\"\")","v":""},null,null,{"$f":"IFERROR(INDEX(tblEvents[],SMALL(IF(Dates=F$11,ROW(Dates)),ROW(3:3))-TableRowStart,4),\"\")","v":""},null,null,{"$f":"IFERROR(INDEX(tblEvents[],SMALL(IF(Dates=I$11,ROW(Dates)),ROW(3:3))-TableRowStart,4),\"\")","v":""},null,null,{"$f":"IFERROR(INDEX(tblEvents[],SMALL(IF(Dates=L$11,ROW(Dates)),ROW(3:3))-TableRowStart,4),\"\")","v":""},null,null,{"$f":"IFERROR(INDEX(tblEvents[],SMALL(IF(Dates=O$11,ROW(Dates)),ROW(3:3))-TableRowStart,4),\"\")","v":""},null,null,{"$f":"IFERROR(INDEX(tblEvents[],SMALL(IF(Dates=R$11,ROW(Dates)),ROW(3:3))-TableRowStart,4),\"\")","v":""},null,null,{"$f":"IFERROR(INDEX(tblEvents[],SMALL(IF(Dates=U$11,ROW(Dates)),ROW(3:3))-TableRowStart,4),\"\")","v":""}]
[null,null,{"$f":"IFERROR(INDEX(tblEvents[],SMALL(IF(Dates=C$11,ROW(Dates)),ROW(#REF!))-TableRowStart,4),\"\")","v":""},null,null,{"$f":"IFERROR(INDEX(tblEvents[],SMALL(IF(Dates=F$11,ROW(Dates)),ROW(#REF!))-TableRowStart,4),\"\")","v":""},null,null,{"$f":"IFERROR(INDEX(tblEvents[],SMALL(IF(Dates=I$11,ROW(Dates)),ROW(#REF!))-TableRowStart,4),\"\")","v":""},null,null,{"$f":"IFERROR(INDEX(tblEvents[],SMALL(IF(Dates=L$11,ROW(Dates)),ROW(#REF!))-TableRowStart,4),\"\")","v":""},null,null,{"$f":"IFERROR(INDEX(tblEvents[],SMALL(IF(Dates=O$11,ROW(Dates)),ROW(#REF!))-TableRowStart,4),\"\")","v":""},null,null,{"$f":"IFERROR(INDEX(tblEvents[],SMALL(IF(Dates=R$11,ROW(Dates)),ROW(#REF!))-TableRowStart,4),\"\")","v":""},null,null,{"$f":"IFERROR(INDEX(tblEvents[],SMALL(IF(Dates=U$11,ROW(Dates)),ROW(#REF!))-TableRowStart,4),\"\")","v":""}]
[null,null,{"$f":"U11+1","v":"2016-07-11"},null,null,{"$f":"C16+1","v":"2016-07-12"},null,null,{"$f":"F16+1","v":"2016-07-13"},null,null,{"$f":"I16+1","v":"2016-07-14"},null,null,{"$f":"L16+1","v":"2016-07-15"},null,null,{"$f":"O16+1","v":"2016-07-16"},null,null,{"$f":"R16+1","v":"2016-07-17"}]
[null,null,{"$f":"IFERROR(INDEX(tblEvents[],SMALL(IF(Dates=C$16,ROW(Dates)),ROW(1:1))-TableRowStart,4),\"\")","v":"Makan Siang Kamar Dagang"},null,null,{"$f":"IFERROR(INDEX(tblEvents[],SMALL(IF(Dates=F$16,ROW(Dates)),ROW(1:1))-TableRowStart,4),\"\")","v":"Pameran Barang Antik"},null,null,{"$f":"IFERROR(INDEX(tblEvents[],SMALL(IF(Dates=I$16,ROW(Dates)),ROW(1:1))-TableRowStart,4),\"\")","v":""},null,null,{"$f":"IFERROR(INDEX(tblEvents[],SMALL(IF(Dates=L$16,ROW(Dates)),ROW(1:1))-TableRowStart,4),\"\")","v":"Lokakarya Komunitas"},null,null,{"$f":"IFERROR(INDEX(tblEvents[],SMALL(IF(Dates=O$16,ROW(Dates)),ROW(1:1))-TableRowStart,4),\"\")","v":"Dewan Kota"},null,null,{"$f":"IFERROR(INDEX(tblEvents[],SMALL(IF(Dates=R$16,ROW(Dates)),ROW(1:1))-TableRowStart,4),\"\")","v":""},null,null,{"$f":"IFERROR(INDEX(tblEvents[],SMALL(IF(Dates=U$16,ROW(Dates)),ROW(1:1))-TableRowStart,4),\"\")","v":""}]
[null,null,{"$f":"IFERROR(INDEX(tblEvents[],SMALL(IF(Dates=C$16,ROW(Dates)),ROW(2:2))-TableRowStart,4),\"\")","v":""},null,null,{"$f":"IFERROR(INDEX(tblEvents[],SMALL(IF(Dates=F$16,ROW(Dates)),ROW(2:2))-TableRowStart,4),\"\")","v":""},null,null,{"$f":"IFERROR(INDEX(tblEvents[],SMALL(IF(Dates=I$16,ROW(Dates)),ROW(2:2))-TableRowStart,4),\"\")","v":""},null,null,{"$f":"IFERROR(INDEX(tblEvents[],SMALL(IF(Dates=L$16,ROW(Dates)),ROW(2:2))-TableRowStart,4),\"\")","v":""},null,null,{"$f":"IFERROR(INDEX(tblEvents[],SMALL(IF(Dates=O$16,ROW(Dates)),ROW(2:2))-TableRowStart,4),\"\")","v":""},null,null,{"$f":"IFERROR(INDEX(tblEvents[],SMALL(IF(Dates=R$16,ROW(Dates)),ROW(2:2))-TableRowStart,4),\"\")","v":""},null,null,{"$f":"IFERROR(INDEX(tblEvents[],SMALL(IF(Dates=U$16,ROW(Dates)),ROW(2:2))-TableRowStart,4),\"\")","v":""}]
[null,null,{"$f":"IFERROR(INDEX(tblEvents[],SMALL(IF(Dates=C$16,ROW(Dates)),ROW(3:3))-TableRowStart,4),\"\")","v":""},null,null,{"$f":"IFERROR(INDEX(tblEvents[],SMALL(IF(Dates=F$16,ROW(Dates)),ROW(3:3))-TableRowStart,4),\"\")","v":""},null,null,{"$f":"IFERROR(INDEX(tblEvents[],SMALL(IF(Dates=I$16,ROW(Dates)),ROW(3:3))-TableRowStart,4),\"\")","v":""},null,null,{"$f":"IFERROR(INDEX(tblEvents[],SMALL(IF(Dates=L$16,ROW(Dates)),ROW(3:3))-TableRowStart,4),\"\")","v":""},null,null,{"$f":"IFERROR(INDEX(tblEvents[],SMALL(IF(Dates=O$16,ROW(Dates)),ROW(3:3))-TableRowStart,4),\"\")","v":""},null,null,{"$f":"IFERROR(INDEX(tblEvents[],SMALL(IF(Dates=R$16,ROW(Dates)),ROW(3:3))-TableRowStart,4),\"\")","v":""},null,null,{"$f":"IFERROR(INDEX(tblEvents[],SMALL(IF(Dates=U$16,ROW(Dates)),ROW(3:3))-TableRowStart,4),\"\")","v":""}]
[null,null,{"$f":"IFERROR(INDEX(tblEvents[],SMALL(IF(Dates=C$16,ROW(Dates)),ROW(#REF!))-TableRowStart,4),\"\")","v":""},null,null,{"$f":"IFERROR(INDEX(tblEvents[],SMALL(IF(Dates=F$16,ROW(Dates)),ROW(#REF!))-TableRowStart,4),\"\")","v":""},null,null,{"$f":"IFERROR(INDEX(tblEvents[],SMALL(IF(Dates=I$16,ROW(Dates)),ROW(#REF!))-TableRowStart,4),\"\")","v":""},null,null,{"$f":"IFERROR(INDEX(tblEvents[],SMALL(IF(Dates=L$16,ROW(Dates)),ROW(#REF!))-TableRowStart,4),\"\")","v":""},null,null,{"$f":"IFERROR(INDEX(tblEvents[],SMALL(IF(Dates=O$16,ROW(Dates)),ROW(#REF!))-TableRowStart,4),\"\")","v":""},null,null,{"$f":"IFERROR(INDEX(tblEvents[],SMALL(IF(Dates=R$16,ROW(Dates)),ROW(#REF!))-TableRowStart,4),\"\")","v":""},null,null,{"$f":"IFERROR(INDEX(tblEvents[],SMALL(IF(Dates=U$16,ROW(Dates)),ROW(#REF!))-TableRowStart,4),\"\")","v":""}]
{"$rows_left_out":16}
{"sheet":"VERSI CETAK","index":2,"n_rows":35,"n_cols":21,"rows_kept":35,"merged":[[1,5,1,11],[30,8,34,20]]}
[]
[null,null,{"$f":"ViewYear","v":2016},null,null,{"$f":"ViewMonth","v":"JULI"},{"$f":"KALENDER!G2","v":0},{"$f":"KALENDER!H2","v":0},{"$f":"KALENDER!I2","v":0},{"$f":"KALENDER!J2","v":0},{"$f":"KALENDER!K2","v":0},{"$f":"KALENDER!L2","v":0}]
[]
[null,null,"SEN",null,null,"SEL",null,null,"RAB",null,null,"KAM",null,null,"JUM",null,null,"SAB",null,null,"MIN"]
[]
[null,null,{"$f":"KALENDER!C6","v":"2016-06-27"},{"$f":"KALENDER!D6","v":0},{"$f":"KALENDER!E6","v":0},{"$f":"KALENDER!F6","v":"2016-06-28"},{"$f":"KALENDER!G6","v":0},{"$f":"KALENDER!H6","v":0},{"$f":"KALENDER!I6","v":"2016-06-29"},{"$f":"KALENDER!J6","v":0},{"$f":"KALENDER!K6","v":0},{"$f":"KALENDER!L6","v":"2016-06-30"},{"$f":"KALENDER!M6","v":0},{"$f":"KALENDER!N6","v":0},{"$f":"KALENDER!O6","v":"2016-07-01"},{"$f":"KALENDER!P6","v":0},{"$f":"KALENDER!Q6","v":0},{"$f":"KALENDER!R6","v":"2016-07-02"},{"$f":"KALENDER!S6","v":0},{"$f":"KALENDER!T6","v":0},{"$f":"KALENDER!U6","v":"2016-07-03"}]
[null,null,{"$f":"KALENDER!C7","v":""},{"$f":"KALENDER!D7","v":0},{"$f":"KALENDER!E7","v":0},{"$f":"KALENDER!F7","v":""},{"$f":"KALENDER!G7","v":0},{"$f":"KALENDER!H7","v":0},{"$f":"KALENDER!I7","v":""},{"$f":"KALENDER!J7","v":0},{"$f":"KALENDER!K7","v":0},{"$f":"KALENDER!L7","v":""},{"$f":"KALENDER!M7","v":0},{"$f":"KALENDER!N7","v":0},{"$f":"KALENDER!O7","v":"Kebun Komunitas"},{"$f":"KALENDER!P7","v":0},{"$f":"KALENDER!Q7","v":0},{"$f":"KALENDER!R7","v":"Kebun Komunitas"},{"$f":"KALENDER!S7","v":0},{"$f":"KALENDER!T7","v":0},{"$f":"KALENDER!U7","v":"Malam Film di Taman"}]
[null,null,{"$f":"KALENDER!C8","v":""},{"$f":"KALENDER!D8","v":"00:00:00"},{"$f":"KALENDER!E8","v":"00:00:00"},{"$f":"KALENDER!F8","v":""},{"$f":"KALENDER!G8","v":"00:00:00"},{"$f":"KALENDER!H8","v":"00:00:00"},{"$f":"KALENDER!I8","v":""},{"$f":"KALENDER!J8","v":"00:00:00"},{"$f":"KALENDER!K8","v":"00:00:00"},{"$f":"KALENDER!L8","v":""},{"$f":"KALENDER!M8","v":"00:00:00"},{"$f":"KALENDER!N8","v":"00:00:00"},{"$f":"KALENDER!O8","v":"Dewan Kota"},{"$f":"KALENDER!P8","v":"00:00:00"},{"$f":"KALENDER!Q8","v":"00:00:00"},{"$f":"KALENDER!R8","v":""},{"$f":"KALENDER!S8","v":"00:00:00"},{"$f":"KALENDER!T8","v":"00:00:00"},{"$f":"KALENDER!U8","v":""}]
[null,null,{"$f":"KALENDER!C9","v":""},{"$f":"KALENDER!D9","v":0},{"$f":"KALENDER!E9","v":0},{"$f":"KALENDER!F9","v":""},{"$f":"KALENDER!G9","v":0},{"$f":"KALENDER!H9","v":0},{"$f":"KALENDER!I9","v":""},{"$f":"KALENDER!J9","v":0},{"$f":"KALENDER!K9","v":0},{"$f":"KALENDER!L9","v":""},{"$f":"KALENDER!M9","v":0},{"$f":"KALENDER!N9","v":0},{"$f":"KALENDER!O9","v":""},{"$f":"KALENDER!P9","v":0},{"$f":"KALENDER!Q9","v":0},{"$f":"KALENDER!R9","v":""},{"$f":"KALENDER!S9","v":0},{"$f":"KALENDER!T9","v":0},{"$f":"KALENDER!U9","v":""}]
[null,null,{"$f":"KALENDER!C10","v":""},{"$f":"KALENDER!D10","v":0},{"$f":"KALENDER!E10","v":0},{"$f":"KALENDER!F10","v":""},{"$f":"KALENDER!G10","v":0},{"$f":"KALENDER!H10","v":0},{"$f":"KALENDER!I10","v":""},{"$f":"KALENDER!J10","v":0},{"$f":"KALENDER!K10","v":0},{"$f":"KALENDER!L10","v":""},{"$f":"KALENDER!M10","v":0},{"$f":"KALENDER!N10","v":0},{"$f":"KALENDER!O10","v":""},{"$f":"KALENDER!P10","v":0},{"$f":"KALENDER!Q10","v":0},{"$f":"KALENDER!R10","v":""},{"$f":"KALENDER!S10","v":0},{"$f":"KALENDER!T10","v":0},{"$f":"KALENDER!U10","v":""}]
[null,null,{"$f":"KALENDER!C11","v":"2016-07-04"},{"$f":"KALENDER!D11","v":0},{"$f":"KALENDER!E11","v":0},{"$f":"KALENDER!F11","v":"2016-07-05"},{"$f":"KALENDER!G11","v":0},{"$f":"KALENDER!H11","v":0},{"$f":"KALENDER!I11","v":"2016-07-06"},{"$f":"KALENDER!J11","v":0},{"$f":"KALENDER!K11","v":0},{"$f":"KALENDER!L11","v":"2016-07-07"},{"$f":"KALENDER!M11","v":0},{"$f":"KALENDER!N11","v":0},{"$f":"KALENDER!O11","v":"2016-07-08"},{"$f":"KALENDER!P11","v":0},{"$f":"KALENDER!Q11","v":0},{"$f":"KALENDER!R11","v":"2016-07-09"},{"$f":"KALENDER!S11","v":0},{"$f":"KALENDER!T11","v":0},{"$f":"KALENDER!U11","v":"2016-07-10"}]
[null,null,{"$f":"KALENDER!C12","v":""},{"$f":"KALENDER!D12","v":0},{"$f":"KALENDER!E12","v":0},{"$f":"KALENDER!F12","v":""},{"$f":"KALENDER!G12","v":0},{"$f":"KALENDER!H12","v":0},{"$f":"KALENDER!I12","v":""},{"$f":"KALENDER!J12","v":0},{"$f":"KALENDER!K12","v":0},{"$f":"KALENDER!L12","v":""},{"$f":"KALENDER!M12","v":0},{"$f":"KALENDER!N12","v":0},{"$f":"KALENDER!O12","v":"Dewan Kota"},{"$f":"KALENDER!P12","v":0},{"$f":"KALENDER!Q12","v":0},{"$f":"KALENDER!R12","v":""},{"$f":"KALENDER!S12","v":0},{"$f":"KALENDER!T12","v":0},{"$f":"KALENDER!U12","v":""}]
[null,null,{"$f":"KALENDER!C13","v":""},{"$f":"KALENDER!D13","v":0},{"$f":"KALENDER!E13","v":0},{"$f":"KALENDER!F13","v":""},{"$f":"KALENDER!G13","v":0},{"$f":"KALENDER!H13","v":0},{"$f":"KALENDER!I13","v":""},{"$f":"KALENDER!J13","v":0},{"$f":"KALENDER!K13","v":0},{"$f":"KALENDER!L13","v":""},{"$f":"KALENDER!M13","v":0},{"$f":"KALENDER!N13","v":0},{"$f":"KALENDER!O13","v":""},{"$f":"KALENDER!P13","v":0},{"$f":"KALENDER!Q13","v":0},{"$f":"KALENDER!R13","v":""},{"$f":"KALENDER!S13","v":0},{"$f":"KALENDER!T13","v":0},{"$f":"KALENDER!U13","v":""}]
[null,null,{"$f":"KALENDER!C14","v":""},{"$f":"KALENDER!D14","v":0},{"$f":"KALENDER!E14","v":0},{"$f":"KALENDER!F14","v":""},{"$f":"KALENDER!G14","v":0},{"$f":"KALENDER!H14","v":0},{"$f":"KALENDER!I14","v":""},{"$f":"KALENDER!J14","v":0},{"$f":"KALENDER!K14","v":0},{"$f":"KALENDER!L14","v":""},{"$f":"KALENDER!M14","v":0},{"$f":"KALENDER!N14","v":0},{"$f":"KALENDER!O14","v":""},{"$f":"KALENDER!P14","v":0},{"$f":"KALENDER!Q14","v":0},{"$f":"KALENDER!R14","v":""},{"$f":"KALENDER!S14","v":0},{"$f":"KALENDER!T14","v":0},{"$f":"KALENDER!U14","v":""}]
[null,null,{"$f":"KALENDER!C15","v":""},{"$f":"KALENDER!D15","v":0},{"$f":"KALENDER!E15","v":0},{"$f":"KALENDER!F15","v":""},{"$f":"KALENDER!G15","v":0},{"$f":"KALENDER!H15","v":0},{"$f":"KALENDER!I15","v":""},{"$f":"KALENDER!J15","v":0},{"$f":"KALENDER!K15","v":0},{"$f":"KALENDER!L15","v":""},{"$f":"KALENDER!M15","v":0},{"$f":"KALENDER!N15","v":0},{"$f":"KALENDER!O15","v":""},{"$f":"KALENDER!P15","v":0},{"$f":"KALENDER!Q15","v":0},{"$f":"KALENDER!R15","v":""},{"$f":"KALENDER!S15","v":0},{"$f":"KALENDER!T15","v":0},{"$f":"KALENDER!U15","v":""}]
[null,null,{"$f":"KALENDER!C16","v":"2016-07-11"},{"$f":"KALENDER!D16","v":0},{"$f":"KALENDER!E16","v":0},{"$f":"KALENDER!F16","v":"2016-07-12"},{"$f":"KALENDER!G16","v":0},{"$f":"KALENDER!H16","v":0},{"$f":"KALENDER!I16","v":"2016-07-13"},{"$f":"KALENDER!J16","v":0},{"$f":"KALENDER!K16","v":0},{"$f":"KALENDER!L16","v":"2016-07-14"},{"$f":"KALENDER!M16","v":0},{"$f":"KALENDER!N16","v":0},{"$f":"KALENDER!O16","v":"2016-07-15"},{"$f":"KALENDER!P16","v":0},{"$f":"KALENDER!Q16","v":0},{"$f":"KALENDER!R16","v":"2016-07-16"},{"$f":"KALENDER!S16","v":0},{"$f":"KALENDER!T16","v":0},{"$f":"KALENDER!U16","v":"2016-07-17"}]
[null,null,{"$f":"KALENDER!C17","v":"Makan Siang Kamar Dagang"},{"$f":"KALENDER!D17","v":0},{"$f":"KALENDER!E17","v":0},{"$f":"KALENDER!F17","v":"Pameran Barang Antik"},{"$f":"KALENDER!G17","v":0},{"$f":"KALENDER!H17","v":0},{"$f":"KALENDER!I17","v":""},{"$f":"KALENDER!J17","v":0},{"$f":"KALENDER!K17","v":0},{"$f":"KALENDER!L17","v":"Lokakarya Komunitas"},{"$f":"KALENDER!M17","v":0},{"$f":"KALENDER!N17","v":0},{"$f":"KALENDER!O17","v":"Dewan Kota"},{"$f":"KALENDER!P17","v":0},{"$f":"KALENDER!Q17","v":0},{"$f":"KALENDER!R17","v":""},{"$f":"KALENDER!S17","v":0},{"$f":"KALENDER!T17","v":0},{"$f":"KALENDER!U17","v":""}]
[null,null,{"$f":"KALENDER!C18","v":""},{"$f":"KALENDER!D18","v":0},{"$f":"KALENDER!E18","v":0},{"$f":"KALENDER!F18","v":""},{"$f":"KALENDER!G18","v":0},{"$f":"KALENDER!H18","v":0},{"$f":"KALENDER!I18","v":""},{"$f":"KALENDER!J18","v":0},{"$f":"KALENDER!K18","v":0},{"$f":"KALENDER!L18","v":""},{"$f":"KALENDER!M18","v":0},{"$f":"KALENDER!N18","v":0},{"$f":"KALENDER!O18","v":""},{"$f":"KALENDER!P18","v":0},{"$f":"KALENDER!Q18","v":0},{"$f":"KALENDER!R18","v":""},{"$f":"KALENDER!S18","v":0},{"$f":"KALENDER!T18","v":0},{"$f":"KALENDER!U18","v":""}]
[null,null,{"$f":"KALENDER!C19","v":""},{"$f":"KALENDER!D19","v":0},{"$f":"KALENDER!E19","v":0},{"$f":"KALENDER!F19","v":""},{"$f":"KALENDER!G19","v":0},{"$f":"KALENDER!H19","v":0},{"$f":"KALENDER!I19","v":""},{"$f":"KALENDER!J19","v":0},{"$f":"KALENDER!K19","v":0},{"$f":"KALENDER!L19","v":""},{"$f":"KALENDER!M19","v":0},{"$f":"KALENDER!N19","v":0},{"$f":"KALENDER!O19","v":""},{"$f":"KALENDER!P19","v":0},{"$f":"KALENDER!Q19","v":0},{"$f":"KALENDER!R19","v":""},{"$f":"KALENDER!S19","v":0},{"$f":"KALENDER!T19","v":0},{"$f":"KALENDER!U19","v":""}]
[null,null,{"$f":"KALENDER!C20","v":""},{"$f":"KALENDER!D20","v":0},{"$f":"KALENDER!E20","v":0},{"$f":"KALENDER!F20","v":""},{"$f":"KALENDER!G20","v":0},{"$f":"KALENDER!H20","v":0},{"$f":"KALENDER!I20","v":""},{"$f":"KALENDER!J20","v":0},{"$f":"KALENDER!K20","v":0},{"$f":"KALENDER!L20","v":""},{"$f":"KALENDER!M20","v":0},{"$f":"KALENDER!N20","v":0},{"$f":"KALENDER!O20","v":""},{"$f":"KALENDER!P20","v":0},{"$f":"KALENDER!Q20","v":0},{"$f":"KALENDER!R20","v":""},{"$f":"KALENDER!S20","v":0},{"$f":"KALENDER!T20","v":0},{"$f":"KALENDER!U20","v":""}]
{"$rows_left_out":16}
{"sheet":"ADMIN","index":3,"n_rows":14,"n_cols":3,"rows_kept":14,"hidden":true}
[]
[null,"MONTH","NUMBER"]
[null,"JANUARI",1]
[null,"FEBRUARI",2]
[null,"MARET",3]
[null,"APRIL",4]
[null,"MEI",5]
[null,"JUNI",6]
[null,"JULI",7]
[null,"AGUSTUS",8]
[null,"SEPTEMBER",9]
[null,"OKTOBER",10]
[null,"NOVEMBER",11]
[null,"DESEMBER",12]