{"text_format":"3","workbook":"xlsx","n_sheets":3,"sheets":["Entri Data","Laporan Penjualan","Perkiraan Penjualan"],"not_rendered":{"charts":5,"defined_names":7,"pivot_tables":1},"read":"whole","date_system":"1900"}

{"sheet":"Entri Data","index":0,"n_rows":24,"n_cols":17,"rows_kept":24}
[{"$nulls":9},{"$f":"365*2","v":730}]
[null,"ENTRI DATA BULANAN"]
[{"$nulls":11},"TOTAL",null,null,"PERKIRAAN"]
[]
[null,"TANGGAL","PERUSAHAAN","JUMLAH","TERENCANA","BIAYA","PENDAPATAN","BULAN","KUARTAL","TAHUN","MONTH NUM (HIDE)","BULAN ","KUARTAL ","TAHUNAN ","BULAN  ","KUARTAL  ","TAHUN  "]
[null,{"$f":"40657+(365*2)","v":"2013-04-23"},"A. Datum Corporation",{"v":6400,"d":"Rp6,400.00"},{"v":6200,"d":"Rp6,200.00"},{"v":4450,"d":"Rp4,450.00"},{"$f":"tblData[[#This Row],[JUMLAH]]-tblData[[#This Row],[BIAYA]]","v":{"v":1950,"d":"Rp1,950.00"}},{"$f":"DATE(YEAR('Entri Data'!$B6),MONTH('Entri Data'!$B6),1)","v":"2013-04-01"},{"$f":"LOOKUP(MONTH('Entri Data'!$H6),{1,1;2,1;3,1;4,2;5,2;6,2;7,3;8,3;9,3;10,4;11,4;12,4})","v":{"v":2,"d":"Kuartal 2"}},{"$f":"YEAR('Entri Data'!$B6)","v":2013},{"$f":"MONTH(tblData[[#This Row],[TANGGAL]])","v":4},{"$f":"SUMIFS(tblData[JUMLAH],tblData[TANGGAL],\">=\"&EOMONTH(tblData[[#This Row],[TANGGAL]],-1)+1,tblData[TANGGAL],\"<=\"&EOMONTH(tblData[[#This Row],[TANGGAL]],0))","v":{"v":14600,"d":"Rp14,600.00"}},{"$f":"SUMIFS(tblData[JUMLAH],tblData[TANGGAL],\">=\"&DATE(YEAR(tblData[[#This Row],[TANGGAL]]),1,1),tblData[TANGGAL],\"<=\"&DATE(YEAR(tblData[[#This Row],[TANGGAL]]),12,31),tblData[KUARTAL],tblData[[#This Row],[KUARTAL]])","v":{"v":50800,"d":"Rp50,800.00"}},{"$f":"SUMIFS(tblData[JUMLAH],tblData[TANGGAL],\">=\"&DATE(YEAR(tblData[[#This Row],[TANGGAL]]),1,1),tblData[TANGGAL],\"<=\"&DATE(YEAR(tblData[[#This Row],[TANGGAL]]),12,31))","v":{"v":143800,"d":"Rp143,800.00"}},{"$f":"IFERROR(TREND($L$6:INDEX($L:$L,ROW(),1),$K$6:INDEX($K:$K,ROW(),1),IF(MONTH(tblData[[#This Row],[TANGGAL]])=12,13,MONTH(tblData[[#This Row],[TANGGAL]])+1)),\"\")","v":{"v":14600,"d":"Rp14,600.00"}},{"$f":"IFERROR(TREND($M$6:INDEX($M:$M,ROW(),1),$I$6:INDEX($I:$I,ROW(),1),IF(tblData[[#This Row],[KUARTAL]]=4,5,tblData[[#This Row],[KUARTAL]]+1)),\"\")","v":{"v":50800,"d":"Rp50,800.00"}},{"$f":"IFERROR(TREND($N$6:INDEX($N:$N,ROW(),1),$J$6:INDEX($J:$J,ROW(),1),tblData[[#This Row],[TAHUN]]+1),\"\")","v":{"v":143800,"d":"Rp143,800.00"}}]
[null,{"$f":"40659+(365*2)","v":"2013-04-25"},"Contoso Pharmaceuticals",{"v":8200,"d":"Rp8,200.00"},{"v":8000,"d":"Rp8,000.00"},{"v":6400,"d":"Rp6,400.00"},{"$f":"tblData[[#This Row],[JUMLAH]]-tblData[[#This Row],[BIAYA]]","v":{"v":1800,"d":"Rp1,800.00"}},{"$f":"DATE(YEAR('Entri Data'!$B7),MONTH('Entri Data'!$B7),1)","v":"2013-04-01"},{"$f":"LOOKUP(MONTH('Entri Data'!$H7),{1,1;2,1;3,1;4,2;5,2;6,2;7,3;8,3;9,3;10,4;11,4;12,4})","v":{"v":2,"d":"Kuartal 2"}},{"$f":"YEAR('Entri Data'!$B7)","v":2013},{"$f":"MONTH(tblData[[#This Row],[TANGGAL]])","v":4},{"$f":"SUMIFS(tblData[JUMLAH],tblData[TANGGAL],\">=\"&EOMONTH(tblData[[#This Row],[TANGGAL]],-1)+1,tblData[TANGGAL],\"<=\"&EOMONTH(tblData[[#This Row],[TANGGAL]],0))","v":{"v":14600,"d":"Rp14,600.00"}},{"$f":"SUMIFS(tblData[JUMLAH],tblData[TANGGAL],\">=\"&DATE(YEAR(tblData[[#This Row],[TANGGAL]]),1,1),tblData[TANGGAL],\"<=\"&DATE(YEAR(tblData[[#This Row],[TANGGAL]]),12,31),tblData[KUARTAL],tblData[[#This Row],[KUARTAL]])","v":{"v":50800,"d":"Rp50,800.00"}},{"$f":"SUMIFS(tblData[JUMLAH],tblData[TANGGAL],\">=\"&DATE(YEAR(tblData[[#This Row],[TANGGAL]]),1,1),tblData[TANGGAL],\"<=\"&DATE(YEAR(tblData[[#This Row],[TANGGAL]]),12,31))","v":{"v":143800,"d":"Rp143,800.00"}},{"$f":"IFERROR(TREND($L$6:INDEX($L:$L,ROW(),1),$K$6:INDEX($K:$K,ROW(),1),IF(MONTH(tblData[[#This Row],[TANGGAL]])=12,13,MONTH(tblData[[#This Row],[TANGGAL]])+1)),\"\")","v":{"v":14600,"d":"Rp14,600.00"}},{"$f":"IFERROR(TREND($M$6:INDEX($M:$M,ROW(),1),$I$6:INDEX($I:$I,ROW(),1),IF(tblData[[#This Row],[KUARTAL]]=4,5,tblData[[#This Row],[KUARTAL]]+1)),\"\")","v":{"v":50800,"d":"Rp50,800.00"}},{"$f":"IFERROR(TREND($N$6:INDEX($N:$N,ROW(),1),$J$6:INDEX($J:$J,ROW(),1),tblData[[#This Row],[TAHUN]]+1),\"\")","v":{"v":143800,"d":"Rp143,800.00"}}]
[null,{"$f":"40671+(365*2)","v":"2013-05-07"},"Consolidated Messenger",{"v":4400,"d":"Rp4,400.00"},{"v":4200,"d":"Rp4,200.00"},{"v":2600,"d":"Rp2,600.00"},{"$f":"tblData[[#This Row],[JUMLAH]]-tblData[[#This Row],[BIAYA]]","v":{"v":1800,"d":"Rp1,800.00"}},{"$f":"DATE(YEAR('Entri Data'!$B8),MONTH('Entri Data'!$B8),1)","v":"2013-05-01"},{"$f":"LOOKUP(MONTH('Entri Data'!$H8),{1,1;2,1;3,1;4,2;5,2;6,2;7,3;8,3;9,3;10,4;11,4;12,4})","v":{"v":2,"d":"Kuartal 2"}},{"$f":"YEAR('Entri Data'!$B8)","v":2013},{"$f":"MONTH(tblData[[#This Row],[TANGGAL]])","v":5},{"$f":"SUMIFS(tblData[JUMLAH],tblData[TANGGAL],\">=\"&EOMONTH(tblData[[#This Row],[TANGGAL]],-1)+1,tblData[TANGGAL],\"<=\"&EOMONTH(tblData[[#This Row],[TANGGAL]],0))","v":{"v":21800,"d":"Rp21,800.00"}},{"$f":"SUMIFS(tblData[JUMLAH],tblData[TANGGAL],\">=\"&DATE(YEAR(tblData[[#This Row],[TANGGAL]]),1,1),tblData[TANGGAL],\"<=\"&DATE(YEAR(tblData[[#This Row],[TANGGAL]]),12,31),tblData[KUARTAL],tblData[[#This Row],[KUARTAL]])","v":{"v":50800,"d":"Rp50,800.00"}},{"$f":"SUMIFS(tblData[JUMLAH],tblData[TANGGAL],\">=\"&DATE(YEAR(tblData[[#This Row],[TANGGAL]]),1,1),tblData[TANGGAL],\"<=\"&DATE(YEAR(tblData[[#This Row],[TANGGAL]]),12,31))","v":{"v":143800,"d":"Rp143,800.00"}},{"$f":"IFERROR(TREND($L$6:INDEX($L:$L,ROW(),1),$K$6:INDEX($K:$K,ROW(),1),IF(MONTH(tblData[[#This Row],[TANGGAL]])=12,13,MONTH(tblData[[#This Row],[TANGGAL]])+1)),\"\")","v":{"v":28999.999999999996,"d":"Rp29,000.00"}},{"$f":"IFERROR(TREND($M$6:INDEX($M:$M,ROW(),1),$I$6:INDEX($I:$I,ROW(),1),IF(tblData[[#This Row],[KUARTAL]]=4,5,tblData[[#This Row],[KUARTAL]]+1)),\"\")","v":{"v":50800,"d":"Rp50,800.00"}},{"$f":"IFERROR(TREND($N$6:INDEX($N:$N,ROW(),1),$J$6:INDEX($J:$J,ROW(),1),tblData[[#This Row],[TAHUN]]+1),\"\")","v":{"v":143800,"d":"Rp143,800.00"}}]
[null,{"$f":"40678+(365*2)","v":"2013-05-14"},"Proseware, Inc.",{"v":5400,"d":"Rp5,400.00"},{"v":5500,"d":"Rp5,500.00"},{"v":4500,"d":"Rp4,500.00"},{"$f":"tblData[[#This Row],[JUMLAH]]-tblData[[#This Row],[BIAYA]]","v":{"v":900,"d":"Rp900.00"}},{"$f":"DATE(YEAR('Entri Data'!$B9),MONTH('Entri Data'!$B9),1)","v":"2013-05-01"},{"$f":"LOOKUP(MONTH('Entri Data'!$H9),{1,1;2,1;3,1;4,2;5,2;6,2;7,3;8,3;9,3;10,4;11,4;12,4})","v":{"v":2,"d":"Kuartal 2"}},{"$f":"YEAR('Entri Data'!$B9)","v":2013},{"$f":"MONTH(tblData[[#This Row],[TANGGAL]])","v":5},{"$f":"SUMIFS(tblData[JUMLAH],tblData[TANGGAL],\">=\"&EOMONTH(tblData[[#This Row],[TANGGAL]],-1)+1,tblData[TANGGAL],\"<=\"&EOMONTH(tblData[[#This Row],[TANGGAL]],0))","v":{"v":21800,"d":"Rp21,800.00"}},{"$f":"SUMIFS(tblData[JUMLAH],tblData[TANGGAL],\">=\"&DATE(YEAR(tblData[[#This Row],[TANGGAL]]),1,1),tblData[TANGGAL],\"<=\"&DATE(YEAR(tblData[[#This Row],[TANGGAL]]),12,31),tblData[KUARTAL],tblData[[#This Row],[KUARTAL]])","v":{"v":50800,"d":"Rp50,800.00"}},{"$f":"SUMIFS(tblData[JUMLAH],tblData[TANGGAL],\">=\"&DATE(YEAR(tblData[[#This Row],[TANGGAL]]),1,1),tblData[TANGGAL],\"<=\"&DATE(YEAR(tblData[[#This Row],[TANGGAL]]),12,31))","v":{"v":143800,"d":"Rp143,800.00"}},{"$f":"IFERROR(TREND($L$6:INDEX($L:$L,ROW(),1),$K$6:INDEX($K:$K,ROW(),1),IF(MONTH(tblData[[#This Row],[TANGGAL]])=12,13,MONTH(tblData[[#This Row],[TANGGAL]])+1)),\"\")","v":{"v":29000,"d":"Rp29,000.00"}},{"$f":"IFERROR(TREND($M$6:INDEX($M:$M,ROW(),1),$I$6:INDEX($I:$I,ROW(),1),IF(tblData[[#This Row],[KUARTAL]]=4,5,tblData[[#This Row],[KUARTAL]]+1)),\"\")","v":{"v":50800,"d":"Rp50,800.00"}},{"$f":"IFERROR(TREND($N$6:INDEX($N:$N,ROW(),1),$J$6:INDEX($J:$J,ROW(),1),tblData[[#This Row],[TAHUN]]+1),\"\")","v":{"v":143800,"d":"Rp143,800.00"}}]
[null,{"$f":"40678+(365*2)","v":"2013-05-14"},"School of Fine Art",{"v":5800,"d":"Rp5,800.00"},{"v":6000,"d":"Rp6,000.00"},{"v":4500,"d":"Rp4,500.00"},{"$f":"tblData[[#This Row],[JUMLAH]]-tblData[[#This Row],[BIAYA]]","v":{"v":1300,"d":"Rp1,300.00"}},{"$f":"DATE(YEAR('Entri Data'!$B10),MONTH('Entri Data'!$B10),1)","v":"2013-05-01"},{"$f":"LOOKUP(MONTH('Entri Data'!$H10),{1,1;2,1;3,1;4,2;5,2;6,2;7,3;8,3;9,3;10,4;11,4;12,4})","v":{"v":2,"d":"Kuartal 2"}},{"$f":"YEAR('Entri Data'!$B10)","v":2013},{"$f":"MONTH(tblData[[#This Row],[TANGGAL]])","v":5},{"$f":"SUMIFS(tblData[JUMLAH],tblData[TANGGAL],\">=\"&EOMONTH(tblData[[#This Row],[TANGGAL]],-1)+1,tblData[TANGGAL],\"<=\"&EOMONTH(tblData[[#This Row],[TANGGAL]],0))","v":{"v":21800,"d":"Rp21,800.00"}},{"$f":"SUMIFS(tblData[JUMLAH],tblData[TANGGAL],\">=\"&DATE(YEAR(tblData[[#This Row],[TANGGAL]]),1,1),tblData[TANGGAL],\"<=\"&DATE(YEAR(tblData[[#This Row],[TANGGAL]]),12,31),tblData[KUARTAL],tblData[[#This Row],[KUARTAL]])","v":{"v":50800,"d":"Rp50,800.00"}},{"$f":"SUMIFS(tblData[JUMLAH],tblData[TANGGAL],\">=\"&DATE(YEAR(tblData[[#This Row],[TANGGAL]]),1,1),tblData[TANGGAL],\"<=\"&DATE(YEAR(tblData[[#This Row],[TANGGAL]]),12,31))","v":{"v":143800,"d":"Rp143,800.00"}},{"$f":"IFERROR(TREND($L$6:INDEX($L:$L,ROW(),1),$K$6:INDEX($K:$K,ROW(),1),IF(MONTH(tblData[[#This Row],[TANGGAL]])=12,13,MONTH(tblData[[#This Row],[TANGGAL]])+1)),\"\")","v":{"v":29000,"d":"Rp29,000.00"}},{"$f":"IFERROR(TREND($M$6:INDEX($M:$M,ROW(),1),$I$6:INDEX($I:$I,ROW(),1),IF(tblData[[#This Row],[KUARTAL]]=4,5,tblData[[#This Row],[KUARTAL]]+1)),\"\")","v":{"v":50800,"d":"Rp50,800.00"}},{"$f":"IFERROR(TREND($N$6:INDEX($N:$N,ROW(),1),$J$6:INDEX($J:$J,ROW(),1),tblData[[#This Row],[TAHUN]]+1),\"\")","v":{"v":143800,"d":"Rp143,800.00"}}]
[null,{"$f":"40693+(365*2)","v":"2013-05-29"},"Trey Research",{"v":6200,"d":"Rp6,200.00"},{"v":6000,"d":"Rp6,000.00"},{"v":4500,"d":"Rp4,500.00"},{"$f":"tblData[[#This Row],[JUMLAH]]-tblData[[#This Row],[BIAYA]]","v":{"v":1700,"d":"Rp1,700.00"}},{"$f":"DATE(YEAR('Entri Data'!$B11),MONTH('Entri Data'!$B11),1)","v":"2013-05-01"},{"$f":"LOOKUP(MONTH('Entri Data'!$H11),{1,1;2,1;3,1;4,2;5,2;6,2;7,3;8,3;9,3;10,4;11,4;12,4})","v":{"v":2,"d":"Kuartal 2"}},{"$f":"YEAR('Entri Data'!$B11)","v":2013},{"$f":"MONTH(tblData[[#This Row],[TANGGAL]])","v":5},{"$f":"SUMIFS(tblData[JUMLAH],tblData[TANGGAL],\">=\"&EOMONTH(tblData[[#This Row],[TANGGAL]],-1)+1,tblData[TANGGAL],\"<=\"&EOMONTH(tblData[[#This Row],[TANGGAL]],0))","v":{"v":21800,"d":"Rp21,800.00"}},{"$f":"SUMIFS(tblData[JUMLAH],tblData[TANGGAL],\">=\"&DATE(YEAR(tblData[[#This Row],[TANGGAL]]),1,1),tblData[TANGGAL],\"<=\"&DATE(YEAR(tblData[[#This Row],[TANGGAL]]),12,31),tblData[KUARTAL],tblData[[#This Row],[KUARTAL]])","v":{"v":50800,"d":"Rp50,800.00"}},{"$f":"SUMIFS(tblData[JUMLAH],tblData[TANGGAL],\">=\"&DATE(YEAR(tblData[[#This Row],[TANGGAL]]),1,1),tblData[TANGGAL],\"<=\"&DATE(YEAR(tblData[[#This Row],[TANGGAL]]),12,31))","v":{"v":143800,"d":"Rp143,800.00"}},{"$f":"IFERROR(TREND($L$6:INDEX($L:$L,ROW(),1),$K$6:INDEX($K:$K,ROW(),1),IF(MONTH(tblData[[#This Row],[TANGGAL]])=12,13,MONTH(tblData[[#This Row],[TANGGAL]])+1)),\"\")","v":{"v":29000,"d":"Rp29,000.00"}},{"$f":"IFERROR(TREND($M$6:INDEX($M:$M,ROW(),1),$I$6:INDEX($I:$I,ROW(),1),IF(tblData[[#This Row],[KUARTAL]]=4,5,tblData[[#This Row],[KUARTAL]]+1)),\"\")","v":{"v":50800,"d":"Rp50,800.00"}},{"$f":"IFERROR(TREND($N$6:INDEX($N:$N,ROW(),1),$J$6:INDEX($J:$J,ROW(),1),tblData[[#This Row],[TAHUN]]+1),\"\")","v":{"v":143800,"d":"Rp143,800.00"}}]
[null,{"$f":"40705+(365*2)","v":"2013-06-10"},"A. Datum Corporation",{"v":6900,"d":"Rp6,900.00"},{"v":7500,"d":"Rp7,500.00"},{"v":5400,"d":"Rp5,400.00"},{"$f":"tblData[[#This Row],[JUMLAH]]-tblData[[#This Row],[BIAYA]]","v":{"v":1500,"d":"Rp1,500.00"}},{"$f":"DATE(YEAR('Entri Data'!$B12),MONTH('Entri Data'!$B12),1)","v":"2013-06-01"},{"$f":"LOOKUP(MONTH('Entri Data'!$H12),{1,1;2,1;3,1;4,2;5,2;6,2;7,3;8,3;9,3;10,4;11,4;12,4})","v":{"v":2,"d":"Kuartal 2"}},{"$f":"YEAR('Entri Data'!$B12)","v":2013},{"$f":"MONTH(tblData[[#This Row],[TANGGAL]])","v":6},{"$f":"SUMIFS(tblData[JUMLAH],tblData[TANGGAL],\">=\"&EOMONTH(tblData[[#This Row],[TANGGAL]],-1)+1,tblData[TANGGAL],\"<=\"&EOMONTH(tblData[[#This Row],[TANGGAL]],0))","v":{"v":14400,"d":"Rp14,400.00"}},{"$f":"SUMIFS(tblData[JUMLAH],tblData[TANGGAL],\">=\"&DATE(YEAR(tblData[[#This Row],[TANGGAL]]),1,1),tblData[TANGGAL],\"<=\"&DATE(YEAR(tblData[[#This Row],[TANGGAL]]),12,31),tblData[KUARTAL],tblData[[#This Row],[KUARTAL]])","v":{"v":50800,"d":"Rp50,800.00"}},{"$f":"SUMIFS(tblData[JUMLAH],tblData[TANGGAL],\">=\"&DATE(YEAR(tblData[[#This Row],[TANGGAL]]),1,1),tblData[TANGGAL],\"<=\"&DATE(YEAR(tblData[[#This Row],[TANGGAL]]),12,31))","v":{"v":143800,"d":"Rp143,800.00"}},{"$f":"IFERROR(TREND($L$6:INDEX($L:$L,ROW(),1),$K$6:INDEX($K:$K,ROW(),1),IF(MONTH(tblData[[#This Row],[TANGGAL]])=12,13,MONTH(tblData[[#This Row],[TANGGAL]])+1)),\"\")","v":{"v":21600.000000000004,"d":"Rp21,600.00"}},{"$f":"IFERROR(TREND($M$6:INDEX($M:$M,ROW(),1),$I$6:INDEX($I:$I,ROW(),1),IF(tblData[[#This Row],[KUARTAL]]=4,5,tblData[[#This Row],[KUARTAL]]+1)),\"\")","v":{"v":50800,"d":"Rp50,800.00"}},{"$f":"IFERROR(TREND($N$6:INDEX($N:$N,ROW(),1),$J$6:INDEX($J:$J,ROW(),1),tblData[[#This Row],[TAHUN]]+1),\"\")","v":{"v":143800,"d":"Rp143,800.00"}}]
[null,{"$f":"40716+(365*2)","v":"2013-06-21"},"Contoso Pharmaceuticals",{"v":7500,"d":"Rp7,500.00"},{"v":7200,"d":"Rp7,200.00"},{"v":6500,"d":"Rp6,500.00"},{"$f":"tblData[[#This Row],[JUMLAH]]-tblData[[#This Row],[BIAYA]]","v":{"v":1000,"d":"Rp1,000.00"}},{"$f":"DATE(YEAR('Entri Data'!$B13),MONTH('Entri Data'!$B13),1)","v":"2013-06-01"},{"$f":"LOOKUP(MONTH('Entri Data'!$H13),{1,1;2,1;3,1;4,2;5,2;6,2;7,3;8,3;9,3;10,4;11,4;12,4})","v":{"v":2,"d":"Kuartal 2"}},{"$f":"YEAR('Entri Data'!$B13)","v":2013},{"$f":"MONTH(tblData[[#This Row],[TANGGAL]])","v":6},{"$f":"SUMIFS(tblData[JUMLAH],tblData[TANGGAL],\">=\"&EOMONTH(tblData[[#This Row],[TANGGAL]],-1)+1,tblData[TANGGAL],\"<=\"&EOMONTH(tblData[[#This Row],[TANGGAL]],0))","v":{"v":14400,"d":"Rp14,400.00"}},{"$f":"SUMIFS(tblData[JUMLAH],tblData[TANGGAL],\">=\"&DATE(YEAR(tblData[[#This Row],[TANGGAL]]),1,1),tblData[TANGGAL],\"<=\"&DATE(YEAR(tblData[[#This Row],[TANGGAL]]),12,31),tblData[KUARTAL],tblData[[#This Row],[KUARTAL]])","v":{"v":50800,"d":"Rp50,800.00"}},{"$f":"SUMIFS(tblData[JUMLAH],tblData[TANGGAL],\">=\"&DATE(YEAR(tblData[[#This Row],[TANGGAL]]),1,1),tblData[TANGGAL],\"<=\"&DATE(YEAR(tblData[[#This Row],[TANGGAL]]),12,31))","v":{"v":143800,"d":"Rp143,800.00"}},{"$f":"IFERROR(TREND($L$6:INDEX($L:$L,ROW(),1),$K$6:INDEX($K:$K,ROW(),1),IF(MONTH(tblData[[#This Row],[TANGGAL]])=12,13,MONTH(tblData[[#This Row],[TANGGAL]])+1)),\"\")","v":{"v":17950,"d":"Rp17,950.00"}},{"$f":"IFERROR(TREND($M$6:INDEX($M:$M,ROW(),1),$I$6:INDEX($I:$I,ROW(),1),IF(tblData[[#This Row],[KUARTAL]]=4,5,tblData[[#This Row],[KUARTAL]]+1)),\"\")","v":{"v":50800,"d":"Rp50,800.00"}},{"$f":"IFERROR(TREND($N$6:INDEX($N:$N,ROW(),1),$J$6:INDEX($J:$J,ROW(),1),tblData[[#This Row],[TAHUN]]+1),\"\")","v":{"v":143800,"d":"Rp143,800.00"}}]
[null,{"$f":"40731+(365*2)","v":"2013-07-06"},"Consolidated Messenger",{"v":8700,"d":"Rp8,700.00"},{"v":8500,"d":"Rp8,500.00"},{"v":7250,"d":"Rp7,250.00"},{"$f":"tblData[[#This Row],[JUMLAH]]-tblData[[#This Row],[BIAYA]]","v":{"v":1450,"d":"Rp1,450.00"}},{"$f":"DATE(YEAR('Entri Data'!$B14),MONTH('Entri Data'!$B14),1)","v":"2013-07-01"},{"$f":"LOOKUP(MONTH('Entri Data'!$H14),{1,1;2,1;3,1;4,2;5,2;6,2;7,3;8,3;9,3;10,4;11,4;12,4})","v":{"v":3,"d":"Kuartal 3"}},{"$f":"YEAR('Entri Data'!$B14)","v":2013},{"$f":"MONTH(tblData[[#This Row],[TANGGAL]])","v":7},{"$f":"SUMIFS(tblData[JUMLAH],tblData[TANGGAL],\">=\"&EOMONTH(tblData[[#This Row],[TANGGAL]],-1)+1,tblData[TANGGAL],\"<=\"&EOMONTH(tblData[[#This Row],[TANGGAL]],0))","v":{"v":8700,"d":"Rp8,700.00"}},{"$f":"SUMIFS(tblData[JUMLAH],tblData[TANGGAL],\">=\"&DATE(YEAR(tblData[[#This Row],[TANGGAL]]),1,1),tblData[TANGGAL],\"<=\"&DATE(YEAR(tblData[[#This Row],[TANGGAL]]),12,31),tblData[KUARTAL],tblData[[#This Row],[KUARTAL]])","v":{"v":49100,"d":"Rp49,100.00"}},{"$f":"SUMIFS(tblData[JUMLAH],tblData[TANGGAL],\">=\"&DATE(YEAR(tblData[[#This Row],[TANGGAL]]),1,1),tblData[TANGGAL],\"<=\"&DATE(YEAR(tblData[[#This Row],[TANGGAL]]),12,31))","v":{"v":143800,"d":"Rp143,800.00"}},{"$f":"IFERROR(TREND($L$6:INDEX($L:$L,ROW(),1),$K$6:INDEX($K:$K,ROW(),1),IF(MONTH(tblData[[#This Row],[TANGGAL]])=12,13,MONTH(tblData[[#This Row],[TANGGAL]])+1)),\"\")","v":{"v":10776.470588235294,"d":"Rp10,776.47"}},{"$f":"IFERROR(TREND($M$6:INDEX($M:$M,ROW(),1),$I$6:INDEX($I:$I,ROW(),1),IF(tblData[[#This Row],[KUARTAL]]=4,5,tblData[[#This Row],[KUARTAL]]+1)),\"\")","v":{"v":47400,"d":"Rp47,400.00"}},{"$f":"IFERROR(TREND($N$6:INDEX($N:$N,ROW(),1),$J$6:INDEX($J:$J,ROW(),1),tblData[[#This Row],[TAHUN]]+1),\"\")","v":{"v":143800,"d":"Rp143,800.00"}}]
[null,{"$f":"40761+(365*2)","v":"2013-08-05"},"Proseware, Inc.",{"v":8500,"d":"Rp8,500.00"},{"v":8300,"d":"Rp8,300.00"},{"v":7100,"d":"Rp7,100.00"},{"$f":"tblData[[#This Row],[JUMLAH]]-tblData[[#This Row],[BIAYA]]","v":{"v":1400,"d":"Rp1,400.00"}},{"$f":"DATE(YEAR('Entri Data'!$B15),MONTH('Entri Data'!$B15),1)","v":"2013-08-01"},{"$f":"LOOKUP(MONTH('Entri Data'!$H15),{1,1;2,1;3,1;4,2;5,2;6,2;7,3;8,3;9,3;10,4;11,4;12,4})","v":{"v":3,"d":"Kuartal 3"}},{"$f":"YEAR('Entri Data'!$B15)","v":2013},{"$f":"MONTH(tblData[[#This Row],[TANGGAL]])","v":8},{"$f":"SUMIFS(tblData[JUMLAH],tblData[TANGGAL],\">=\"&EOMONTH(tblData[[#This Row],[TANGGAL]],-1)+1,tblData[TANGGAL],\"<=\"&EOMONTH(tblData[[#This Row],[TANGGAL]],0))","v":{"v":16400,"d":"Rp16,400.00"}},{"$f":"SUMIFS(tblData[JUMLAH],tblData[TANGGAL],\">=\"&DATE(YEAR(tblData[[#This Row],[TANGGAL]]),1,1),tblData[TANGGAL],\"<=\"&DATE(YEAR(tblData[[#This Row],[TANGGAL]]),12,31),tblData[KUARTAL],tblData[[#This Row],[KUARTAL]])","v":{"v":49100,"d":"Rp49,100.00"}},{"$f":"SUMIFS(tblData[JUMLAH],tblData[TANGGAL],\">=\"&DATE(YEAR(tblData[[#This Row],[TANGGAL]]),1,1),tblData[TANGGAL],\"<=\"&DATE(YEAR(tblData[[#This Row],[TANGGAL]]),12,31))","v":{"v":143800,"d":"Rp143,800.00"}},{"$f":"IFERROR(TREND($L$6:INDEX($L:$L,ROW(),1),$K$6:INDEX($K:$K,ROW(),1),IF(MONTH(tblData[[#This Row],[TANGGAL]])=12,13,MONTH(tblData[[#This Row],[TANGGAL]])+1)),\"\")","v":{"v":12455.862068965516,"d":"Rp12,455.86"}},{"$f":"IFERROR(TREND($M$6:INDEX($M:$M,ROW(),1),$I$6:INDEX($I:$I,ROW(),1),IF(tblData[[#This Row],[KUARTAL]]=4,5,tblData[[#This Row],[KUARTAL]]+1)),\"\")","v":{"v":47400,"d":"Rp47,400.00"}},{"$f":"IFERROR(TREND($N$6:INDEX($N:$N,ROW(),1),$J$6:INDEX($J:$J,ROW(),1),tblData[[#This Row],[TAHUN]]+1),\"\")","v":{"v":143800,"d":"Rp143,800.00"}}]
{"$rows_left_out":10}
{"sheet":"Laporan Penjualan","index":1,"n_rows":28,"n_cols":6,"rows_kept":28}
[]
[null,"LAPORAN PENJUALAN BULANAN"]
[]
[]
[null,"TAHUN","KUARTAL","BULAN","PERUSAHAAN","TOTAL PENJUALAN"]
[null,2013,{"v":2,"d":"Kuartal 2"},"2013-04-01","A. Datum Corporation",{"v":6400,"d":"Rp6,400.00"}]
[{"$nulls":4},"Contoso Pharmaceuticals",{"v":8200,"d":"Rp8,200.00"}]
[{"$nulls":3},"2013-05-01","Consolidated Messenger",{"v":4400,"d":"Rp4,400.00"}]
[{"$nulls":4},"Proseware, Inc.",{"v":5400,"d":"Rp5,400.00"}]
[{"$nulls":4},"School of Fine Art",{"v":5800,"d":"Rp5,800.00"}]
[{"$nulls":4},"Trey Research",{"v":6200,"d":"Rp6,200.00"}]
[{"$nulls":3},"2013-06-01","A. Datum Corporation",{"v":6900,"d":"Rp6,900.00"}]
[{"$nulls":4},"Contoso Pharmaceuticals",{"v":7500,"d":"Rp7,500.00"}]
[null,null,"Kuartal 2 Total",null,null,{"v":50800,"d":"Rp50,800.00"}]
[null,null,{"v":3,"d":"Kuartal 3"},"2013-07-01","Consolidated Messenger",{"v":8700,"d":"Rp8,700.00"}]
{"$rows_left_out":14}
{"sheet":"Perkiraan Penjualan","index":2,"n_rows":43,"n_cols":10,"rows_kept":43}
[]
[null,"PERKIRAAN PENJUALAN BULANAN"]
[null,{"$f":"\"TANGGAL HARI INI: \"&UPPER(TEXT(TODAY(),\"d mmm yyyy\"))","v":"TANGGAL HARI INI: 16 OKT 2012"},null,{"$f":"--TRIM(RIGHT(B3,LEN(B3)-FIND(\":\",B3)))","v":"2012-10-16"}]
[]
[null,"BULAN INI","AKTUAL","RENCANA","VARIAN","%","YTD AKTUAL","YTD RENCANA","YTD VARIAN","YTD %"]
[null,"Kuantitas",{"$f":"COUNTIF('Entri Data'!$B$6:$B$24,\">=\"&DATE(fYear,MONTH(fDate),1))-COUNTIF('Entri Data'!$B$6:$B$24,\">\"&EOMONTH(fDate,0))","v":0},{"$nulls":3},{"$f":"COUNTIF(tblData[TANGGAL],\"<=\"&EOMONTH(fDate,0))","v":0}]
[null,"Penjualan",{"$f":"SUMIF(tblData[TANGGAL],\">=\"&DATE(fYear,MONTH(fDate),1),tblData[JUMLAH])-SUMIF(tblData[TANGGAL],\">\"&EOMONTH(fDate,0),tblData[JUMLAH])","v":{"v":0,"d":"Rp0.00"}},{"$f":"SUMIF('Entri Data'!$B$6:$B$24,\">=\"&DATE(fYear,MONTH(fDate),1),'Entri Data'!$E$6:$E$24)-SUMIF('Entri Data'!$B$6:$B$24,\">\"&EOMONTH(fDate,0),'Entri Data'!$E$6:$E$24)","v":{"v":0,"d":"Rp0.00"}},{"$f":"D7-C7","v":{"v":0,"d":"Rp0.00"}},{"$f":"IFERROR(D7/C7,\"-\")","v":"-"},{"$f":"SUMIF(tblData[TANGGAL],\"<=\"&EOMONTH(fDate,0),tblData[JUMLAH])","v":{"v":0,"d":"Rp0.00"}},{"$f":"SUMIF(tblData[TANGGAL],\"<=\"&EOMONTH(fDate,0),tblData[TERENCANA])","v":{"v":0,"d":"Rp0.00"}},{"$f":"H7-G7","v":{"v":0,"d":"Rp0.00"}},{"$f":"IFERROR(H7/G7,\"\")","v":""}]
[null,"Pendapatan",{"$f":"(SUMIF(tblData[TANGGAL],\">=\"&DATE(fYear,MONTH(fDate),1),tblData[JUMLAH])-SUMIF(tblData[TANGGAL],\">\"&EOMONTH(fDate,0),tblData[JUMLAH]))-(SUMIF(tblData[TANGGAL],\">=\"&DATE(fYear,MONTH(fDate),1),tblData[BIAYA])-SUMIF(tblData[TANGGAL],\">\"&EOMONTH(fDate,0),tblData[BIAYA]))","v":{"v":0,"d":"Rp0.00"}},{"$f":"(SUMIF('Entri Data'!$B$6:$B$24,\">=\"&DATE(fYear,MONTH(fDate),1),'Entri Data'!$E$6:$E$24)-SUMIF('Entri Data'!$B$6:$B$24,\">\"&EOMONTH(fDate,0),'Entri Data'!$E$6:$E$24))-(SUMIF('Entri Data'!$B$6:$B$24,\">=\"&DATE(fYear,MONTH(fDate),1),'Entri Data'!$F$6:$F$24)-SUMIF('Entri Data'!$B$6:$B$24,\">\"&EOMONTH(fDate,0),'Entri Data'!$F$6:$F$24))","v":{"v":0,"d":"Rp0.00"}},{"$f":"D8-C8","v":{"v":0,"d":"Rp0.00"}},{"$f":"IFERROR(D8/C8,\"-\")","v":"-"},{"$f":"SUMIF('Entri Data'!$B$6:$B$24,\"<=\"&EOMONTH(fDate,0),'Entri Data'!$F$6:$F$24)","v":{"v":0,"d":"Rp0.00"}},{"$f":"SUMIF(tblData[TANGGAL],\"<=\"&EOMONTH(fDate,0),tblData[BIAYA])","v":{"v":0,"d":"Rp0.00"}},{"$f":"H8-G8","v":{"v":0,"d":"Rp0.00"}},{"$f":"IFERROR(H8/G8,\"\")","v":""}]
[null,"Margin",{"$f":"IFERROR(C8/C7,\"-\")","v":"-"},{"$f":"IFERROR(D8/D7,\"-\")","v":"-"},null,{"$f":"IFERROR(F8/F7,\"-\")","v":"-"},{"$f":"IFERROR(G8/G7,\"\")","v":""},{"$f":"IFERROR(H8/H7,\"\")","v":""},null,{"$f":"IFERROR(J8/J7,\"\")","v":""}]
[null,"Jumlah Pesanan",{"$f":"COUNTIF(tblData[TANGGAL],\">=\"&DATE(fYear,MONTH(fDate),1))-COUNTIF(tblData[TANGGAL],\">\"&EOMONTH(fDate,0))","v":0},{"$nulls":3},{"$f":"COUNTIF(tblData[TANGGAL],\">\"&EOMONTH(fDate,0))","v":19}]
[null,"Rata-rata Nilai Pesanan",{"$f":"IFERROR(C7/C10,\"-\")","v":"-"},{"$nulls":3},{"$f":"IFERROR(G7/G10,\"-\")","v":{"v":0,"d":"Rp0.00"}}]
[]
[null,"PERKIRAAN",null,"BULAN BERIKUTNYA",null,"KUARTAL BERIKUTNYA",null,null,"TAHUN BERIKUTNYA"]
[null,"Penjualan",null,{"$f":"TREND(tblData[[BULAN ]],tblData[MONTH NUM (HIDE)],IF(MONTH(fDate)=12,13,MONTH(fDate)+1))","v":{"v":19802.70727580372,"d":"Rp19,802.71"}},null,{"$f":"TREND(tblData[[KUARTAL ]],tblData[MONTH NUM (HIDE)],IF(MONTH(fDate)=12,13,MONTH(fDate)+1))","v":{"v":45107.44500846024,"d":"Rp45,107.45"}},null,null,{"$f":"TREND(tblData[[TAHUNAN ]],tblData[MONTH NUM (HIDE)],IF(MONTH(fDate)=12,13,MONTH(fDate)+1))","v":{"v":143800,"d":"Rp143,800.00"}}]
[]
{"$rows_left_out":10}