{"text_format":"3","workbook":"xlsx","n_sheets":2,"sheets":["Tabel Waktu Karyawan","Pencarian_Hari_Kerja"],"not_rendered":{"defined_names":27},"read":"whole","date_system":"1900"}

{"sheet":"Tabel Waktu Karyawan","index":0,"n_rows":36,"n_cols":26,"rows_kept":36,"merged":[[0,1,2,4],[0,5,2,9],[0,10,2,14],[0,15,3,23],[0,24,3,24],[3,1,3,3],[3,5,3,9],[3,10,3,14],[4,1,6,3],[4,4,6,6],[5,14,7,14],[5,22,7,22],[5,23,7,23],[5,24,7,24],[21,1,21,6],[22,1,23,3],[22,4,23,6],[23,14,24,14],[23,22,24,22],[23,23,24,23],[23,24,24,24],[32,1,32,6],[32,24,33,24],[32,25,33,25],[33,1,33,6],[34,1,34,6],[35,1,35,3],[35,4,35,5],[35,6,35,7],[35,8,35,14],[35,15,35,16],[35,17,35,23]]}
[null,"LEMBAR WAKTU OPERATOR",{"$nulls":3},"Nama Karyawan",{"$nulls":9},"Pilih Ya dalam sel di sebelah kanan, jika otorisasi \nlembur diperlukan"]
[]
[]
[null,"Tanggal Rekap Gaji",null,null,{"$f":"V7","v":"2025-06-14"},"Nomor Karyawan"]
[null,"JAM REGULER:",null,null,"Tanggal:"]
[{"$nulls":14},"Total Jam Reguler Minggu 1",{"$nulls":7},"Total Jam Reguler Minggu 2","Total\nJam\nReguler","Kode Pembayaran\nTerkait Gaji"]
[{"$nulls":7},"2025-06-01",{"$f":"Hari_Pertama+1","v":"2025-06-02"},{"$f":"Hari_Pertama+2","v":"2025-06-03"},{"$f":"Hari_Pertama+3","v":"2025-06-04"},{"$f":"Hari_Pertama+4","v":"2025-06-05"},{"$f":"Hari_Pertama+5","v":"2025-06-06"},{"$f":"Hari_Pertama+6","v":"2025-06-07"},null,{"$f":"Hari_Pertama+7","v":"2025-06-08"},{"$f":"Hari_Pertama+8","v":"2025-06-09"},{"$f":"Hari_Pertama+9","v":"2025-06-10"},{"$f":"Hari_Pertama+10","v":"2025-06-11"},{"$f":"Hari_Pertama+11","v":"2025-06-12"},{"$f":"Hari_Pertama+12","v":"2025-06-13"},{"$f":"Hari_Pertama+13","v":"2025-06-14"}]
[null,"Tugas","Lok","No. Perintah Kerja","Deskripsi Pekerjaan","Jabatan","No. Jabatan",{"$f":"VLOOKUP(WEEKDAY(Hari_Pertama),Pencarian_Hari_Kerja!$B$2:$C$8,2)","v":"Min"},{"$f":"VLOOKUP(WEEKDAY(I7),Pencarian_Hari_Kerja!$B$2:$C$8,2)","v":"Sen"},{"$f":"VLOOKUP(WEEKDAY(J7),Pencarian_Hari_Kerja!$B$2:$C$8,2)","v":"Sel"},{"$f":"VLOOKUP(WEEKDAY(K7),Pencarian_Hari_Kerja!$B$2:$C$8,2)","v":"Rab"},{"$f":"VLOOKUP(WEEKDAY(L7),Pencarian_Hari_Kerja!$B$2:$C$8,2)","v":"Kam"},{"$f":"VLOOKUP(WEEKDAY(M7),Pencarian_Hari_Kerja!$B$2:$C$8,2)","v":"Jum"},{"$f":"VLOOKUP(WEEKDAY(N7),Pencarian_Hari_Kerja!$B$2:$C$8,2)","v":"Sab"},null,{"$f":"VLOOKUP(WEEKDAY(P7),Pencarian_Hari_Kerja!$B$2:$C$8,2)","v":"Min"},{"$f":"VLOOKUP(WEEKDAY(Q7),Pencarian_Hari_Kerja!$B$2:$C$8,2)","v":"Sen"},{"$f":"VLOOKUP(WEEKDAY(R7),Pencarian_Hari_Kerja!$B$2:$C$8,2)","v":"Sel"},{"$f":"VLOOKUP(WEEKDAY(S7),Pencarian_Hari_Kerja!$B$2:$C$8,2)","v":"Rab"},{"$f":"VLOOKUP(WEEKDAY(T7),Pencarian_Hari_Kerja!$B$2:$C$8,2)","v":"Kam"},{"$f":"VLOOKUP(WEEKDAY(U7),Pencarian_Hari_Kerja!$B$2:$C$8,2)","v":"Jum"},{"$f":"VLOOKUP(WEEKDAY(V7),Pencarian_Hari_Kerja!$B$2:$C$8,2)","v":"Sab"}]
[{"$nulls":14},{"$f":"SUM(H9:N9)","v":{"v":0,"d":"0.00"}},{"$nulls":7},{"$f":"SUM(P9:V9)","v":{"v":0,"d":"0.00"}},{"$f":"O9+W9","v":{"v":0,"d":"0.00"}}]
[{"$nulls":14},{"v":0,"d":"0.00"},{"$nulls":7},{"v":0,"d":"0.00"},{"v":0,"d":"0.00"}]
[{"$nulls":14},{"v":0,"d":"0.00"},{"$nulls":7},{"v":0,"d":"0.00"},{"v":0,"d":"0.00"}]
[{"$nulls":14},{"v":0,"d":"0.00"},{"$nulls":7},{"v":0,"d":"0.00"},{"v":0,"d":"0.00"}]
[{"$nulls":14},{"v":0,"d":"0.00"},{"$nulls":7},{"v":0,"d":"0.00"},{"v":0,"d":"0.00"}]
[{"$nulls":14},{"v":0,"d":"0.00"},{"$nulls":7},{"v":0,"d":"0.00"},{"v":0,"d":"0.00"}]
[{"$nulls":14},{"v":0,"d":"0.00"},{"$nulls":7},{"v":0,"d":"0.00"},{"v":0,"d":"0.00"}]
[{"$nulls":14},{"$f":"SUM(H16:N16)","v":{"v":0,"d":"0.00"}},{"$nulls":7},{"$f":"SUM(P16:V16)","v":{"v":0,"d":"0.00"}},{"$f":"O16+W16","v":{"v":0,"d":"0.00"}}]
[{"$nulls":14},{"v":0,"d":"0.00"},{"$nulls":7},{"v":0,"d":"0.00"},{"v":0,"d":"0.00"}]
[{"$nulls":14},{"v":0,"d":"0.00"},{"$nulls":7},{"v":0,"d":"0.00"},{"v":0,"d":"0.00"}]
[{"$nulls":14},{"v":0,"d":"0.00"},{"$nulls":7},{"v":0,"d":"0.00"},{"v":0,"d":"0.00"}]
[{"$nulls":14},{"v":0,"d":"0.00"},{"$nulls":7},{"v":0,"d":"0.00"},{"v":0,"d":"0.00"}]
[{"$nulls":14},{"v":0,"d":"0.00"},{"$nulls":7},{"v":0,"d":"0.00"},{"v":0,"d":"0.00"}]
[null,"Total Jam Reguler   ",{"$nulls":5},{"$f":"SUM(H9:H21)","v":{"v":0,"d":"0.00"}},{"v":0,"d":"0.00"},{"v":0,"d":"0.00"},{"v":0,"d":"0.00"},{"v":0,"d":"0.00"},{"v":0,"d":"0.00"},{"v":0,"d":"0.00"},{"v":0,"d":"0.00"},{"v":0,"d":"0.00"},{"$f":"SUM(Q9:Q21)","v":{"v":0,"d":"0.00"}},{"v":0,"d":"0.00"},{"v":0,"d":"0.00"},{"v":0,"d":"0.00"},{"v":0,"d":"0.00"},{"v":0,"d":"0.00"},{"$f":"SUM(W9:W21)","v":{"v":0,"d":"0.00"}},{"$f":"SUM(X9:X21)","v":{"v":0,"d":"0.00"}}]
[null,"JAM LEMBUR:",null,null,"Tanggal:"]
[{"$nulls":7},{"$f":"Hari_Pertama","v":"2025-06-01"},{"$f":"Hari_Pertama+1","v":"2025-06-02"},{"$f":"Hari_Pertama+2","v":"2025-06-03"},{"$f":"Hari_Pertama+3","v":"2025-06-04"},{"$f":"Hari_Pertama+4","v":"2025-06-05"},{"$f":"Hari_Pertama+5","v":"2025-06-06"},{"$f":"Hari_Pertama+6","v":"2025-06-07"},"Lembur Mgg 1",{"$f":"Hari_Pertama+7","v":"2025-06-08"},{"$f":"Hari_Pertama+8","v":"2025-06-09"},{"$f":"Hari_Pertama+9","v":"2025-06-10"},{"$f":"Hari_Pertama+10","v":"2025-06-11"},{"$f":"Hari_Pertama+11","v":"2025-06-12"},{"$f":"Hari_Pertama+12","v":"2025-06-13"},{"$f":"Hari_Pertama+13","v":"2025-06-14"},"Lembur Mgg 2","Total Lembur","Kode\nJam Lembur"]
[null,"Tugas","Lok","No. Perintah Kerja","Deskripsi Pekerjaan","Jabatan","No. Jabatan",{"$f":"VLOOKUP(WEEKDAY(Hari_Pertama),Pencarian_Hari_Kerja!$B$2:$C$8,2)","v":"Min"},{"$f":"VLOOKUP(WEEKDAY(I24),Pencarian_Hari_Kerja!$B$2:$C$8,2)","v":"Sen"},{"$f":"VLOOKUP(WEEKDAY(J24),Pencarian_Hari_Kerja!$B$2:$C$8,2)","v":"Sel"},{"$f":"VLOOKUP(WEEKDAY(K24),Pencarian_Hari_Kerja!$B$2:$C$8,2)","v":"Rab"},{"$f":"VLOOKUP(WEEKDAY(L24),Pencarian_Hari_Kerja!$B$2:$C$8,2)","v":"Kam"},{"$f":"VLOOKUP(WEEKDAY(M24),Pencarian_Hari_Kerja!$B$2:$C$8,2)","v":"Jum"},{"$f":"VLOOKUP(WEEKDAY(N24),Pencarian_Hari_Kerja!$B$2:$C$8,2)","v":"Sab"},null,{"$f":"VLOOKUP(WEEKDAY(P24),Pencarian_Hari_Kerja!$B$2:$C$8,2)","v":"Min"},{"$f":"VLOOKUP(WEEKDAY(Q24),Pencarian_Hari_Kerja!$B$2:$C$8,2)","v":"Sen"},{"$f":"VLOOKUP(WEEKDAY(R24),Pencarian_Hari_Kerja!$B$2:$C$8,2)","v":"Sel"},{"$f":"VLOOKUP(WEEKDAY(S24),Pencarian_Hari_Kerja!$B$2:$C$8,2)","v":"Rab"},{"$f":"VLOOKUP(WEEKDAY(T24),Pencarian_Hari_Kerja!$B$2:$C$8,2)","v":"Kam"},{"$f":"VLOOKUP(WEEKDAY(U24),Pencarian_Hari_Kerja!$B$2:$C$8,2)","v":"Jum"},{"$f":"VLOOKUP(WEEKDAY(V24),Pencarian_Hari_Kerja!$B$2:$C$8,2)","v":"Sab"}]
[{"$nulls":14},{"$f":"SUM(H26:N26)","v":{"v":0,"d":"0.00"}},{"$nulls":7},{"$f":"SUM(P26:V26)","v":{"v":0,"d":"0.00"}},{"$f":"O26+W26","v":{"v":0,"d":"0.00"}}]
[{"$nulls":14},{"v":0,"d":"0.00"},{"$nulls":7},{"v":0,"d":"0.00"},{"v":0,"d":"0.00"}]
[{"$nulls":14},{"v":0,"d":"0.00"},{"$nulls":7},{"v":0,"d":"0.00"},{"v":0,"d":"0.00"}]
[{"$nulls":14},{"v":0,"d":"0.00"},{"$nulls":7},{"v":0,"d":"0.00"},{"v":0,"d":"0.00"}]
[{"$nulls":14},{"v":0,"d":"0.00"},{"$nulls":7},{"v":0,"d":"0.00"},{"v":0,"d":"0.00"}]
[{"$nulls":14},{"v":0,"d":"0.00"},{"$nulls":7},{"v":0,"d":"0.00"},{"v":0,"d":"0.00"}]
[{"$nulls":14},{"v":0,"d":"0.00"},{"$nulls":7},{"v":0,"d":"0.00"},{"v":0,"d":"0.00"}]
[null,"Total Jam Lembur     ",{"$nulls":5},{"$f":"SUM(H26:H32)","v":{"v":0,"d":"0.00"}},{"v":0,"d":"0.00"},{"v":0,"d":"0.00"},{"v":0,"d":"0.00"},{"v":0,"d":"0.00"},{"v":0,"d":"0.00"},{"v":0,"d":"0.00"},{"$f":"SUM(O26:O32)","v":{"v":0,"d":"0.00"}},{"v":0,"d":"0.00"},{"v":0,"d":"0.00"},{"v":0,"d":"0.00"},{"v":0,"d":"0.00"},{"v":0,"d":"0.00"},{"v":0,"d":"0.00"},{"v":0,"d":"0.00"},{"$f":"SUM(P33:V33)","v":{"v":0,"d":"0.00"}},{"$f":"SUM(X26:X32)","v":{"v":0,"d":"0.00"}},"Total\nJam\nKerja","Total\nJam\nDibayar"]
[null,"Kompensasi Jam Lembur     ",{"$nulls":12},{"$f":"IF(SUM(H34:N34)<=O33,SUM(H34:N34),O33)","v":{"v":0,"d":"0.00"}},{"$nulls":7},{"$f":"IF(SUM(P34:V34)<=W33,SUM(P34:V34),W33)","v":{"v":0,"d":"0.00"}},{"$f":"IF(SUM(Q34:W34)<=X33,SUM(Q34:W34),X33)","v":{"v":0,"d":"0.00"}}]
[null,"Jam Lembur Dibayar     ",{"$nulls":5},{"$f":"IF(H33>=H34,H33-H34,H33)","v":{"v":0,"d":"0.00"}},{"$f":"IF(I33>=I34,I33-I34,I33)","v":{"v":0,"d":"0.00"}},{"v":0,"d":"0.00"},{"v":0,"d":"0.00"},{"v":0,"d":"0.00"},{"v":0,"d":"0.00"},{"v":0,"d":"0.00"},{"v":0,"d":"0.00"},{"v":0,"d":"0.00"},{"v":0,"d":"0.00"},{"v":0,"d":"0.00"},{"v":0,"d":"0.00"},{"v":0,"d":"0.00"},{"v":0,"d":"0.00"},{"v":0,"d":"0.00"},{"$f":"IF(W33>=W34,W33-W34,W33)","v":{"v":0,"d":"0.00"}},{"$f":"IF(X33>=X34,X33-X34,X33)","v":{"v":0,"d":"0.00"}},{"$f":"$X$22+$X$33","v":{"v":0,"d":"0.00"}},{"$f":"X22+X35","v":{"v":0,"d":"0.00"}}]
[null,"Karyawan ",{"$nulls":4},"Pengawas ",{"$nulls":8},"Pengawas "]

{"sheet":"Pencarian_Hari_Kerja","index":1,"n_rows":8,"n_cols":3,"rows_kept":8}
[null,"Angka\nHari kerja","Inisial\nHari kerja"]
[null,1,"Min"]
[null,2,"Sen"]
[null,3,"Sel"]
[null,4,"Rab"]
[null,5,"Kam"]
[null,6,"Jum"]
[null,7,"Sab"]