{"text_format":"3","workbook":"xlsx","n_sheets":4,"sheets":["Kezdés","PROJEKT PARAMÉTEREI","PROJEKTADATOK","PROJEKT ÖSSZESÍTÉSE"],"not_rendered":{"charts":2,"defined_names":3,"pivot_tables":1},"read":"whole","date_system":"1900"}

{"sheet":"Kezdés","index":0,"n_rows":8,"n_cols":2,"rows_kept":8}
[null,"A SABLON ISMERTETÉSE"]
[]
[null,"Ezzel a munkafüzettel nyomon követheti a projekt paraméterei, projektadatok és projekt összesítése a jogi Projekttervezés jogi cégeknek."]
[null,"Ha megadja a cég neve a Projekt paraméterei munkalapon, az a többi munkalapon automatikusan frissül."]
[null,"Adja meg az adatokat a Projekt paraméterei munkalapon az oszlopdiagramok frissítéséhez, és adja meg az adatokat a Projekt adatok munkalapon. A Projekt összesítése munkalapon található kimutatás automatikusan frissül."]
[null,"Megjegyzés:  "]
{"$rows_left_out":3}
{"sheet":"PROJEKT PARAMÉTEREI","index":1,"n_rows":19,"n_cols":9,"rows_kept":19}
["Ezen a munkalapon a projekt paraméterei adhatja meg. A jobbra lévő cellában adhatja meg a cég nevét. Ebben az oszlopban hasznos utasítások szerepelnek.","Cég neve"]
["A jobbra lévő cellában szerepel a munkalap címe.","Projekttervezés jogi cégeknek"]
["A jobbra lévő cellában a bizalmasságra vonatkozó üzenet található.",{"$f":"B1&\" – Bizalmas\"","v":"Cég neve – Bizalmas"}]
["A jobbra lévő cellában egy tipp szerepel.","Az árnyékolt cellák értékét a sablon kiszámítja Ön helyett. Ezekbe nem kell írnia semmit."]
["A jobbra lévő cellában kezdődő Paraméterek táblázatban adhatja meg az adatokat. A következő utasítás az A12 cellában található.","PROJEKT TÍPUSA","ÁLTALÁNOS PARTNER","CÉGES JOGÁSZ","VÉDŐÜGYVÉD","SZELL. TUL. VÉDELMÉT ELLÁTÓ JOGÁSZ","CSŐDELJÁRÁSI JOGÁSZ","ADMINISZTRÁCIÓS SZEMÉLYZET","ÖSSZEG"]
[null,"Cégalapítás",{"v":0.1,"d":"10%"},{"v":0.4,"d":"40%"},{"v":0,"d":"0%"},{"v":0,"d":"0%"},{"v":0,"d":"0%"},{"v":0.5,"d":"50%"},{"$f":"SUM(Paraméterek[[#This Row],[ÁLTALÁNOS PARTNER]:[ADMINISZTRÁCIÓS SZEMÉLYZET]])","v":{"v":1,"d":"100%"}}]
{"$rows_left_out":14}
{"sheet":"PROJEKTADATOK","index":2,"n_rows":10,"n_cols":25,"rows_kept":10,"merged":[[1,24,8,28]]}
["Ezen a munkalapon adhatja meg a projekt adatok. A jobbra lévő cellában automatikusan frissül a cég neve. Ebben az oszlopban hasznos utasítások szerepelnek. Első lépésként nyomja le a Le nyílbillentyűt.",{"$f":"'PROJEKT PARAMÉTEREI'!B1","v":"Cég neve"}]
["A jobbra lévő cellában a munkalap címe, az Y2 cellában pedig egy tájékoztató tipp szerepel.",{"$f":"'PROJEKT PARAMÉTEREI'!B2","v":"Projekttervezés jogi cégeknek"},{"$nulls":22},"INFORMÁCIÓ:\nHa fel szeretne venni egy sort, jelölje ki a jobb alsó cellát a táblázat törzsében (nem a végösszegek sorában), és nyomja le a Tab billentyűt, vagy nyomja le a SHIFT+F10 billentyűkombinációt a táblázaton belül ott, ahová be szeretné szúrni a sort, és válassza a Beszúrás | Táblázatsorok felülre/alulra lehetőséget.\nÜgyeljen arra, hogy minden nem használt sort töröljön, mert a PROJEKT ÖSSZESÍTÉSE kimutatás a táblázatcellák mindegyikét használni fogja, és ha nem törli a nem használt sorokat, az hibás eredményekhez vezet."]
["A jobbra lévő cellában a bizalmasságra vonatkozó üzenet található.",{"$f":"'PROJEKT PARAMÉTEREI'!B3","v":"Cég neve – Bizalmas"}]
["A jobbra lévő cellában kezdődő Adatok táblázatban adhatja meg az adatok. A jobbra lévő, adatokat tartalmazó táblázatban szereplő projekttípusok automatikusan frissülnek a Projekt paraméterei munkalap paramétereket tartalmazó táblázatának adatai alapján.","PROJEKT NEVE","PROJEKT TÍPUSA","BECSÜLT KEZDÉS","BECSÜLT BEFEJEZÉS","TÉNYLEGES KEZDÉS","TÉNYLEGES BEFEJEZÉS","BECSÜLT MUNKA","TÉNYLEGES MUNKA","BECSÜLT IDŐTARTAM","TÉNYLEGES IDŐTARTAM","ÁLTALÁNOS PARTNER","CÉGES JOGÁSZ","VÉDŐÜGYVÉD","SZELL. TUL. VÉDELMÉT ELLÁTÓ JOGÁSZ","CSŐDELJÁRÁSI JOGÁSZ","ADMINISZTRÁCIÓS SZEMÉLYZET","2. ÁLTALÁNOS PARTNER","2. CÉGES JOGÁSZ","2. VÉDŐÜGYVÉD","2. SZELL. TUL. VÉDELMÉT ELLÁTÓ JOGÁSZ","2. CSŐDELJÁRÁSI JOGÁSZ","2. ADMINISZTRÁCIÓS SZEMÉLYZET"]
[null,"1. projekt","Cégalapítás",{"$f":"TODAY()","v":"2019-02-19"},{"$f":"TODAY()+60","v":"2019-04-20"},{"$f":"TODAY()+10","v":"2019-03-01"},{"$f":"TODAY()+65","v":"2019-04-25"},200,220,{"$f":"DAYS360(Adatok[[#This Row],[BECSÜLT KEZDÉS]],Adatok[[#This Row],[BECSÜLT BEFEJEZÉS]],FALSE)","v":61},{"$f":"DAYS360(Adatok[[#This Row],[TÉNYLEGES KEZDÉS]],Adatok[[#This Row],[TÉNYLEGES BEFEJEZÉS]],FALSE)","v":54},{"$f":"INDEX(Paraméterek[],MATCH(Adatok[[#This Row],[PROJEKT TÍPUSA]],Paraméterek[PROJEKT TÍPUSA],0),MATCH(Adatok[[#Headers],[ÁLTALÁNOS PARTNER]],Paraméterek[#Headers],0))*INDEX('PROJEKT PARAMÉTEREI'!$B$12:$H$12,1,MATCH(Adatok[[#Headers],[ÁLTALÁNOS PARTNER]],Paraméterek[#Headers],0))*Adatok[[#This Row],[BECSÜLT MUNKA]]","v":{"v":7000,"d":"7,000 Ft"}},{"$f":"INDEX(Paraméterek[],MATCH(Adatok[[#This Row],[PROJEKT TÍPUSA]],Paraméterek[PROJEKT TÍPUSA],0),MATCH(Adatok[[#Headers],[CÉGES JOGÁSZ]],Paraméterek[#Headers],0))*INDEX('PROJEKT PARAMÉTEREI'!$B$12:$H$12,1,MATCH(Adatok[[#Headers],[CÉGES JOGÁSZ]],Paraméterek[#Headers],0))*Adatok[[#This Row],[BECSÜLT MUNKA]]","v":{"v":20000,"d":"20,000 Ft"}},{"$f":"INDEX(Paraméterek[],MATCH(Adatok[[#This Row],[PROJEKT TÍPUSA]],Paraméterek[PROJEKT TÍPUSA],0),MATCH(Adatok[[#Headers],[VÉDŐÜGYVÉD]],Paraméterek[#Headers],0))*INDEX('PROJEKT PARAMÉTEREI'!$B$12:$H$12,1,MATCH(Adatok[[#Headers],[VÉDŐÜGYVÉD]],Paraméterek[#Headers],0))*Adatok[[#This Row],[BECSÜLT MUNKA]]","v":{"v":0,"d":"0 Ft"}},{"$f":"INDEX(Paraméterek[],MATCH(Adatok[[#This Row],[PROJEKT TÍPUSA]],Paraméterek[PROJEKT TÍPUSA],0),MATCH(Adatok[[#Headers],[SZELL. TUL. VÉDELMÉT ELLÁTÓ JOGÁSZ]],Paraméterek[#Headers],0))*INDEX('PROJEKT PARAMÉTEREI'!$B$12:$H$12,1,MATCH(Adatok[[#Headers],[SZELL. TUL. VÉDELMÉT ELLÁTÓ JOGÁSZ]],Paraméterek[#Headers],0))*Adatok[[#This Row],[BECSÜLT MUNKA]]","v":{"v":0,"d":"0 Ft"}},{"$f":"INDEX(Paraméterek[],MATCH(Adatok[[#This Row],[PROJEKT TÍPUSA]],Paraméterek[PROJEKT TÍPUSA],0),MATCH(Adatok[[#Headers],[CSŐDELJÁRÁSI JOGÁSZ]],Paraméterek[#Headers],0))*INDEX('PROJEKT PARAMÉTEREI'!$B$12:$H$12,1,MATCH(Adatok[[#Headers],[CSŐDELJÁRÁSI JOGÁSZ]],Paraméterek[#Headers],0))*Adatok[[#This Row],[BECSÜLT MUNKA]]","v":{"v":0,"d":"0 Ft"}},{"$f":"INDEX(Paraméterek[],MATCH(Adatok[[#This Row],[PROJEKT TÍPUSA]],Paraméterek[PROJEKT TÍPUSA],0),MATCH(Adatok[[#Headers],[ADMINISZTRÁCIÓS SZEMÉLYZET]],Paraméterek[#Headers],0))*INDEX('PROJEKT PARAMÉTEREI'!$B$12:$H$12,1,MATCH(Adatok[[#Headers],[ADMINISZTRÁCIÓS SZEMÉLYZET]],Paraméterek[#Headers],0))*Adatok[[#This Row],[BECSÜLT MUNKA]]","v":{"v":12500,"d":"12,500 Ft"}},{"$f":"INDEX(Paraméterek[],MATCH(Adatok[[#This Row],[PROJEKT TÍPUSA]],Paraméterek[PROJEKT TÍPUSA],0),MATCH(Adatok[[#Headers],[ÁLTALÁNOS PARTNER]],Paraméterek[#Headers],0))*INDEX('PROJEKT PARAMÉTEREI'!$B$12:$H$12,1,MATCH(Adatok[[#Headers],[ÁLTALÁNOS PARTNER]],Paraméterek[#Headers],0))*Adatok[[#This Row],[TÉNYLEGES MUNKA]]","v":{"v":7700,"d":"7,700 Ft"}},{"$f":"INDEX(Paraméterek[],MATCH(Adatok[[#This Row],[PROJEKT TÍPUSA]],Paraméterek[PROJEKT TÍPUSA],0),MATCH(Adatok[[#Headers],[CÉGES JOGÁSZ]],Paraméterek[#Headers],0))*INDEX('PROJEKT PARAMÉTEREI'!$B$12:$H$12,1,MATCH(Adatok[[#Headers],[CÉGES JOGÁSZ]],Paraméterek[#Headers],0))*Adatok[[#This Row],[TÉNYLEGES MUNKA]]","v":{"v":22000,"d":"22,000 Ft"}},{"$f":"INDEX(Paraméterek[],MATCH(Adatok[[#This Row],[PROJEKT TÍPUSA]],Paraméterek[PROJEKT TÍPUSA],0),MATCH(Adatok[[#Headers],[VÉDŐÜGYVÉD]],Paraméterek[#Headers],0))*INDEX('PROJEKT PARAMÉTEREI'!$B$12:$H$12,1,MATCH(Adatok[[#Headers],[VÉDŐÜGYVÉD]],Paraméterek[#Headers],0))*Adatok[[#This Row],[TÉNYLEGES MUNKA]]","v":{"v":0,"d":"0 Ft"}},{"$f":"INDEX(Paraméterek[],MATCH(Adatok[[#This Row],[PROJEKT TÍPUSA]],Paraméterek[PROJEKT TÍPUSA],0),MATCH(Adatok[[#Headers],[SZELL. TUL. VÉDELMÉT ELLÁTÓ JOGÁSZ]],Paraméterek[#Headers],0))*INDEX('PROJEKT PARAMÉTEREI'!$B$12:$H$12,1,MATCH(Adatok[[#Headers],[SZELL. TUL. VÉDELMÉT ELLÁTÓ JOGÁSZ]],Paraméterek[#Headers],0))*Adatok[[#This Row],[TÉNYLEGES MUNKA]]","v":{"v":0,"d":"0 Ft"}},{"$f":"INDEX(Paraméterek[],MATCH(Adatok[[#This Row],[PROJEKT TÍPUSA]],Paraméterek[PROJEKT TÍPUSA],0),MATCH(Adatok[[#Headers],[CSŐDELJÁRÁSI JOGÁSZ]],Paraméterek[#Headers],0))*INDEX('PROJEKT PARAMÉTEREI'!$B$12:$H$12,1,MATCH(Adatok[[#Headers],[CSŐDELJÁRÁSI JOGÁSZ]],Paraméterek[#Headers],0))*Adatok[[#This Row],[TÉNYLEGES MUNKA]]","v":{"v":0,"d":"0 Ft"}},{"$f":"INDEX(Paraméterek[],MATCH(Adatok[[#This Row],[PROJEKT TÍPUSA]],Paraméterek[PROJEKT TÍPUSA],0),MATCH(Adatok[[#Headers],[ADMINISZTRÁCIÓS SZEMÉLYZET]],Paraméterek[#Headers],0))*INDEX('PROJEKT PARAMÉTEREI'!$B$12:$H$12,1,MATCH(Adatok[[#Headers],[ADMINISZTRÁCIÓS SZEMÉLYZET]],Paraméterek[#Headers],0))*Adatok[[#This Row],[TÉNYLEGES MUNKA]]","v":{"v":13750,"d":"13,750 Ft"}}]
[null,"2. projekt","Cégvásárlás",{"$f":"TODAY()+30","v":"2019-03-21"},{"$f":"TODAY()+100","v":"2019-05-30"},{"$f":"TODAY()+40","v":"2019-03-31"},{"$f":"TODAY()+110","v":"2019-06-09"},400,390,{"$f":"DAYS360(Adatok[[#This Row],[BECSÜLT KEZDÉS]],Adatok[[#This Row],[BECSÜLT BEFEJEZÉS]],FALSE)","v":69},{"$f":"DAYS360(Adatok[[#This Row],[TÉNYLEGES KEZDÉS]],Adatok[[#This Row],[TÉNYLEGES BEFEJEZÉS]],FALSE)","v":69},{"$f":"INDEX(Paraméterek[],MATCH(Adatok[[#This Row],[PROJEKT TÍPUSA]],Paraméterek[PROJEKT TÍPUSA],0),MATCH(Adatok[[#Headers],[ÁLTALÁNOS PARTNER]],Paraméterek[#Headers],0))*INDEX('PROJEKT PARAMÉTEREI'!$B$12:$H$12,1,MATCH(Adatok[[#Headers],[ÁLTALÁNOS PARTNER]],Paraméterek[#Headers],0))*Adatok[[#This Row],[BECSÜLT MUNKA]]","v":{"v":14000,"d":"14,000 Ft"}},{"$f":"INDEX(Paraméterek[],MATCH(Adatok[[#This Row],[PROJEKT TÍPUSA]],Paraméterek[PROJEKT TÍPUSA],0),MATCH(Adatok[[#Headers],[CÉGES JOGÁSZ]],Paraméterek[#Headers],0))*INDEX('PROJEKT PARAMÉTEREI'!$B$12:$H$12,1,MATCH(Adatok[[#Headers],[CÉGES JOGÁSZ]],Paraméterek[#Headers],0))*Adatok[[#This Row],[BECSÜLT MUNKA]]","v":{"v":40000,"d":"40,000 Ft"}},{"$f":"INDEX(Paraméterek[],MATCH(Adatok[[#This Row],[PROJEKT TÍPUSA]],Paraméterek[PROJEKT TÍPUSA],0),MATCH(Adatok[[#Headers],[VÉDŐÜGYVÉD]],Paraméterek[#Headers],0))*INDEX('PROJEKT PARAMÉTEREI'!$B$12:$H$12,1,MATCH(Adatok[[#Headers],[VÉDŐÜGYVÉD]],Paraméterek[#Headers],0))*Adatok[[#This Row],[BECSÜLT MUNKA]]","v":{"v":0,"d":"0 Ft"}},{"$f":"INDEX(Paraméterek[],MATCH(Adatok[[#This Row],[PROJEKT TÍPUSA]],Paraméterek[PROJEKT TÍPUSA],0),MATCH(Adatok[[#Headers],[SZELL. TUL. VÉDELMÉT ELLÁTÓ JOGÁSZ]],Paraméterek[#Headers],0))*INDEX('PROJEKT PARAMÉTEREI'!$B$12:$H$12,1,MATCH(Adatok[[#Headers],[SZELL. TUL. VÉDELMÉT ELLÁTÓ JOGÁSZ]],Paraméterek[#Headers],0))*Adatok[[#This Row],[BECSÜLT MUNKA]]","v":{"v":11000,"d":"11,000 Ft"}},{"$f":"INDEX(Paraméterek[],MATCH(Adatok[[#This Row],[PROJEKT TÍPUSA]],Paraméterek[PROJEKT TÍPUSA],0),MATCH(Adatok[[#Headers],[CSŐDELJÁRÁSI JOGÁSZ]],Paraméterek[#Headers],0))*INDEX('PROJEKT PARAMÉTEREI'!$B$12:$H$12,1,MATCH(Adatok[[#Headers],[CSŐDELJÁRÁSI JOGÁSZ]],Paraméterek[#Headers],0))*Adatok[[#This Row],[BECSÜLT MUNKA]]","v":{"v":0,"d":"0 Ft"}},{"$f":"INDEX(Paraméterek[],MATCH(Adatok[[#This Row],[PROJEKT TÍPUSA]],Paraméterek[PROJEKT TÍPUSA],0),MATCH(Adatok[[#Headers],[ADMINISZTRÁCIÓS SZEMÉLYZET]],Paraméterek[#Headers],0))*INDEX('PROJEKT PARAMÉTEREI'!$B$12:$H$12,1,MATCH(Adatok[[#Headers],[ADMINISZTRÁCIÓS SZEMÉLYZET]],Paraméterek[#Headers],0))*Adatok[[#This Row],[BECSÜLT MUNKA]]","v":{"v":20000,"d":"20,000 Ft"}},{"$f":"INDEX(Paraméterek[],MATCH(Adatok[[#This Row],[PROJEKT TÍPUSA]],Paraméterek[PROJEKT TÍPUSA],0),MATCH(Adatok[[#Headers],[ÁLTALÁNOS PARTNER]],Paraméterek[#Headers],0))*INDEX('PROJEKT PARAMÉTEREI'!$B$12:$H$12,1,MATCH(Adatok[[#Headers],[ÁLTALÁNOS PARTNER]],Paraméterek[#Headers],0))*Adatok[[#This Row],[TÉNYLEGES MUNKA]]","v":{"v":13650,"d":"13,650 Ft"}},{"$f":"INDEX(Paraméterek[],MATCH(Adatok[[#This Row],[PROJEKT TÍPUSA]],Paraméterek[PROJEKT TÍPUSA],0),MATCH(Adatok[[#Headers],[CÉGES JOGÁSZ]],Paraméterek[#Headers],0))*INDEX('PROJEKT PARAMÉTEREI'!$B$12:$H$12,1,MATCH(Adatok[[#Headers],[CÉGES JOGÁSZ]],Paraméterek[#Headers],0))*Adatok[[#This Row],[TÉNYLEGES MUNKA]]","v":{"v":39000,"d":"39,000 Ft"}},{"$f":"INDEX(Paraméterek[],MATCH(Adatok[[#This Row],[PROJEKT TÍPUSA]],Paraméterek[PROJEKT TÍPUSA],0),MATCH(Adatok[[#Headers],[VÉDŐÜGYVÉD]],Paraméterek[#Headers],0))*INDEX('PROJEKT PARAMÉTEREI'!$B$12:$H$12,1,MATCH(Adatok[[#Headers],[VÉDŐÜGYVÉD]],Paraméterek[#Headers],0))*Adatok[[#This Row],[TÉNYLEGES MUNKA]]","v":{"v":0,"d":"0 Ft"}},{"$f":"INDEX(Paraméterek[],MATCH(Adatok[[#This Row],[PROJEKT TÍPUSA]],Paraméterek[PROJEKT TÍPUSA],0),MATCH(Adatok[[#Headers],[SZELL. TUL. VÉDELMÉT ELLÁTÓ JOGÁSZ]],Paraméterek[#Headers],0))*INDEX('PROJEKT PARAMÉTEREI'!$B$12:$H$12,1,MATCH(Adatok[[#Headers],[SZELL. TUL. VÉDELMÉT ELLÁTÓ JOGÁSZ]],Paraméterek[#Headers],0))*Adatok[[#This Row],[TÉNYLEGES MUNKA]]","v":{"v":10725,"d":"10,725 Ft"}},{"$f":"INDEX(Paraméterek[],MATCH(Adatok[[#This Row],[PROJEKT TÍPUSA]],Paraméterek[PROJEKT TÍPUSA],0),MATCH(Adatok[[#Headers],[CSŐDELJÁRÁSI JOGÁSZ]],Paraméterek[#Headers],0))*INDEX('PROJEKT PARAMÉTEREI'!$B$12:$H$12,1,MATCH(Adatok[[#Headers],[CSŐDELJÁRÁSI JOGÁSZ]],Paraméterek[#Headers],0))*Adatok[[#This Row],[TÉNYLEGES MUNKA]]","v":{"v":0,"d":"0 Ft"}},{"$f":"INDEX(Paraméterek[],MATCH(Adatok[[#This Row],[PROJEKT TÍPUSA]],Paraméterek[PROJEKT TÍPUSA],0),MATCH(Adatok[[#Headers],[ADMINISZTRÁCIÓS SZEMÉLYZET]],Paraméterek[#Headers],0))*INDEX('PROJEKT PARAMÉTEREI'!$B$12:$H$12,1,MATCH(Adatok[[#Headers],[ADMINISZTRÁCIÓS SZEMÉLYZET]],Paraméterek[#Headers],0))*Adatok[[#This Row],[TÉNYLEGES MUNKA]]","v":{"v":19500,"d":"19,500 Ft"}}]
{"$rows_left_out":5}
{"sheet":"PROJEKT ÖSSZESÍTÉSE","index":3,"n_rows":11,"n_cols":16,"rows_kept":11,"merged":[[3,2,3,7],[3,8,3,13],[3,15,14,19]]}
["Ezen a munkalapon szerepelnek a projekt összesítése. A jobbra lévő cellában automatikusan frissül a cég neve. Ebben az oszlopban hasznos utasítások szerepelnek. Első lépésként nyomja le a Le nyílbillentyűt.",{"$f":"'PROJEKT PARAMÉTEREI'!B1","v":"Cég neve"}]
["A jobbra lévő cellában szerepel a munkalap címe.",{"$f":"'PROJEKT PARAMÉTEREI'!B2","v":"Projekttervezés jogi cégeknek"}]
["A jobbra lévő cellában a bizalmasságra vonatkozó üzenet található.",{"$f":"'PROJEKT PARAMÉTEREI'!B3","v":"Cég neve – Bizalmas"}]
["A C4 cellában a Becsült felirat, az I4 cellában a Tényleges felirat, a P4 cellában pedig egy tájékoztató tipp szerepel.",null,"BECSÜLT",{"$nulls":5},"TÉNYLEGES",{"$nulls":6},"INFORMÁCIÓ: \nEz a kimutatás nem frissül automatikusan.  Ha frissíteni szeretné, jelölje ki (a kimutatásban bármelyik cellát), és a KIMUTATÁSESZKÖZÖK | ELEMZÉS menüszalaglapon válassza a Frissítés elemet.  Vagy jelölje ki a kimutatást, nyomja le a SHIFT+F10 billentyűparancsot, és válassza a Frissítés elemet."]
["A jobbra lévő cellában kezdődő kimutatás automatikusan frissül.","PROJEKT NEVE","ÁLTALÁNOS PARTNER ","CÉGES ","VÉDŐÜGYVÉD ","SZELLEMI TULAJDON ","CSŐD ","ADMINISZTRÁCIÓS SZEMÉLYZET ","ÁLTALÁNOS PARTNER  ","CÉGES","VÉDŐÜGYVÉD  ","CSŐD","SZELLEMI TULAJDON","ADMINISZTRÁCIÓS SZEMÉLYZET  "]
[null,"1. projekt",{"v":7000,"d":"7,000.00 Ft"},{"v":20000,"d":"20,000.00 Ft"},{"v":0,"d":"0.00 Ft"},{"v":0,"d":"0.00 Ft"},{"v":0,"d":"0.00 Ft"},{"v":12500,"d":"12,500.00 Ft"},{"v":7700,"d":"7,700.00 Ft"},{"v":22000,"d":"22,000.00 Ft"},{"v":0,"d":"0.00 Ft"},{"v":0,"d":"0.00 Ft"},{"v":0,"d":"0.00 Ft"},{"v":13750,"d":"13,750.00 Ft"}]
{"$rows_left_out":5}