{"text_format":"3","workbook":"xlsx","n_sheets":4,"sheets":["Pontszámkövető","Saját teljesítmény","Beállítások","Számítások"],"not_rendered":{"defined_names":3,"comments":1},"read":"whole","date_system":"1900"}

{"sheet":"Pontszámkövető","index":0,"n_rows":14,"n_cols":6,"rows_kept":14}
[null,"Ide írja a pontszámait"]
[]
[null,null,"Tantárgy","Típus","Leírás","Pontszám"]
[null,null,"Modern francia","Házi feladat","A II. világháború története",{"v":0.8,"d":"80%"}]
[null,null,"Haladó Java-programozás","Zárthelyi",null,{"v":0.75,"d":"75%"}]
[null,null,"Spanyol","Házi feladat",null,{"v":0.5,"d":"50%"}]
[null,null,"Elméleti fizika","Házi feladat",null,{"v":0.95,"d":"95%"}]
[null,null,"Modern francia","Házi feladat","Az I. világháború története",{"v":0.9,"d":"90%"}]
[null,null,"Modern francia","Házi feladat","30–41. oldal",{"v":0.8,"d":"80%"}]
[null,null,"Fogalmazás","Dolgozat","Vita",{"v":0.95,"d":"95%"}]
[null,null,"Matematika 1","Házi feladat","21. és 26. oldal",{"v":0.8,"d":"80%"}]
[null,null,"Matematika 2","Házi feladat","15. és 18. oldal",{"v":0.85,"d":"85%"}]
[null,null,"Matematika 1","Házi feladat","34–36. oldal",{"v":0.8,"d":"80%"}]
[null,null,"Matematika 2","Teszt",null,{"v":0.95,"d":"95%"}]

{"sheet":"Saját teljesítmény","index":1,"n_rows":31,"n_cols":8,"rows_kept":31}
[null,"Saját teljesítmény"]
[]
[null,null,"Összesen"]
[null,null,{"$f":"\"Naponta: \"&SUM(táblázatTantárgyak[Kreditóraszám])","v":"Naponta: 24"},{"$f":"AVERAGE(D7:D31)","v":{"v":0.8104761904761906,"d":"81%"}},{"$f":"AVERAGE(E7:E31)","v":{"v":2.7142857142857144,"d":"2.71"}},{"$f":"SUM(F7:F31)","v":{"v":2.625,"d":"2.63"}},{"$f":"IFERROR(HLOOKUP(D4,listaÁtlagMegfeleltetés,2),\"\")","v":"B-"}]
[]
[null,null,"Tantárgyak","%","Átlag","S. átlag","Betűvel","Általános teljesítmény"]
[null,null,{"$f":"Számítások!C6","v":"Modern francia"},{"$f":"Számítások!AL6","v":{"v":0.8333333333333334,"d":"83%"}},{"$f":"Számítások!AM6","v":{"v":3,"d":"3.00"}},{"$f":"IFERROR(E7*Beállítások!D9/SUM(táblázatTantárgyak[Kreditóraszám]),\"\")","v":{"v":0.375,"d":"0.38"}},{"$f":"Számítások!AN6","v":"B"}]
[null,null,{"$f":"Számítások!C7","v":"Elméleti fizika"},{"$f":"Számítások!AL7","v":{"v":0.95,"d":"95%"}},{"$f":"Számítások!AM7","v":{"v":4,"d":"4.00"}},{"$f":"IFERROR(E8*Beállítások!D10/SUM(táblázatTantárgyak[Kreditóraszám]),\"\")","v":{"v":0.5,"d":"0.50"}},{"$f":"Számítások!AN7","v":"A"}]
[null,null,{"$f":"Számítások!C8","v":"Matematika 1"},{"$f":"Számítások!AL8","v":{"v":0.8000000000000002,"d":"80%"}},{"$f":"Számítások!AM8","v":2.67},{"$f":"IFERROR(E9*Beállítások!D11/SUM(táblázatTantárgyak[Kreditóraszám]),\"\")","v":{"v":0.445,"d":"0.45"}},{"$f":"Számítások!AN8","v":"B-"}]
[null,null,{"$f":"Számítások!C9","v":"Matematika 2"},{"$f":"Számítások!AL9","v":{"v":0.89,"d":"89%"}},{"$f":"Számítások!AM9","v":3.33},{"$f":"IFERROR(E10*Beállítások!D12/SUM(táblázatTantárgyak[Kreditóraszám]),\"\")","v":{"v":0.555,"d":"0.56"}},{"$f":"Számítások!AN9","v":"B+"}]
[null,null,{"$f":"Számítások!C10","v":"Haladó Java-programozás"},{"$f":"Számítások!AL10","v":{"v":0.7500000000000001,"d":"75%"}},{"$f":"Számítások!AM10","v":{"v":2,"d":"2.00"}},{"$f":"IFERROR(E11*Beállítások!D13/SUM(táblázatTantárgyak[Kreditóraszám]),\"\")","v":{"v":0.4166666666666667,"d":"0.42"}},{"$f":"Számítások!AN10","v":"C"}]
[null,null,{"$f":"Számítások!C11","v":"Spanyol"},{"$f":"Számítások!AL11","v":{"v":0.5,"d":"50%"}},{"$f":"Számítások!AM11","v":{"v":0,"d":"0.00"}},{"$f":"IFERROR(E12*Beállítások!D14/SUM(táblázatTantárgyak[Kreditóraszám]),\"\")","v":{"v":0,"d":"0.00"}},{"$f":"Számítások!AN11","v":"F"}]
[null,null,{"$f":"Számítások!C12","v":"Fogalmazás"},{"$f":"Számítások!AL12","v":{"v":0.95,"d":"95%"}},{"$f":"Számítások!AM12","v":{"v":4,"d":"4.00"}},{"$f":"IFERROR(E13*Beállítások!D15/SUM(táblázatTantárgyak[Kreditóraszám]),\"\")","v":{"v":0.3333333333333333,"d":"0.33"}},{"$f":"Számítások!AN12","v":"A"}]
[null,null,{"$f":"Számítások!C13","v":""},{"$f":"Számítások!AL13","v":""},{"$f":"Számítások!AM13","v":""},{"$f":"IFERROR(E14*Beállítások!D16/SUM(táblázatTantárgyak[Kreditóraszám]),\"\")","v":""},{"$f":"Számítások!AN13","v":""}]
[null,null,{"$f":"Számítások!C14","v":""},{"$f":"Számítások!AL14","v":""},{"$f":"Számítások!AM14","v":""},{"$f":"IFERROR(E15*Beállítások!D17/SUM(táblázatTantárgyak[Kreditóraszám]),\"\")","v":""},{"$f":"Számítások!AN14","v":""}]
{"$rows_left_out":17}
{"sheet":"Beállítások","index":2,"n_rows":15,"n_cols":16,"rows_kept":15,"merged":[[5,2,5,15]]}
[null,"Beállítások"]
[null,null,"Pontszámok és átlagok megfeleltetése"]
[null,null,"Százalék",{"v":0,"d":"0%"},{"v":0.6,"d":"60%"},{"v":0.63,"d":"63%"},{"v":0.67,"d":"67%"},{"v":0.7,"d":"70%"},{"v":0.73,"d":"73%"},{"v":0.77,"d":"77%"},{"v":0.8,"d":"80%"},{"v":0.83,"d":"83%"},{"v":0.87,"d":"87%"},{"v":0.9,"d":"90%"},{"v":0.93,"d":"93%"},{"v":0.97,"d":"97%"}]
[null,null,"Betűvel","F","D-","D","D+","C-","C","C+","B-","B","B+","A-","A","A+"]
[null,null,"Átlag",0,0.67,1,1.33,1.67,2,2.33,2.67,3,3.33,3.67,4,4]
[]
[null,null,"Maximum 25 tantárgy súlyozott pontszáma"]
[null,null,"Saját tantárgyak","Kreditóraszám","Házi feladat","Dolgozat","Teszt","Kiselőadás","Zárthelyi","Záróvizsga","Egyéb","% összesen"]
[null,null,"Modern francia",{"v":3,"d":"3.0"},{"v":0.1,"d":"10%"},{"v":0.15,"d":"15%"},{"v":0.15,"d":"15%"},{"v":0.1,"d":"10%"},{"v":0.2,"d":"20%"},{"v":0.3,"d":"30%"},null,{"$f":"SUM(táblázatTantárgyak[[#This Row],[Házi feladat]:[Egyéb]])","v":{"v":1,"d":"100%"}}]
[null,null,"Elméleti fizika",{"v":3,"d":"3.0"},{"v":0.15,"d":"15%"},{"v":0.15,"d":"15%"},{"v":0.1,"d":"10%"},{"v":0.1,"d":"10%"},{"v":0.15,"d":"15%"},{"v":0.3,"d":"30%"},{"v":0.05,"d":"5%"},{"$f":"SUM(táblázatTantárgyak[[#This Row],[Házi feladat]:[Egyéb]])","v":{"v":1,"d":"100%"}}]
[null,null,"Matematika 1",{"v":4,"d":"4.0"},{"v":0.1,"d":"10%"},{"v":0.15,"d":"15%"},{"v":0.15,"d":"15%"},{"v":0.1,"d":"10%"},{"v":0.2,"d":"20%"},{"v":0.3,"d":"30%"},null,{"$f":"SUM(táblázatTantárgyak[[#This Row],[Házi feladat]:[Egyéb]])","v":{"v":1,"d":"100%"}}]
[null,null,"Matematika 2",{"v":4,"d":"4.0"},{"v":0.15,"d":"15%"},{"v":0.15,"d":"15%"},{"v":0.1,"d":"10%"},{"v":0.1,"d":"10%"},{"v":0.15,"d":"15%"},{"v":0.3,"d":"30%"},{"v":0.05,"d":"5%"},{"$f":"SUM(táblázatTantárgyak[[#This Row],[Házi feladat]:[Egyéb]])","v":{"v":1,"d":"100%"}}]
[null,null,"Haladó Java-programozás",{"v":5,"d":"5.0"},{"v":0.15,"d":"15%"},{"v":0.15,"d":"15%"},{"v":0.1,"d":"10%"},{"v":0.1,"d":"10%"},{"v":0.2,"d":"20%"},{"v":0.3,"d":"30%"},null,{"$f":"SUM(táblázatTantárgyak[[#This Row],[Házi feladat]:[Egyéb]])","v":{"v":1,"d":"100%"}}]
[null,null,"Spanyol",{"v":3,"d":"3.0"},{"v":0.1,"d":"10%"},{"v":0.15,"d":"15%"},{"v":0.17,"d":"17%"},{"v":0.13,"d":"13%"},{"v":0.2,"d":"20%"},{"v":0.2,"d":"20%"},{"v":0.05,"d":"5%"},{"$f":"SUM(táblázatTantárgyak[[#This Row],[Házi feladat]:[Egyéb]])","v":{"v":1,"d":"100%"}}]
[null,null,"Fogalmazás",{"v":2,"d":"2.0"},{"v":0.15,"d":"15%"},{"v":0.15,"d":"15%"},{"v":0.12,"d":"12%"},{"v":0.15,"d":"15%"},{"v":0.15,"d":"15%"},{"v":0.25,"d":"25%"},{"v":0.03,"d":"3%"},{"$f":"SUM(táblázatTantárgyak[[#This Row],[Házi feladat]:[Egyéb]])","v":{"v":1,"d":"100%"}}]
{"$rows_left_out":1}
{"sheet":"Számítások","index":3,"n_rows":657,"n_cols":40,"rows_kept":657,"hidden":true}
[null,"Számítások"]
[null,null,"Ez a munkalap kiszámítja az osztályzatokat és az átlagot. Maradjon rejtve. A munkalap bármilyen módosítása hibát okoz."]
[]
[null,null,"Aktuális tantárgylista","Pontszám (összesen 1)",{"$nulls":24},"Osztályzatszámítás"]
[null,null,"Tantárgy",1,2,3,4,5,6,7,8,9,10,11,12,13,14,15,16,17,18,19,20,21,22,23,24,25,{"$f":"táblázatTantárgyak[[#Headers],[Házi feladat]]","v":"Házi feladat"},{"$f":"táblázatTantárgyak[[#Headers],[Dolgozat]]","v":"Dolgozat"},{"$f":"táblázatTantárgyak[[#Headers],[Teszt]]","v":"Teszt"},{"$f":"táblázatTantárgyak[[#Headers],[Kiselőadás]]","v":"Kiselőadás"},{"$f":"táblázatTantárgyak[[#Headers],[Zárthelyi]]","v":"Zárthelyi"},{"$f":"táblázatTantárgyak[[#Headers],[Záróvizsga]]","v":"Záróvizsga"},{"$f":"táblázatTantárgyak[[#Headers],[Egyéb]]","v":"Egyéb"},"Összesen","Elérhető összpontszám","Teljes %","Pontszám","Betűvel"]
[null,null,{"$f":"IF(Beállítások!C9=\"\",\"\",Beállítások!C9)","v":"Modern francia"},{"$f":"IFERROR(INDEX(táblázatOsztályPontszámok[],MATCH($C6:$C30&D$5:AB$5,Számítások!$C$33:$C$657,0),4),\"\")","v":{"v":0.8,"d":"80%"}},{"v":0.9,"d":"90%"},{"v":0.8,"d":"80%"},"","","","","","","","","","","","","","","","","","","","","","",{"$f":"IFERROR(AVERAGEIFS(táblázatOsztályPontszámok[Pontszám],táblázatOsztályPontszámok[Tantárgy],Számítások!$C6,táblázatOsztályPontszámok[Típus],Számítások!AC$5)*Beállítások!E9,\"\")","v":0.08333333333333334},{"$f":"IFERROR(AVERAGEIFS(táblázatOsztályPontszámok[Pontszám],táblázatOsztályPontszámok[Tantárgy],Számítások!$C6,táblázatOsztályPontszámok[Típus],Számítások!AD$5)*Beállítások!F9,\"\")","v":""},{"$f":"IFERROR(AVERAGEIFS(táblázatOsztályPontszámok[Pontszám],táblázatOsztályPontszámok[Tantárgy],Számítások!$C6,táblázatOsztályPontszámok[Típus],Számítások!AE$5)*Beállítások!G9,\"\")","v":""},{"$f":"IFERROR(AVERAGEIFS(táblázatOsztályPontszámok[Pontszám],táblázatOsztályPontszámok[Tantárgy],Számítások!$C6,táblázatOsztályPontszámok[Típus],Számítások!AF$5)*Beállítások!H9,\"\")","v":""},{"$f":"IFERROR(AVERAGEIFS(táblázatOsztályPontszámok[Pontszám],táblázatOsztályPontszámok[Tantárgy],Számítások!$C6,táblázatOsztályPontszámok[Típus],Számítások!AG$5)*Beállítások!I9,\"\")","v":""},{"$f":"IFERROR(AVERAGEIFS(táblázatOsztályPontszámok[Pontszám],táblázatOsztályPontszámok[Tantárgy],Számítások!$C6,táblázatOsztályPontszámok[Típus],Számítások!AH$5)*Beállítások!J9,\"\")","v":""},{"$f":"IFERROR(AVERAGEIFS(táblázatOsztályPontszámok[Pontszám],táblázatOsztályPontszámok[Tantárgy],Számítások!$C6,táblázatOsztályPontszámok[Típus],Számítások!AI$5)*Beállítások!K9,\"\")","v":""},{"$f":"SUM(AC6:AI6)","v":0.08333333333333334},{"$f":"SUMIFS(Beállítások!E9:K9,Számítások!AC6:AI6,\">0\")","v":0.1},{"$f":"IFERROR(AJ6/AK6,\"\")","v":{"v":0.8333333333333334,"d":"83%"}},{"$f":"IFERROR(HLOOKUP(AL6,listaÁtlagMegfeleltetés,3),\"\")","v":3},{"$f":"IFERROR(HLOOKUP(AL6,listaÁtlagMegfeleltetés,2),\"\")","v":"B"}]
[null,null,{"$f":"IF(Beállítások!C10=\"\",\"\",Beállítások!C10)","v":"Elméleti fizika"},{"v":0.95,"d":"95%"},"","","","","","","","","","","","","","","","","","","","","","","","",{"$f":"IFERROR(AVERAGEIFS(táblázatOsztályPontszámok[Pontszám],táblázatOsztályPontszámok[Tantárgy],Számítások!$C7,táblázatOsztályPontszámok[Típus],Számítások!AC$5)*Beállítások!E10,\"\")","v":0.1425},{"$f":"IFERROR(AVERAGEIFS(táblázatOsztályPontszámok[Pontszám],táblázatOsztályPontszámok[Tantárgy],Számítások!$C7,táblázatOsztályPontszámok[Típus],Számítások!AD$5)*Beállítások!F10,\"\")","v":""},{"$f":"IFERROR(AVERAGEIFS(táblázatOsztályPontszámok[Pontszám],táblázatOsztályPontszámok[Tantárgy],Számítások!$C7,táblázatOsztályPontszámok[Típus],Számítások!AE$5)*Beállítások!G10,\"\")","v":""},{"$f":"IFERROR(AVERAGEIFS(táblázatOsztályPontszámok[Pontszám],táblázatOsztályPontszámok[Tantárgy],Számítások!$C7,táblázatOsztályPontszámok[Típus],Számítások!AF$5)*Beállítások!H10,\"\")","v":""},{"$f":"IFERROR(AVERAGEIFS(táblázatOsztályPontszámok[Pontszám],táblázatOsztályPontszámok[Tantárgy],Számítások!$C7,táblázatOsztályPontszámok[Típus],Számítások!AG$5)*Beállítások!I10,\"\")","v":""},{"$f":"IFERROR(AVERAGEIFS(táblázatOsztályPontszámok[Pontszám],táblázatOsztályPontszámok[Tantárgy],Számítások!$C7,táblázatOsztályPontszámok[Típus],Számítások!AH$5)*Beállítások!J10,\"\")","v":""},{"$f":"IFERROR(AVERAGEIFS(táblázatOsztályPontszámok[Pontszám],táblázatOsztályPontszámok[Tantárgy],Számítások!$C7,táblázatOsztályPontszámok[Típus],Számítások!AI$5)*Beállítások!K10,\"\")","v":""},{"$f":"SUM(AC7:AI7)","v":0.1425},{"$f":"SUMIFS(Beállítások!E10:K10,Számítások!AC7:AI7,\">0\")","v":0.15},{"$f":"IFERROR(AJ7/AK7,\"\")","v":{"v":0.95,"d":"95%"}},4,"A"]
[null,null,{"$f":"IF(Beállítások!C11=\"\",\"\",Beállítások!C11)","v":"Matematika 1"},{"v":0.8,"d":"80%"},{"v":0.8,"d":"80%"},"","","","","","","","","","","","","","","","","","","","","","","",{"$f":"IFERROR(AVERAGEIFS(táblázatOsztályPontszámok[Pontszám],táblázatOsztályPontszámok[Tantárgy],Számítások!$C8,táblázatOsztályPontszámok[Típus],Számítások!AC$5)*Beállítások!E11,\"\")","v":0.08000000000000002},{"$f":"IFERROR(AVERAGEIFS(táblázatOsztályPontszámok[Pontszám],táblázatOsztályPontszámok[Tantárgy],Számítások!$C8,táblázatOsztályPontszámok[Típus],Számítások!AD$5)*Beállítások!F11,\"\")","v":""},{"$f":"IFERROR(AVERAGEIFS(táblázatOsztályPontszámok[Pontszám],táblázatOsztályPontszámok[Tantárgy],Számítások!$C8,táblázatOsztályPontszámok[Típus],Számítások!AE$5)*Beállítások!G11,\"\")","v":""},{"$f":"IFERROR(AVERAGEIFS(táblázatOsztályPontszámok[Pontszám],táblázatOsztályPontszámok[Tantárgy],Számítások!$C8,táblázatOsztályPontszámok[Típus],Számítások!AF$5)*Beállítások!H11,\"\")","v":""},{"$f":"IFERROR(AVERAGEIFS(táblázatOsztályPontszámok[Pontszám],táblázatOsztályPontszámok[Tantárgy],Számítások!$C8,táblázatOsztályPontszámok[Típus],Számítások!AG$5)*Beállítások!I11,\"\")","v":""},{"$f":"IFERROR(AVERAGEIFS(táblázatOsztályPontszámok[Pontszám],táblázatOsztályPontszámok[Tantárgy],Számítások!$C8,táblázatOsztályPontszámok[Típus],Számítások!AH$5)*Beállítások!J11,\"\")","v":""},{"$f":"IFERROR(AVERAGEIFS(táblázatOsztályPontszámok[Pontszám],táblázatOsztályPontszámok[Tantárgy],Számítások!$C8,táblázatOsztályPontszámok[Típus],Számítások!AI$5)*Beállítások!K11,\"\")","v":""},0.08000000000000002,{"$f":"SUMIFS(Beállítások!E11:K11,Számítások!AC8:AI8,\">0\")","v":0.1},{"v":0.8000000000000002,"d":"80%"},2.67,"B-"]
[null,null,{"$f":"IF(Beállítások!C12=\"\",\"\",Beállítások!C12)","v":"Matematika 2"},{"v":0.85,"d":"85%"},{"v":0.95,"d":"95%"},"","","","","","","","","","","","","","","","","","","","","","","",{"$f":"IFERROR(AVERAGEIFS(táblázatOsztályPontszámok[Pontszám],táblázatOsztályPontszámok[Tantárgy],Számítások!$C9,táblázatOsztályPontszámok[Típus],Számítások!AC$5)*Beállítások!E12,\"\")","v":0.1275},{"$f":"IFERROR(AVERAGEIFS(táblázatOsztályPontszámok[Pontszám],táblázatOsztályPontszámok[Tantárgy],Számítások!$C9,táblázatOsztályPontszámok[Típus],Számítások!AD$5)*Beállítások!F12,\"\")","v":""},{"$f":"IFERROR(AVERAGEIFS(táblázatOsztályPontszámok[Pontszám],táblázatOsztályPontszámok[Tantárgy],Számítások!$C9,táblázatOsztályPontszámok[Típus],Számítások!AE$5)*Beállítások!G12,\"\")","v":0.095},{"$f":"IFERROR(AVERAGEIFS(táblázatOsztályPontszámok[Pontszám],táblázatOsztályPontszámok[Tantárgy],Számítások!$C9,táblázatOsztályPontszámok[Típus],Számítások!AF$5)*Beállítások!H12,\"\")","v":""},{"$f":"IFERROR(AVERAGEIFS(táblázatOsztályPontszámok[Pontszám],táblázatOsztályPontszámok[Tantárgy],Számítások!$C9,táblázatOsztályPontszámok[Típus],Számítások!AG$5)*Beállítások!I12,\"\")","v":""},{"$f":"IFERROR(AVERAGEIFS(táblázatOsztályPontszámok[Pontszám],táblázatOsztályPontszámok[Tantárgy],Számítások!$C9,táblázatOsztályPontszámok[Típus],Számítások!AH$5)*Beállítások!J12,\"\")","v":""},{"$f":"IFERROR(AVERAGEIFS(táblázatOsztályPontszámok[Pontszám],táblázatOsztályPontszámok[Tantárgy],Számítások!$C9,táblázatOsztályPontszámok[Típus],Számítások!AI$5)*Beállítások!K12,\"\")","v":""},0.2225,{"$f":"SUMIFS(Beállítások!E12:K12,Számítások!AC9:AI9,\">0\")","v":0.25},{"v":0.89,"d":"89%"},3.33,"B+"]
[null,null,{"$f":"IF(Beállítások!C13=\"\",\"\",Beállítások!C13)","v":"Haladó Java-programozás"},{"v":0.75,"d":"75%"},"","","","","","","","","","","","","","","","","","","","","","","","",{"$f":"IFERROR(AVERAGEIFS(táblázatOsztályPontszámok[Pontszám],táblázatOsztályPontszámok[Tantárgy],Számítások!$C10,táblázatOsztályPontszámok[Típus],Számítások!AC$5)*Beállítások!E13,\"\")","v":""},{"$f":"IFERROR(AVERAGEIFS(táblázatOsztályPontszámok[Pontszám],táblázatOsztályPontszámok[Tantárgy],Számítások!$C10,táblázatOsztályPontszámok[Típus],Számítások!AD$5)*Beállítások!F13,\"\")","v":""},{"$f":"IFERROR(AVERAGEIFS(táblázatOsztályPontszámok[Pontszám],táblázatOsztályPontszámok[Tantárgy],Számítások!$C10,táblázatOsztályPontszámok[Típus],Számítások!AE$5)*Beállítások!G13,\"\")","v":""},{"$f":"IFERROR(AVERAGEIFS(táblázatOsztályPontszámok[Pontszám],táblázatOsztályPontszámok[Tantárgy],Számítások!$C10,táblázatOsztályPontszámok[Típus],Számítások!AF$5)*Beállítások!H13,\"\")","v":""},{"$f":"IFERROR(AVERAGEIFS(táblázatOsztályPontszámok[Pontszám],táblázatOsztályPontszámok[Tantárgy],Számítások!$C10,táblázatOsztályPontszámok[Típus],Számítások!AG$5)*Beállítások!I13,\"\")","v":0.15000000000000002},{"$f":"IFERROR(AVERAGEIFS(táblázatOsztályPontszámok[Pontszám],táblázatOsztályPontszámok[Tantárgy],Számítások!$C10,táblázatOsztályPontszámok[Típus],Számítások!AH$5)*Beállítások!J13,\"\")","v":""},{"$f":"IFERROR(AVERAGEIFS(táblázatOsztályPontszámok[Pontszám],táblázatOsztályPontszámok[Tantárgy],Számítások!$C10,táblázatOsztályPontszámok[Típus],Számítások!AI$5)*Beállítások!K13,\"\")","v":""},0.15000000000000002,{"$f":"SUMIFS(Beállítások!E13:K13,Számítások!AC10:AI10,\">0\")","v":0.2},{"v":0.7500000000000001,"d":"75%"},2,"C"]
[null,null,{"$f":"IF(Beállítások!C14=\"\",\"\",Beállítások!C14)","v":"Spanyol"},{"v":0.5,"d":"50%"},"","","","","","","","","","","","","","","","","","","","","","","","",{"$f":"IFERROR(AVERAGEIFS(táblázatOsztályPontszámok[Pontszám],táblázatOsztályPontszámok[Tantárgy],Számítások!$C11,táblázatOsztályPontszámok[Típus],Számítások!AC$5)*Beállítások!E14,\"\")","v":0.05},{"$f":"IFERROR(AVERAGEIFS(táblázatOsztályPontszámok[Pontszám],táblázatOsztályPontszámok[Tantárgy],Számítások!$C11,táblázatOsztályPontszámok[Típus],Számítások!AD$5)*Beállítások!F14,\"\")","v":""},{"$f":"IFERROR(AVERAGEIFS(táblázatOsztályPontszámok[Pontszám],táblázatOsztályPontszámok[Tantárgy],Számítások!$C11,táblázatOsztályPontszámok[Típus],Számítások!AE$5)*Beállítások!G14,\"\")","v":""},{"$f":"IFERROR(AVERAGEIFS(táblázatOsztályPontszámok[Pontszám],táblázatOsztályPontszámok[Tantárgy],Számítások!$C11,táblázatOsztályPontszámok[Típus],Számítások!AF$5)*Beállítások!H14,\"\")","v":""},{"$f":"IFERROR(AVERAGEIFS(táblázatOsztályPontszámok[Pontszám],táblázatOsztályPontszámok[Tantárgy],Számítások!$C11,táblázatOsztályPontszámok[Típus],Számítások!AG$5)*Beállítások!I14,\"\")","v":""},{"$f":"IFERROR(AVERAGEIFS(táblázatOsztályPontszámok[Pontszám],táblázatOsztályPontszámok[Tantárgy],Számítások!$C11,táblázatOsztályPontszámok[Típus],Számítások!AH$5)*Beállítások!J14,\"\")","v":""},{"$f":"IFERROR(AVERAGEIFS(táblázatOsztályPontszámok[Pontszám],táblázatOsztályPontszámok[Tantárgy],Számítások!$C11,táblázatOsztályPontszámok[Típus],Számítások!AI$5)*Beállítások!K14,\"\")","v":""},0.05,{"$f":"SUMIFS(Beállítások!E14:K14,Számítások!AC11:AI11,\">0\")","v":0.1},{"v":0.5,"d":"50%"},0,"F"]
[null,null,{"$f":"IF(Beállítások!C15=\"\",\"\",Beállítások!C15)","v":"Fogalmazás"},{"v":0.95,"d":"95%"},"","","","","","","","","","","","","","","","","","","","","","","","",{"$f":"IFERROR(AVERAGEIFS(táblázatOsztályPontszámok[Pontszám],táblázatOsztályPontszámok[Tantárgy],Számítások!$C12,táblázatOsztályPontszámok[Típus],Számítások!AC$5)*Beállítások!E15,\"\")","v":""},{"$f":"IFERROR(AVERAGEIFS(táblázatOsztályPontszámok[Pontszám],táblázatOsztályPontszámok[Tantárgy],Számítások!$C12,táblázatOsztályPontszámok[Típus],Számítások!AD$5)*Beállítások!F15,\"\")","v":0.1425},{"$f":"IFERROR(AVERAGEIFS(táblázatOsztályPontszámok[Pontszám],táblázatOsztályPontszámok[Tantárgy],Számítások!$C12,táblázatOsztályPontszámok[Típus],Számítások!AE$5)*Beállítások!G15,\"\")","v":""},{"$f":"IFERROR(AVERAGEIFS(táblázatOsztályPontszámok[Pontszám],táblázatOsztályPontszámok[Tantárgy],Számítások!$C12,táblázatOsztályPontszámok[Típus],Számítások!AF$5)*Beállítások!H15,\"\")","v":""},{"$f":"IFERROR(AVERAGEIFS(táblázatOsztályPontszámok[Pontszám],táblázatOsztályPontszámok[Tantárgy],Számítások!$C12,táblázatOsztályPontszámok[Típus],Számítások!AG$5)*Beállítások!I15,\"\")","v":""},{"$f":"IFERROR(AVERAGEIFS(táblázatOsztályPontszámok[Pontszám],táblázatOsztályPontszámok[Tantárgy],Számítások!$C12,táblázatOsztályPontszámok[Típus],Számítások!AH$5)*Beállítások!J15,\"\")","v":""},{"$f":"IFERROR(AVERAGEIFS(táblázatOsztályPontszámok[Pontszám],táblázatOsztályPontszámok[Tantárgy],Számítások!$C12,táblázatOsztályPontszámok[Típus],Számítások!AI$5)*Beállítások!K15,\"\")","v":""},0.1425,{"$f":"SUMIFS(Beállítások!E15:K15,Számítások!AC12:AI12,\">0\")","v":0.15},{"v":0.95,"d":"95%"},4,"A"]
[null,null,{"$f":"IF(Beállítások!C16=\"\",\"\",Beállítások!C16)","v":""},"","","","","","","","","","","","","","","","","","","","","","","","","",{"$f":"IFERROR(AVERAGEIFS(táblázatOsztályPontszámok[Pontszám],táblázatOsztályPontszámok[Tantárgy],Számítások!$C13,táblázatOsztályPontszámok[Típus],Számítások!AC$5)*Beállítások!E16,\"\")","v":""},{"$f":"IFERROR(AVERAGEIFS(táblázatOsztályPontszámok[Pontszám],táblázatOsztályPontszámok[Tantárgy],Számítások!$C13,táblázatOsztályPontszámok[Típus],Számítások!AD$5)*Beállítások!F16,\"\")","v":""},{"$f":"IFERROR(AVERAGEIFS(táblázatOsztályPontszámok[Pontszám],táblázatOsztályPontszámok[Tantárgy],Számítások!$C13,táblázatOsztályPontszámok[Típus],Számítások!AE$5)*Beállítások!G16,\"\")","v":""},{"$f":"IFERROR(AVERAGEIFS(táblázatOsztályPontszámok[Pontszám],táblázatOsztályPontszámok[Tantárgy],Számítások!$C13,táblázatOsztályPontszámok[Típus],Számítások!AF$5)*Beállítások!H16,\"\")","v":""},{"$f":"IFERROR(AVERAGEIFS(táblázatOsztályPontszámok[Pontszám],táblázatOsztályPontszámok[Tantárgy],Számítások!$C13,táblázatOsztályPontszámok[Típus],Számítások!AG$5)*Beállítások!I16,\"\")","v":""},{"$f":"IFERROR(AVERAGEIFS(táblázatOsztályPontszámok[Pontszám],táblázatOsztályPontszámok[Tantárgy],Számítások!$C13,táblázatOsztályPontszámok[Típus],Számítások!AH$5)*Beállítások!J16,\"\")","v":""},{"$f":"IFERROR(AVERAGEIFS(táblázatOsztályPontszámok[Pontszám],táblázatOsztályPontszámok[Tantárgy],Számítások!$C13,táblázatOsztályPontszámok[Típus],Számítások!AI$5)*Beállítások!K16,\"\")","v":""},{"$f":"SUM(AC13:AI13)","v":0},{"$f":"SUMIFS(Beállítások!E16:K16,Számítások!AC13:AI13,\">0\")","v":0},{"$f":"IFERROR(AJ13/AK13,\"\")","v":""},"",""]
[null,null,{"$f":"IF(Beállítások!C17=\"\",\"\",Beállítások!C17)","v":""},"","","","","","","","","","","","","","","","","","","","","","","","","",{"$f":"IFERROR(AVERAGEIFS(táblázatOsztályPontszámok[Pontszám],táblázatOsztályPontszámok[Tantárgy],Számítások!$C14,táblázatOsztályPontszámok[Típus],Számítások!AC$5)*Beállítások!E17,\"\")","v":""},{"$f":"IFERROR(AVERAGEIFS(táblázatOsztályPontszámok[Pontszám],táblázatOsztályPontszámok[Tantárgy],Számítások!$C14,táblázatOsztályPontszámok[Típus],Számítások!AD$5)*Beállítások!F17,\"\")","v":""},{"$f":"IFERROR(AVERAGEIFS(táblázatOsztályPontszámok[Pontszám],táblázatOsztályPontszámok[Tantárgy],Számítások!$C14,táblázatOsztályPontszámok[Típus],Számítások!AE$5)*Beállítások!G17,\"\")","v":""},{"$f":"IFERROR(AVERAGEIFS(táblázatOsztályPontszámok[Pontszám],táblázatOsztályPontszámok[Tantárgy],Számítások!$C14,táblázatOsztályPontszámok[Típus],Számítások!AF$5)*Beállítások!H17,\"\")","v":""},{"$f":"IFERROR(AVERAGEIFS(táblázatOsztályPontszámok[Pontszám],táblázatOsztályPontszámok[Tantárgy],Számítások!$C14,táblázatOsztályPontszámok[Típus],Számítások!AG$5)*Beállítások!I17,\"\")","v":""},{"$f":"IFERROR(AVERAGEIFS(táblázatOsztályPontszámok[Pontszám],táblázatOsztályPontszámok[Tantárgy],Számítások!$C14,táblázatOsztályPontszámok[Típus],Számítások!AH$5)*Beállítások!J17,\"\")","v":""},{"$f":"IFERROR(AVERAGEIFS(táblázatOsztályPontszámok[Pontszám],táblázatOsztályPontszámok[Tantárgy],Számítások!$C14,táblázatOsztályPontszámok[Típus],Számítások!AI$5)*Beállítások!K17,\"\")","v":""},0,{"$f":"SUMIFS(Beállítások!E17:K17,Számítások!AC14:AI14,\">0\")","v":0},"","",""]
[null,null,{"$f":"IF(Beállítások!C18=\"\",\"\",Beállítások!C18)","v":""},"","","","","","","","","","","","","","","","","","","","","","","","","",{"$f":"IFERROR(AVERAGEIFS(táblázatOsztályPontszámok[Pontszám],táblázatOsztályPontszámok[Tantárgy],Számítások!$C15,táblázatOsztályPontszámok[Típus],Számítások!AC$5)*Beállítások!E18,\"\")","v":""},{"$f":"IFERROR(AVERAGEIFS(táblázatOsztályPontszámok[Pontszám],táblázatOsztályPontszámok[Tantárgy],Számítások!$C15,táblázatOsztályPontszámok[Típus],Számítások!AD$5)*Beállítások!F18,\"\")","v":""},{"$f":"IFERROR(AVERAGEIFS(táblázatOsztályPontszámok[Pontszám],táblázatOsztályPontszámok[Tantárgy],Számítások!$C15,táblázatOsztályPontszámok[Típus],Számítások!AE$5)*Beállítások!G18,\"\")","v":""},{"$f":"IFERROR(AVERAGEIFS(táblázatOsztályPontszámok[Pontszám],táblázatOsztályPontszámok[Tantárgy],Számítások!$C15,táblázatOsztályPontszámok[Típus],Számítások!AF$5)*Beállítások!H18,\"\")","v":""},{"$f":"IFERROR(AVERAGEIFS(táblázatOsztályPontszámok[Pontszám],táblázatOsztályPontszámok[Tantárgy],Számítások!$C15,táblázatOsztályPontszámok[Típus],Számítások!AG$5)*Beállítások!I18,\"\")","v":""},{"$f":"IFERROR(AVERAGEIFS(táblázatOsztályPontszámok[Pontszám],táblázatOsztályPontszámok[Tantárgy],Számítások!$C15,táblázatOsztályPontszámok[Típus],Számítások!AH$5)*Beállítások!J18,\"\")","v":""},{"$f":"IFERROR(AVERAGEIFS(táblázatOsztályPontszámok[Pontszám],táblázatOsztályPontszámok[Tantárgy],Számítások!$C15,táblázatOsztályPontszámok[Típus],Számítások!AI$5)*Beállítások!K18,\"\")","v":""},0,{"$f":"SUMIFS(Beállítások!E18:K18,Számítások!AC15:AI15,\">0\")","v":0},"","",""]
{"$rows_left_out":642}