{"text_format":"3","workbook":"xlsx","n_sheets":6,"sheets":["Kezdőlap","Személyes adatok","Utazás adatai","Szállás és tevékenységek","Autóbérlés","Adatok segélykérés esetére"],"not_rendered":{"images":19,"defined_names":10},"read":"whole","date_system":"1900"}

{"sheet":"Kezdőlap","index":0,"n_rows":34,"n_cols":22,"rows_kept":34,"merged":[[32,1,32,3],[32,6,32,8],[32,11,32,13],[32,16,32,18],[32,21,32,23],[33,1,33,3],[33,6,33,8],[33,11,33,13],[33,16,33,18],[33,21,33,23]]}
{"$rows_empty":32}
[null,{"$f":"SzemélyesAdat/SzemélyesSzám","v":{"v":1,"d":"100%"}},{"$nulls":4},{"$f":"UtazásAdat/UtazásSzám","v":{"v":0.65,"d":"65%"}},{"$nulls":4},{"$f":"SzállásAdat/SzállásSzám","v":{"v":0.5384615384615384,"d":"54%"}},{"$nulls":4},{"$f":"IF(Autóbérlés!D4=\"Igen\",AutóbérlésAdat/AutóbérlésSzám,1)","v":{"v":0.2857142857142857,"d":"29%"}},{"$nulls":4},{"$f":"SegélykérésAdat/SegélykérésSzám","v":{"v":0.625,"d":"63%"}}]
[null,{"$f":"TEXT(B33,\"0% \"\"kitöltve\"\"\")","v":"100% kitöltve"},{"$nulls":4},{"$f":"TEXT(G33,\"0% \"\"kitöltve\"\"\")","v":"65% kitöltve"},{"$nulls":4},{"$f":"TEXT(L33,\"0% \"\"kitöltve\"\"\")","v":"54% kitöltve"},{"$nulls":4},{"$f":"TEXT(Q33,\"0% \"\"kitöltve\"\"\")","v":"29% kitöltve"},{"$nulls":4},{"$f":"TEXT(V33,\"0% \"\"kitöltve\"\"\")","v":"63% kitöltve"}]

{"sheet":"Személyes adatok","index":1,"n_rows":11,"n_cols":5,"rows_kept":11,"merged":[[4,2,5,2],[4,3,5,3],[4,4,5,4],[7,2,8,2],[7,3,8,3],[7,4,8,4],[17,1,17,4]]}
[]
[]
[{"$f":"IF(COUNTA(B4:B8)<1,\"*\",\"\")","v":""},"Teljes név és becenév",{"$f":"IF(E3=\"\",1,\"\")","v":""},"Otthoni cím","London, 987 North Fifth Street, 01234"]
[null,"Barkóczi Miklós"]
[null,"Balázs Erzsébet",{"$f":"IF(E5=\"\",1,\"\")","v":""},"Otthoni telefonszám",3455550123]
[null,"Béres Kálmán"]
[]
[null,null,{"$f":"IF((E8=0)+(E8=\"\"),1,\"\")","v":""},"Mobiltelefonszámok",3455550124]
[]
[]
[{"$f":"SzemélyesAdat","v":3},{"$f":"IF(A11<>SzemélyesSzám,\"Fontos adatok hiányoznak\",\"Fontos adatok kitöltve\")","v":"Fontos adatok kitöltve"}]

{"sheet":"Utazás adatai","index":2,"n_rows":18,"n_cols":6,"rows_kept":18,"merged":[[23,1,23,5]]}
[]
[]
[null,"Indulási adatok",null,null,"Érkezési adatok"]
[{"$f":"IF(C4=\"\",1,\"\")","v":""},"Dátum",{"$f":"TODAY()+45","v":"2013-02-17"},{"$f":"IF(F4=\"\",1,\"\")","v":""},"Dátum",{"$f":"TODAY()+51","v":"2013-02-23"}]
[{"$f":"IF(C5=\"\",1,\"\")","v":""},"Légitársaság","Blue Yonder Airlines","","Légitársaság","Blue Yonder Airlines"]
[{"$f":"IF(C6=\"\",1,\"\")","v":""},"Járatszám","WS192",1,"Járatszám"]
[{"$f":"IF(C7=\"\",1,\"\")","v":""},"Honnan","London","","Honnan","Budapest"]
[{"$f":"IF(C8=\"\",1,\"\")","v":""},"Indulás","12:30:00",1,"Indulás"]
[null,"Indulási terminál/kapu",null,1,"Indulási terminál/kapu"]
[{"$f":"IF(C10=\"\",1,\"\")","v":""},"Hová","Budapest",1,"Hová"]
[{"$f":"IF(C11=\"\",1,\"\")","v":""},"Érkezés","12:32:00",1,"Érkezés"]
[null,"Repülőút időtartama","2 óra",null,"Repülőút időtartama"]
[{"$f":"IF(C13=\"\",1,\"\")","v":""},"Ülőhelyek száma","A1, A2,A3",{"$f":"IF(F13=\"\",1,\"\")","v":1},"Ülőhelyek száma"]
[{"$f":"IF(C14=\"\",1,\"\")","v":""},"Visszaigazolási számok","Ugyanaz",{"$f":"IF(F14=\"\",1,\"\")","v":1},"Visszaigazolási számok"]
[{"$f":"IF(C15=\"\",1,\"\")","v":""},"Étkezés","Korlátozások nélkül",null,"Étkezés"]
[null,"Légitársaság telefonszáma",1235550234,null,"Légitársaság telefonszáma",1235550234]
[]
[{"$f":"UtazásAdat","v":13},{"$f":"IF(A18<>UtazásSzám,\"Fontos adatok hiányoznak\",\"Fontos adatok kitöltve\")","v":"Fontos adatok hiányoznak"}]

{"sheet":"Szállás és tevékenységek","index":3,"n_rows":15,"n_cols":7,"rows_kept":15,"merged":[[21,1,21,6]]}
[]
[]
[null,"Szállodai tartózkodás / szállás adatai",{"$nulls":3},"Utazási cél, tevékenység részletezése"]
[{"$f":"IF(C4=\"\",1,\"\")","v":""},"Foglalás dátuma",{"$f":"TODAY()+45","v":"2013-02-17"},null,null,"1. tevékenység","Sízés"]
["","Szálloda neve","Alpine Ski House",null,{"$f":"IF(AND($G$4<>\"\",G5=\"\"),1,\"\")","v":1},"Dátum/időpont"]
["","Szálloda címe","Fő utca 789.",null,{"$f":"IF(AND($G$4<>\"\",G6=\"\"),1,\"\")","v":1},"Foglalás dátuma"]
["","Szálloda telefonszáma","Budapest",null,{"$f":"IF(AND($G$4<>\"\",G7=\"\"),1,\"\")","v":1},"Visszaigazolás száma"]
["","Bejelentkezés napja/időpontja",{"$f":"TODAY()+45.5","v":"2013-02-17T12:00:00"},null,null,"2. tevékenység","Coho Vineyard & Winery"]
["","Kijelentkezés napja/időpontja",{"$f":"TODAY()+50.5","v":"2013-02-22T12:00:00"},null,{"$f":"IF(AND($G$8<>\"\",G9=\"\"),1,\"\")","v":1},"Dátum/időpont"]
["","Visszaigazolás száma","CJ1234567",null,{"$f":"IF(AND($G$8<>\"\",G10=\"\"),1,\"\")","v":1},"Foglalás dátuma"]
[{"$nulls":4},{"$f":"IF(AND($G$8<>\"\",G11=\"\"),1,\"\")","v":1},"Visszaigazolás száma"]
[{"$f":"SzállásAdat","v":7},{"$f":"IF(A12<>SzállásSzám,\"Fontos adatok hiányoznak\",\"Fontos adatok kitöltve\")","v":"Fontos adatok hiányoznak"},{"$nulls":3},"3. tevékenység"]
[{"$nulls":4},{"$f":"IF(AND($G$12<>\"\",G13=\"\"),1,\"\")","v":""},"Dátum/időpont"]
[{"$nulls":4},{"$f":"IF(AND($G$12<>\"\",G14=\"\"),1,\"\")","v":""},"Foglalás dátuma"]
[{"$nulls":4},{"$f":"IF(AND($G$12<>\"\",G15=\"\"),1,\"\")","v":""},"Visszaigazolás száma"]

{"sheet":"Autóbérlés","index":4,"n_rows":13,"n_cols":4,"rows_kept":13,"merged":[[18,0,18,4]]}
[]
[]
[null,null,"Autóbérlés adatai"]
[null,null,"Bérel autót?","Igen"]
[null,{"$f":"IF(AND($D$4=\"Igen\",D5=\"\"),1,\"\")","v":""},"Foglalás dátuma",{"$f":"TODAY()+45","v":"2013-02-17"}]
[null,1,"Autókölcsönző cég"]
[null,1,"Átvétel dátuma/időpontja"]
[null,1,"Leadás dátuma/időpontja"]
[null,1,"Visszaigazolás száma"]
[null,"","Jármű típusa","Turista"]
[null,1,"Telefonszám"]
[]
[null,{"$f":"AutóbérlésAdat","v":2},{"$f":"IF(B13<>AutóbérlésSzám,\"Fontos adatok hiányoznak\",\"Fontos adatok kitöltve\")","v":"Fontos adatok hiányoznak"}]

{"sheet":"Adatok segélykérés esetére","index":5,"n_rows":11,"n_cols":6,"rows_kept":11,"merged":[[3,4,4,4],[3,5,4,5],[3,6,4,6],[5,4,6,4],[5,5,6,5],[5,6,6,6],[7,5,8,5],[7,6,8,6],[16,1,16,6]]}
[]
[]
[null,"Biztosítás adatai",{"$nulls":3},"Sürgős esetben értesítendő személy adatai"]
[{"$f":"IF(C4=\"\",1,\"\")","v":""},"Biztosítótársaság","Humongous Insurance",null,{"$f":"IF(G4=\"\",1,\"\")","v":1},"Név / kapcsolat / telefonszám"]
["","Telefonszám",1235550567]
["","Biztosítás típusa","1900-01-05",null,{"$f":"IF(G6=\"\",1,\"\")","v":1},"Név / kapcsolat / telefonszám"]
["","Visszaigazolás száma","1900-01-05"]
["","Vásárlás dátuma",{"$f":"TODAY()","v":"2013-01-03"},null,null,"Név / kapcsolat / telefonszám"]
[1,"Biztosítás időtartama"]
[]
[{"$f":"SegélykérésAdat","v":5},{"$f":"IF(A11<>SegélykérésSzám,\"Fontos adatok hiányoznak\",\"Fontos adatok kitöltve\")","v":"Fontos adatok hiányoznak"}]