{"text_format":"3","workbook":"xlsx","n_sheets":3,"sheets":["Értékesítési adatok","Értékesítési jelentés","Készlet"],"not_rendered":{"defined_names":10,"pivot_tables":1},"read":"whole","date_system":"1900"}

{"sheet":"Értékesítési adatok","index":0,"n_rows":13,"n_cols":11,"rows_kept":13}
[]
[null,"NAPI PÉNZTÁRI ÉRTÉKESÍTÉSEK"]
[]
[]
[]
[{"$nulls":10}," "]
[{"$nulls":10}," "]
[null,"DÁTUM","IDŐ","TRANZAKCIÓ SZÁMA","RAKTÁRI SZÁM/CIKKSZÁM","MEGNEVEZÉS","ÉRTÉKESÍTÉS ÖSSZEGE","ADÓKULCS %","ÁFA","ÖSSZESEN"]
[null,"2012-02-01","10:30:00",1001,90001,{"$f":"IFERROR(IF(ISNA(VLOOKUP(táblÉrtékesítésiAdatok[[#This Row],[RAKTÁRI SZÁM/CIKKSZÁM]],tblKészlet[],2,0)),\"\",VLOOKUP(táblÉrtékesítésiAdatok[[#This Row],[RAKTÁRI SZÁM/CIKKSZÁM]],tblKészlet[],2,0)),\"Nincs leírás\")","v":"Takaró"},{"v":74.95,"d":"74.95 Ft"},{"v":0.05,"d":"5.00%"},{"$f":"táblÉrtékesítésiAdatok[[#This Row],[ÉRTÉKESÍTÉS ÖSSZEGE]]*táblÉrtékesítésiAdatok[[#This Row],[ADÓKULCS %]]","v":{"v":3.7475000000000005,"d":"3.75 Ft"}},{"$f":"táblÉrtékesítésiAdatok[[#This Row],[ÉRTÉKESÍTÉS ÖSSZEGE]]+táblÉrtékesítésiAdatok[[#This Row],[ÁFA]]","v":{"v":78.6975,"d":"78.70 Ft"}}]
[null,"2012-02-01","10:33:00",1002,90023,{"$f":"IFERROR(IF(ISNA(VLOOKUP(táblÉrtékesítésiAdatok[[#This Row],[RAKTÁRI SZÁM/CIKKSZÁM]],tblKészlet[],2,0)),\"\",VLOOKUP(táblÉrtékesítésiAdatok[[#This Row],[RAKTÁRI SZÁM/CIKKSZÁM]],tblKészlet[],2,0)),\"Nincs leírás\")","v":"Asztalterítő, 180 cm kör alakú"},{"v":34.99,"d":"34.99 Ft"},{"v":0.05,"d":"5.00%"},{"$f":"táblÉrtékesítésiAdatok[[#This Row],[ÉRTÉKESÍTÉS ÖSSZEGE]]*táblÉrtékesítésiAdatok[[#This Row],[ADÓKULCS %]]","v":{"v":1.7495000000000003,"d":"1.75 Ft"}},{"$f":"táblÉrtékesítésiAdatok[[#This Row],[ÉRTÉKESÍTÉS ÖSSZEGE]]+táblÉrtékesítésiAdatok[[#This Row],[ÁFA]]","v":{"v":36.7395,"d":"36.74 Ft"}}]
[null,"2012-02-01","10:45:00",1003,90005,{"$f":"IFERROR(IF(ISNA(VLOOKUP(táblÉrtékesítésiAdatok[[#This Row],[RAKTÁRI SZÁM/CIKKSZÁM]],tblKészlet[],2,0)),\"\",VLOOKUP(táblÉrtékesítésiAdatok[[#This Row],[RAKTÁRI SZÁM/CIKKSZÁM]],tblKészlet[],2,0)),\"Nincs leírás\")","v":"Kerek tányér"},{"v":55.95,"d":"55.95 Ft"},{"v":0.05,"d":"5.00%"},{"$f":"táblÉrtékesítésiAdatok[[#This Row],[ÉRTÉKESÍTÉS ÖSSZEGE]]*táblÉrtékesítésiAdatok[[#This Row],[ADÓKULCS %]]","v":{"v":2.7975000000000003,"d":"2.80 Ft"}},{"$f":"táblÉrtékesítésiAdatok[[#This Row],[ÉRTÉKESÍTÉS ÖSSZEGE]]+táblÉrtékesítésiAdatok[[#This Row],[ÁFA]]","v":{"v":58.7475,"d":"58.75 Ft"}}]
[null,"2012-02-01","10:55:00",1004,90004,{"$f":"IFERROR(IF(ISNA(VLOOKUP(táblÉrtékesítésiAdatok[[#This Row],[RAKTÁRI SZÁM/CIKKSZÁM]],tblKészlet[],2,0)),\"\",VLOOKUP(táblÉrtékesítésiAdatok[[#This Row],[RAKTÁRI SZÁM/CIKKSZÁM]],tblKészlet[],2,0)),\"Nincs leírás\")","v":"Négyszögletes tányér"},{"v":2.95,"d":"2.95 Ft"},{"v":0.05,"d":"5.00%"},{"$f":"táblÉrtékesítésiAdatok[[#This Row],[ÉRTÉKESÍTÉS ÖSSZEGE]]*táblÉrtékesítésiAdatok[[#This Row],[ADÓKULCS %]]","v":{"v":0.14750000000000002,"d":"0.15 Ft"}},{"$f":"táblÉrtékesítésiAdatok[[#This Row],[ÉRTÉKESÍTÉS ÖSSZEGE]]+táblÉrtékesítésiAdatok[[#This Row],[ÁFA]]","v":{"v":3.0975,"d":"3.10 Ft"}}]
[null,"2012-02-01","11:45:00",1005,90002,{"$f":"IFERROR(IF(ISNA(VLOOKUP(táblÉrtékesítésiAdatok[[#This Row],[RAKTÁRI SZÁM/CIKKSZÁM]],tblKészlet[],2,0)),\"\",VLOOKUP(táblÉrtékesítésiAdatok[[#This Row],[RAKTÁRI SZÁM/CIKKSZÁM]],tblKészlet[],2,0)),\"Nincs leírás\")","v":"Párna"},{"v":14.98,"d":"14.98 Ft"},{"v":0.05,"d":"5.00%"},{"$f":"táblÉrtékesítésiAdatok[[#This Row],[ÉRTÉKESÍTÉS ÖSSZEGE]]*táblÉrtékesítésiAdatok[[#This Row],[ADÓKULCS %]]","v":{"v":0.7490000000000001,"d":"0.75 Ft"}},{"$f":"táblÉrtékesítésiAdatok[[#This Row],[ÉRTÉKESÍTÉS ÖSSZEGE]]+táblÉrtékesítésiAdatok[[#This Row],[ÁFA]]","v":{"v":15.729000000000001,"d":"15.73 Ft"}}]

{"sheet":"Értékesítési jelentés","index":1,"n_rows":14,"n_cols":7,"rows_kept":14}
[]
[null,"NAPI PÉNZTÁRI ÉRTÉKESÍTÉSEK"]
[]
[]
[]
[]
[]
[null,"RAKTÁRI SZÁM/CIKKSZÁM","MEGNEVEZÉS","DÁTUM"," Értékesítés összege"," Áfa"," Összesen"]
[null,90001,"Takaró","2012-02-01",{"v":74.95,"d":"74.95 Ft"},{"v":3.7475000000000005,"d":"3.75 Ft"},{"v":78.6975,"d":"78.70 Ft"}]
[null,90002,"Párna","2012-02-01",{"v":14.98,"d":"14.98 Ft"},{"v":0.7490000000000001,"d":"0.75 Ft"},{"v":15.729000000000001,"d":"15.73 Ft"}]
[null,90004,"Négyszögletes tányér","2012-02-01",{"v":2.95,"d":"2.95 Ft"},{"v":0.14750000000000002,"d":"0.15 Ft"},{"v":3.0975,"d":"3.10 Ft"}]
[null,90005,"Kerek tányér","2012-02-01",{"v":55.95,"d":"55.95 Ft"},{"v":2.7975000000000003,"d":"2.80 Ft"},{"v":58.7475,"d":"58.75 Ft"}]
[null,90023,"Asztalterítő, 180 cm kör alakú","2012-02-01",{"v":34.99,"d":"34.99 Ft"},{"v":1.7495000000000003,"d":"1.75 Ft"},{"v":36.7395,"d":"36.74 Ft"}]
[null,"Grand Total",null,null,{"v":183.82000000000002,"d":"183.82 Ft"},{"v":9.191000000000003,"d":"9.19 Ft"},{"v":193.011,"d":"193.01 Ft"}]

{"sheet":"Készlet","index":2,"n_rows":31,"n_cols":3,"rows_kept":31}
[]
[null,"NAPI PÉNZTÁRI ÉRTÉKESÍTÉSEK"]
[]
[]
[]
[]
[]
[null,"RAKTÁRI SZÁM/CIKKSZÁM","MEGNEVEZÉS"]
[null,90001,"Takaró"]
[null,90002,"Párna"]
[null,90003,"Lepedő"]
[null,90004,"Négyszögletes tányér"]
[null,90005,"Kerek tányér"]
[null,90006,"Mélytányér, nagy"]
[null,90007,"Mélytányér, kicsi"]
[null,90008,"Kerek tányér, kicsi"]
[null,90009,"Villa, kicsi"]
[null,90010,"Villa, nagy"]
[null,90011,"Kanál, kicsi"]
[null,90012,"Kanál, nagy"]
[null,90013,"Kenőkés, kicsi"]
[null,90014,"Kenőkés, nagy"]
[null,90015,"Asztalterítő, 300x150"]
[null,90016,"Asztalterítő, 240x150"]
[null,90017,"Asztalterítő, 240x240"]
[null,90018,"Asztalterítő, 180x180"]
[null,90019,"Asztalterítő, 180x120"]
[null,90020,"Asztalterítő, 120x120"]
[null,90021,"Asztalterítő, 300 cm kör alakú"]
[null,90022,"Asztalterítő, 240 cm kör alakú"]
[null,90023,"Asztalterítő, 180 cm kör alakú"]