{"text_format":"3","workbook":"xlsx","n_sheets":2,"sheets":["Munkaidő-nyilvántartás","Hétköznap_lista"],"not_rendered":{"defined_names":27},"read":"whole","date_system":"1900"}

{"sheet":"Munkaidő-nyilvántartás","index":0,"n_rows":36,"n_cols":26,"rows_kept":36,"merged":[[0,1,2,4],[0,5,2,9],[0,10,2,14],[0,15,3,23],[0,24,3,24],[3,1,3,3],[3,5,3,9],[3,10,3,14],[4,1,6,3],[4,4,6,6],[5,14,7,14],[5,22,7,22],[5,23,7,23],[5,24,7,24],[21,1,21,6],[22,1,23,3],[22,4,23,6],[23,14,24,14],[23,22,24,22],[23,23,24,23],[23,24,24,24],[32,1,32,6],[32,24,33,24],[32,25,33,25],[33,1,33,6],[34,1,34,6],[35,1,35,3],[35,4,35,5],[35,6,35,7],[35,8,35,14],[35,15,35,16],[35,17,35,23]]}
[null,"ALKALMAZOTTAK MUNKAIDŐ-NYILVÁNTARTÁSA",{"$nulls":3},"Alkalmazott neve",{"$nulls":9},"Válassza az Igen lehetőséget a jobbra lévő cellában, ha a túlórához \njóváhagyás szükséges"]
[]
[]
[null,"Bérszámfejtés záró dátuma",null,null,{"$f":"V7","v":"2025-06-14"},"Alkalmazott száma"]
[null,"RENDES MUNKAIDŐ:",null,null,"Dátum:"]
[{"$nulls":14},"Összes 1. heti rendes munkaidő",{"$nulls":7},"Összes 2. heti rendes munkaidő","Összes rendes munkaidő órában","Bérszámfejtésben\nhasználandó\nfizetési kód"]
[{"$nulls":7},"2025-06-01",{"$f":"Nap_egy+1","v":"2025-06-02"},{"$f":"Nap_egy+2","v":"2025-06-03"},{"$f":"Nap_egy+3","v":"2025-06-04"},{"$f":"Nap_egy+4","v":"2025-06-05"},{"$f":"Nap_egy+5","v":"2025-06-06"},{"$f":"Nap_egy+6","v":"2025-06-07"},null,{"$f":"Nap_egy+7","v":"2025-06-08"},{"$f":"Nap_egy+8","v":"2025-06-09"},{"$f":"Nap_egy+9","v":"2025-06-10"},{"$f":"Nap_egy+10","v":"2025-06-11"},{"$f":"Nap_egy+11","v":"2025-06-12"},{"$f":"Nap_egy+12","v":"2025-06-13"},{"$f":"Nap_egy+13","v":"2025-06-14"}]
[null,"Feladat","Hely","Munkarendelés száma","Munka leírása","Beosztás","Beosztás száma",{"$f":"VLOOKUP(WEEKDAY(Nap_egy),Hétköznap_lista!$B$2:$C$8,2)","v":"V"},{"$f":"VLOOKUP(WEEKDAY(I7),Hétköznap_lista!$B$2:$C$8,2)","v":"H"},{"$f":"VLOOKUP(WEEKDAY(J7),Hétköznap_lista!$B$2:$C$8,2)","v":"K"},{"$f":"VLOOKUP(WEEKDAY(K7),Hétköznap_lista!$B$2:$C$8,2)","v":"Sze"},{"$f":"VLOOKUP(WEEKDAY(L7),Hétköznap_lista!$B$2:$C$8,2)","v":"Cs"},{"$f":"VLOOKUP(WEEKDAY(M7),Hétköznap_lista!$B$2:$C$8,2)","v":"P"},{"$f":"VLOOKUP(WEEKDAY(N7),Hétköznap_lista!$B$2:$C$8,2)","v":"Szo"},null,{"$f":"VLOOKUP(WEEKDAY(P7),Hétköznap_lista!$B$2:$C$8,2)","v":"V"},{"$f":"VLOOKUP(WEEKDAY(Q7),Hétköznap_lista!$B$2:$C$8,2)","v":"H"},{"$f":"VLOOKUP(WEEKDAY(R7),Hétköznap_lista!$B$2:$C$8,2)","v":"K"},{"$f":"VLOOKUP(WEEKDAY(S7),Hétköznap_lista!$B$2:$C$8,2)","v":"Sze"},{"$f":"VLOOKUP(WEEKDAY(T7),Hétköznap_lista!$B$2:$C$8,2)","v":"Cs"},{"$f":"VLOOKUP(WEEKDAY(U7),Hétköznap_lista!$B$2:$C$8,2)","v":"P"},{"$f":"VLOOKUP(WEEKDAY(V7),Hétköznap_lista!$B$2:$C$8,2)","v":"Szo"}]
[{"$nulls":14},{"$f":"SUM(H9:N9)","v":{"v":0,"d":"0.00"}},{"$nulls":7},{"$f":"SUM(P9:V9)","v":{"v":0,"d":"0.00"}},{"$f":"O9+W9","v":{"v":0,"d":"0.00"}}]
[{"$nulls":14},{"v":0,"d":"0.00"},{"$nulls":7},{"v":0,"d":"0.00"},{"v":0,"d":"0.00"}]
[{"$nulls":14},{"v":0,"d":"0.00"},{"$nulls":7},{"v":0,"d":"0.00"},{"v":0,"d":"0.00"}]
[{"$nulls":14},{"v":0,"d":"0.00"},{"$nulls":7},{"v":0,"d":"0.00"},{"v":0,"d":"0.00"}]
[{"$nulls":14},{"v":0,"d":"0.00"},{"$nulls":7},{"v":0,"d":"0.00"},{"v":0,"d":"0.00"}]
[{"$nulls":14},{"v":0,"d":"0.00"},{"$nulls":7},{"v":0,"d":"0.00"},{"v":0,"d":"0.00"}]
[{"$nulls":14},{"v":0,"d":"0.00"},{"$nulls":7},{"v":0,"d":"0.00"},{"v":0,"d":"0.00"}]
[{"$nulls":14},{"$f":"SUM(H16:N16)","v":{"v":0,"d":"0.00"}},{"$nulls":7},{"$f":"SUM(P16:V16)","v":{"v":0,"d":"0.00"}},{"$f":"O16+W16","v":{"v":0,"d":"0.00"}}]
[{"$nulls":14},{"v":0,"d":"0.00"},{"$nulls":7},{"v":0,"d":"0.00"},{"v":0,"d":"0.00"}]
[{"$nulls":14},{"v":0,"d":"0.00"},{"$nulls":7},{"v":0,"d":"0.00"},{"v":0,"d":"0.00"}]
[{"$nulls":14},{"v":0,"d":"0.00"},{"$nulls":7},{"v":0,"d":"0.00"},{"v":0,"d":"0.00"}]
[{"$nulls":14},{"v":0,"d":"0.00"},{"$nulls":7},{"v":0,"d":"0.00"},{"v":0,"d":"0.00"}]
[{"$nulls":14},{"v":0,"d":"0.00"},{"$nulls":7},{"v":0,"d":"0.00"},{"v":0,"d":"0.00"}]
[null,"Rendes munkaidő összesen   ",{"$nulls":5},{"$f":"SUM(H9:H21)","v":{"v":0,"d":"0.00"}},{"v":0,"d":"0.00"},{"v":0,"d":"0.00"},{"v":0,"d":"0.00"},{"v":0,"d":"0.00"},{"v":0,"d":"0.00"},{"v":0,"d":"0.00"},{"v":0,"d":"0.00"},{"v":0,"d":"0.00"},{"$f":"SUM(Q9:Q21)","v":{"v":0,"d":"0.00"}},{"v":0,"d":"0.00"},{"v":0,"d":"0.00"},{"v":0,"d":"0.00"},{"v":0,"d":"0.00"},{"v":0,"d":"0.00"},{"$f":"SUM(W9:W21)","v":{"v":0,"d":"0.00"}},{"$f":"SUM(X9:X21)","v":{"v":0,"d":"0.00"}}]
[null,"TÚLÓRA:",null,null,"Dátum:"]
[{"$nulls":7},{"$f":"Nap_egy","v":"2025-06-01"},{"$f":"Nap_egy+1","v":"2025-06-02"},{"$f":"Nap_egy+2","v":"2025-06-03"},{"$f":"Nap_egy+3","v":"2025-06-04"},{"$f":"Nap_egy+4","v":"2025-06-05"},{"$f":"Nap_egy+5","v":"2025-06-06"},{"$f":"Nap_egy+6","v":"2025-06-07"},"1. heti túlóra",{"$f":"Nap_egy+7","v":"2025-06-08"},{"$f":"Nap_egy+8","v":"2025-06-09"},{"$f":"Nap_egy+9","v":"2025-06-10"},{"$f":"Nap_egy+10","v":"2025-06-11"},{"$f":"Nap_egy+11","v":"2025-06-12"},{"$f":"Nap_egy+12","v":"2025-06-13"},{"$f":"Nap_egy+13","v":"2025-06-14"},"2. heti túlóra","Összes túlóra","Túlóra kódja"]
[null,"Feladat","Hely","Munkarendelés száma","Munka leírása","Beosztás","Beosztás száma",{"$f":"VLOOKUP(WEEKDAY(Nap_egy),Hétköznap_lista!$B$2:$C$8,2)","v":"V"},{"$f":"VLOOKUP(WEEKDAY(I24),Hétköznap_lista!$B$2:$C$8,2)","v":"H"},{"$f":"VLOOKUP(WEEKDAY(J24),Hétköznap_lista!$B$2:$C$8,2)","v":"K"},{"$f":"VLOOKUP(WEEKDAY(K24),Hétköznap_lista!$B$2:$C$8,2)","v":"Sze"},{"$f":"VLOOKUP(WEEKDAY(L24),Hétköznap_lista!$B$2:$C$8,2)","v":"Cs"},{"$f":"VLOOKUP(WEEKDAY(M24),Hétköznap_lista!$B$2:$C$8,2)","v":"P"},{"$f":"VLOOKUP(WEEKDAY(N24),Hétköznap_lista!$B$2:$C$8,2)","v":"Szo"},null,{"$f":"VLOOKUP(WEEKDAY(P24),Hétköznap_lista!$B$2:$C$8,2)","v":"V"},{"$f":"VLOOKUP(WEEKDAY(Q24),Hétköznap_lista!$B$2:$C$8,2)","v":"H"},{"$f":"VLOOKUP(WEEKDAY(R24),Hétköznap_lista!$B$2:$C$8,2)","v":"K"},{"$f":"VLOOKUP(WEEKDAY(S24),Hétköznap_lista!$B$2:$C$8,2)","v":"Sze"},{"$f":"VLOOKUP(WEEKDAY(T24),Hétköznap_lista!$B$2:$C$8,2)","v":"Cs"},{"$f":"VLOOKUP(WEEKDAY(U24),Hétköznap_lista!$B$2:$C$8,2)","v":"P"},{"$f":"VLOOKUP(WEEKDAY(V24),Hétköznap_lista!$B$2:$C$8,2)","v":"Szo"}]
[{"$nulls":14},{"$f":"SUM(H26:N26)","v":{"v":0,"d":"0.00"}},{"$nulls":7},{"$f":"SUM(P26:V26)","v":{"v":0,"d":"0.00"}},{"$f":"O26+W26","v":{"v":0,"d":"0.00"}}]
[{"$nulls":14},{"v":0,"d":"0.00"},{"$nulls":7},{"v":0,"d":"0.00"},{"v":0,"d":"0.00"}]
[{"$nulls":14},{"v":0,"d":"0.00"},{"$nulls":7},{"v":0,"d":"0.00"},{"v":0,"d":"0.00"}]
[{"$nulls":14},{"v":0,"d":"0.00"},{"$nulls":7},{"v":0,"d":"0.00"},{"v":0,"d":"0.00"}]
[{"$nulls":14},{"v":0,"d":"0.00"},{"$nulls":7},{"v":0,"d":"0.00"},{"v":0,"d":"0.00"}]
[{"$nulls":14},{"v":0,"d":"0.00"},{"$nulls":7},{"v":0,"d":"0.00"},{"v":0,"d":"0.00"}]
[{"$nulls":14},{"v":0,"d":"0.00"},{"$nulls":7},{"v":0,"d":"0.00"},{"v":0,"d":"0.00"}]
[null,"Túlóra összesen     ",{"$nulls":5},{"$f":"SUM(H26:H32)","v":{"v":0,"d":"0.00"}},{"v":0,"d":"0.00"},{"v":0,"d":"0.00"},{"v":0,"d":"0.00"},{"v":0,"d":"0.00"},{"v":0,"d":"0.00"},{"v":0,"d":"0.00"},{"$f":"SUM(O26:O32)","v":{"v":0,"d":"0.00"}},{"v":0,"d":"0.00"},{"v":0,"d":"0.00"},{"v":0,"d":"0.00"},{"v":0,"d":"0.00"},{"v":0,"d":"0.00"},{"v":0,"d":"0.00"},{"v":0,"d":"0.00"},{"$f":"SUM(P33:V33)","v":{"v":0,"d":"0.00"}},{"$f":"SUM(X26:X32)","v":{"v":0,"d":"0.00"}},"Munkaórák\nszáma\nösszesen","Fizetett\nórák száma\nösszesen"]
[null,"Túlóradíj     ",{"$nulls":12},{"$f":"IF(SUM(H34:N34)<=O33,SUM(H34:N34),O33)","v":{"v":0,"d":"0.00"}},{"$nulls":7},{"$f":"IF(SUM(P34:V34)<=W33,SUM(P34:V34),W33)","v":{"v":0,"d":"0.00"}},{"$f":"IF(SUM(Q34:W34)<=X33,SUM(Q34:W34),X33)","v":{"v":0,"d":"0.00"}}]
[null,"Túlóra kifizetve     ",{"$nulls":5},{"$f":"IF(H33>=H34,H33-H34,H33)","v":{"v":0,"d":"0.00"}},{"$f":"IF(I33>=I34,I33-I34,I33)","v":{"v":0,"d":"0.00"}},{"v":0,"d":"0.00"},{"v":0,"d":"0.00"},{"v":0,"d":"0.00"},{"v":0,"d":"0.00"},{"v":0,"d":"0.00"},{"v":0,"d":"0.00"},{"v":0,"d":"0.00"},{"v":0,"d":"0.00"},{"v":0,"d":"0.00"},{"v":0,"d":"0.00"},{"v":0,"d":"0.00"},{"v":0,"d":"0.00"},{"v":0,"d":"0.00"},{"$f":"IF(W33>=W34,W33-W34,W33)","v":{"v":0,"d":"0.00"}},{"$f":"IF(X33>=X34,X33-X34,X33)","v":{"v":0,"d":"0.00"}},{"$f":"$X$22+$X$33","v":{"v":0,"d":"0.00"}},{"$f":"X22+X35","v":{"v":0,"d":"0.00"}}]
[null,"Alkalmazott ",{"$nulls":4},"Felettes ",{"$nulls":8},"Felettes "]

{"sheet":"Hétköznap_lista","index":1,"n_rows":8,"n_cols":3,"rows_kept":8}
[null,"Hét napjának\nszáma","Hét napjának\nrövidítése"]
[null,1,"V"]
[null,2,"H"]
[null,3,"K"]
[null,4,"Sze"]
[null,5,"Cs"]
[null,6,"P"]
[null,7,"Szo"]