{"text_format":"3","workbook":"xlsx","n_sheets":4,"sheets":["Pénzügyi jelentés","Pénzügyi adatok bevitele","Fő mérőszámok beállításai","Számítások"],"not_rendered":{"defined_names":5},"read":"whole","date_system":"1900"}

{"sheet":"Pénzügyi jelentés","index":0,"n_rows":40,"n_cols":14,"rows_kept":40,"merged":[[1,10,1,11],[6,9,6,11],[7,9,7,11],[8,9,8,11],[9,9,9,11],[12,3,12,7],[14,8,14,11],[15,8,15,11],[16,8,16,11],[17,8,17,11],[18,8,18,11],[19,8,19,11],[20,8,20,11],[21,8,21,11],[22,8,22,11],[23,8,23,11],[24,8,24,11],[25,8,25,11],[26,8,26,11],[27,8,27,11],[28,8,28,11],[29,8,29,11],[30,8,30,11],[31,8,31,11],[32,8,32,11],[33,8,33,11],[34,8,34,11],[35,8,35,11],[36,8,36,11],[37,8,37,11],[38,8,38,11],[39,8,39,11]]}
[]
[null,"ÉVES PÉNZÜGYI JELENTÉS",{"$nulls":8},2016,null,null,"Válassza ki a jelentés évét az L2 cellában"]
[null,"AZ ÖN CÉGÉNEK NEVE",{"$nulls":11},"Az adatok szerkesztéséhez váltson a Pénzügyi adatok bevitele munkalapra"]
[]
[null,"FŐ MÉRŐSZÁMOK",null,"Kattintson ide a fő mérőszámok módosításához"]
[]
[null,{"$f":"Számítások!B8","v":"BEVÉTEL"},null,{"$f":"Számítások!B9","v":"NETTÓ PROFIT"},null,{"$f":"Számítások!B10","v":"KAMAT"},null,{"$f":"Számítások!B11","v":"ÉRTÉKCSÖKKENÉS"},null,{"$f":"Számítások!B12","v":"MŰKÖDÉSI PROFIT"}]
[null,{"$f":"IFERROR(Számítások!G8,\"\")","v":{"v":36116776,"d":"36,116,776 Ft"}},null,{"$f":"IFERROR(Számítások!G9,\"\")","v":{"v":13494970.000000002,"d":"13,494,970 Ft"}},null,{"$f":"IFERROR(Számítások!G10,\"\")","v":{"v":757894,"d":"757,894 Ft"}},null,{"$f":"IFERROR(Számítások!G11,\"\")","v":{"v":1109376,"d":"1,109,376 Ft"}},null,{"$f":"IFERROR(Számítások!G12,\"\")","v":{"v":14685198.000000002,"d":"14,685,198 Ft"}}]
[null,{"$f":"Számítások!H8","v":{"v":3.0953753897409175E-3,"d":"0%"}},null,{"$f":"Számítások!H9","v":{"v":0.018148662861143583,"d":"2%"}},null,{"$f":"Számítások!H10","v":{"v":0.13514962705568712,"d":"14%"}},null,{"$f":"Számítások!H11","v":{"v":0.09440022728976682,"d":"9%"}},null,{"$f":"Számítások!H12","v":{"v":-0.05033560822904615,"d":"-5%"}}]
[]
[]
[]
[null,"ÖSSZES MÉRŐSZÁM",null,"Ne módosítsa az alábbi információkat. Kattintson ide a pénzügyi adatok megadásához"]
[]
[null,"MÉRŐSZÁM",null,{"$f":"\"ÉVES JELENTÉS (\"&KijelöltÉv&\")\"","v":"ÉVES JELENTÉS (2016)"},null,{"$f":"\"ELŐZŐ ÉV (\"&KijelöltÉv-1&\")\"","v":"ELŐZŐ ÉV (2015)"},null,"VÁLTOZÁS (%)",{"$f":"CONCATENATE(Évek,\" ÉVES TREND\")","v":"5 ÉVES TREND"}]
[null,{"$f":"Számítások!B15","v":"BEVÉTEL"},null,{"$f":"IF($B16=\"\",\"\",Számítások!G15)","v":{"v":36116776,"d":"36,116,776.00 Ft"}},null,{"$f":"IF($B16=\"\",\"\",Számítások!F15)","v":{"v":36005326,"d":"36,005,326.00 Ft"}},null,{"$f":"IFERROR(D16/F16-1,\"\")","v":{"v":3.0953753897409175E-3,"d":"0%"}}]
[null,{"$f":"Számítások!B16","v":"MŰKÖDÉSI KIADÁSOK"},null,{"$f":"IF($B17=\"\",\"\",Számítások!G16)","v":{"v":18883890,"d":"18,883,890.00 Ft"}},null,{"$f":"IF($B17=\"\",\"\",Számítások!F16)","v":{"v":16176666,"d":"16,176,666.00 Ft"}},null,{"v":0.16735364382252804,"d":"17%"}]
[null,{"$f":"Számítások!B17","v":"MŰKÖDÉSI PROFIT"},null,{"$f":"IF($B18=\"\",\"\",Számítások!G17)","v":{"v":14685198.000000002,"d":"14,685,198.00 Ft"}},null,{"$f":"IF($B18=\"\",\"\",Számítások!F17)","v":{"v":15463566,"d":"15,463,566.00 Ft"}},null,{"v":-0.05033560822904615,"d":"-5%"}]
[null,{"$f":"Számítások!B18","v":"ÉRTÉKCSÖKKENÉS"},null,{"$f":"IF($B19=\"\",\"\",Számítások!G18)","v":{"v":1109376,"d":"1,109,376.00 Ft"}},null,{"$f":"IF($B19=\"\",\"\",Számítások!F18)","v":{"v":1013684,"d":"1,013,684.00 Ft"}},null,{"v":0.09440022728976682,"d":"9%"}]
[null,{"$f":"Számítások!B19","v":"KAMAT"},null,{"$f":"IF($B20=\"\",\"\",Számítások!G19)","v":{"v":757894,"d":"757,894.00 Ft"}},null,{"$f":"IF($B20=\"\",\"\",Számítások!F19)","v":{"v":667660,"d":"667,660.00 Ft"}},null,{"v":0.13514962705568712,"d":"14%"}]
{"$rows_left_out":21}
{"sheet":"Pénzügyi adatok bevitele","index":1,"n_rows":19,"n_cols":9,"rows_kept":19}
[]
[null,"PÉNZÜGYI ADATOK BEVITELE"]
[null," LEGFELJEBB 25 FŐ MÉRŐSZÁMOT DEFINIÁLHAT 7 ÉVRE VONATKOZÓAN"]
[null," Kattintson ide a Pénzügyi jelentés megtekintéséhez"]
[null,"MÉRŐSZÁM NEVE",2010,2011,2012,2013,2014,2015,2016]
[null,"BEVÉTEL",{"v":25000000,"d":"25,000,000.00 Ft"},{"v":26827490.000000004,"d":"26,827,490.00 Ft"},{"v":28545676,"d":"28,545,676.00 Ft"},{"v":30137492,"d":"30,137,492.00 Ft"},{"v":33008912,"d":"33,008,912.00 Ft"},{"v":36005326,"d":"36,005,326.00 Ft"},{"v":36116776,"d":"36,116,776.00 Ft"}]
[null,"MŰKÖDÉSI KIADÁSOK",{"v":13000000,"d":"13,000,000.00 Ft"},{"v":14192462,"d":"14,192,462.00 Ft"},{"v":15184972,"d":"15,184,972.00 Ft"},{"v":15780254,"d":"15,780,254.00 Ft"},{"v":16334874,"d":"16,334,874.00 Ft"},{"v":16176666,"d":"16,176,666.00 Ft"},{"v":18883890,"d":"18,883,890.00 Ft"}]
[null,"MŰKÖDÉSI PROFIT",{"v":12000000,"d":"12,000,000.00 Ft"},{"v":12841460,"d":"12,841,460.00 Ft"},{"v":13771538,"d":"13,771,538.00 Ft"},{"v":15128650,"d":"15,128,650.00 Ft"},{"v":15351051.999999998,"d":"15,351,052.00 Ft"},{"v":15463566,"d":"15,463,566.00 Ft"},{"v":14685198.000000002,"d":"14,685,198.00 Ft"}]
[null,"ÉRTÉKCSÖKKENÉS",{"v":900000,"d":"900,000.00 Ft"},{"v":903554.0000000001,"d":"903,554.00 Ft"},{"v":931384,"d":"931,384.00 Ft"},{"v":994842,"d":"994,842.00 Ft"},{"v":1004821.9999999999,"d":"1,004,822.00 Ft"},{"v":1013684,"d":"1,013,684.00 Ft"},{"v":1109376,"d":"1,109,376.00 Ft"}]
[null,"KAMAT",{"v":500000,"d":"500,000.00 Ft"},{"v":549164,"d":"549,164.00 Ft"},{"v":578622,"d":"578,622.00 Ft"},{"v":627224,"d":"627,224.00 Ft"},{"v":629706,"d":"629,706.00 Ft"},{"v":667660,"d":"667,660.00 Ft"},{"v":757894,"d":"757,894.00 Ft"}]
[null,"NETTÓ PROFIT",{"v":10800000,"d":"10,800,000.00 Ft"},{"v":10952215,"d":"10,952,215.00 Ft"},{"v":11172162,"d":"11,172,162.00 Ft"},{"v":11949590,"d":"11,949,590.00 Ft"},{"v":12296718,"d":"12,296,718.00 Ft"},{"v":13254420.000000002,"d":"13,254,420.00 Ft"},{"v":13494970.000000002,"d":"13,494,970.00 Ft"}]
[null,"ADÓK",{"v":4400000,"d":"4,400,000.00 Ft"},{"v":4784108,"d":"4,784,108.00 Ft"},{"v":5115348,"d":"5,115,348.00 Ft"},{"v":5499772,"d":"5,499,772.00 Ft"},{"v":5667134,"d":"5,667,134.00 Ft"},{"v":5884906,"d":"5,884,906.00 Ft"},{"v":6281650,"d":"6,281,650.00 Ft"}]
[null,"ADÓZÁS UTÁNI PROFIT",{"v":6400000,"d":"6,400,000.00 Ft"},{"v":6988698,"d":"6,988,698.00 Ft"},{"v":7683706,"d":"7,683,706.00 Ft"},{"v":7979010.000000001,"d":"7,979,010.00 Ft"},{"v":8121546.000000001,"d":"8,121,546.00 Ft"},{"v":8487640,"d":"8,487,640.00 Ft"},{"v":10049536,"d":"10,049,536.00 Ft"}]
[null,"MÉRŐSZÁM 1",{"v":2560,"d":"2,560.00 Ft"},{"v":2562,"d":"2,562.00 Ft"},{"v":2756,"d":"2,756.00 Ft"},{"v":2858,"d":"2,858.00 Ft"},{"v":3114,"d":"3,114.00 Ft"},{"v":3356,"d":"3,356.00 Ft"},{"v":3992,"d":"3,992.00 Ft"}]
[null,"MÉRŐSZÁM 2",{"v":3640,"d":"3,640.00 Ft"},{"v":3718,"d":"3,718.00 Ft"},{"v":3844,"d":"3,844.00 Ft"},{"v":4034.0000000000005,"d":"4,034.00 Ft"},{"v":4096,"d":"4,096.00 Ft"},{"v":4368,"d":"4,368.00 Ft"},{"v":5202,"d":"5,202.00 Ft"}]
[null,"MÉRŐSZÁM 3",{"v":3820.0000000000005,"d":"3,820.00 Ft"},{"v":4110,"d":"4,110.00 Ft"},{"v":4374,"d":"4,374.00 Ft"},{"v":4638,"d":"4,638.00 Ft"},{"v":4934,"d":"4,934.00 Ft"},{"v":5278,"d":"5,278.00 Ft"},{"v":6216,"d":"6,216.00 Ft"}]
[null,"MÉRŐSZÁM 4",{"v":2420,"d":"2,420.00 Ft"},{"v":2442,"d":"2,442.00 Ft"},{"v":2518,"d":"2,518.00 Ft"},{"v":2740,"d":"2,740.00 Ft"},{"v":2752,"d":"2,752.00 Ft"},{"v":2918,"d":"2,918.00 Ft"},{"v":2984,"d":"2,984.00 Ft"}]
[null,"MÉRŐSZÁM 5",{"v":150,"d":"150.00 Ft"},{"v":158,"d":"158.00 Ft"},{"v":170,"d":"170.00 Ft"},{"v":178,"d":"178.00 Ft"},{"v":182,"d":"182.00 Ft"},{"v":200,"d":"200.00 Ft"},{"v":206,"d":"206.00 Ft"}]
[null,"MÉRŐSZÁM 6",{"v":46,"d":"46.00 Ft"},{"v":50,"d":"50.00 Ft"},{"v":54,"d":"54.00 Ft"},{"v":56.00000000000001,"d":"56.00 Ft"},{"v":57.99999999999999,"d":"58.00 Ft"},{"v":60,"d":"60.00 Ft"},{"v":68,"d":"68.00 Ft"}]

{"sheet":"Fő mérőszámok beállításai","index":2,"n_rows":9,"n_cols":5,"rows_kept":9,"merged":[[3,1,3,3]]}
[]
[null,"FŐ MÉRŐSZÁMOK MEGADÁSA"]
[null," VÁLASSZA KI A JELENTÉS TETEJÉN MEGJELENÍTENDŐ 5 FŐ MÉRŐSZÁMOT"]
[null,"  Kattintson ide a Pénzügyi jelentés megtekintéséhez"]
[null,1,"BEVÉTEL",null,{"$f":"IF(ISBLANK(C5),\"← Kérjük, válasszon egy értéket a legördülő menüből\",IF(COUNTIF($C$5:C5,C5)>1,\"A(z) \"&C5&\" értéket egynél többször választotta.\",\"\"))","v":""}]
[null,2,"NETTÓ PROFIT",null,{"$f":"IF(ISBLANK(C6),\"← Kérjük, válasszon egy értéket a legördülő menüből\",IF(COUNTIF($C$5:C6,C6)>1,\"A(z) \"&C6&\" értéket egynél többször választotta.\",\"\"))","v":""}]
[null,3,"KAMAT",null,{"$f":"IF(ISBLANK(C7),\"← Kérjük, válasszon egy értéket a legördülő menüből\",IF(COUNTIF($C$5:C7,C7)>1,\"A(z) \"&C7&\" értéket egynél többször választotta.\",\"\"))","v":""}]
[null,4,"ÉRTÉKCSÖKKENÉS",null,{"$f":"IF(ISBLANK(C8),\"← Kérjük, válasszon egy értéket a legördülő menüből\",IF(COUNTIF($C$5:C8,C8)>1,\"A(z) \"&C8&\" értéket egynél többször választotta.\",\"\"))","v":""}]
[null,5,"MŰKÖDÉSI PROFIT",null,{"$f":"IF(ISBLANK(C9),\"← Kérjük, válasszon egy értéket a legördülő menüből\",IF(COUNTIF($C$5:C9,C9)>1,\"A(z) \"&C9&\" értéket egynél többször választotta.\",\"\"))","v":""}]

{"sheet":"Számítások","index":3,"n_rows":39,"n_cols":9,"rows_kept":39,"hidden":true}
["Ezt a munkalapot a Pénzügyi jelentés számításaihoz használja a program; hagyja rejtettként."]
[{"$nulls":3},"Pozíció"]
[null,"Jelen év",{"$f":"KijelöltÉv","v":2016},{"$f":"MATCH(C3,ElsőÉvek,0)+1","v":8}]
[null,"Előző év",{"$f":"C3-1","v":2015},{"$f":"MATCH(C4,ElsőÉvek,0)+1","v":7}]
[]
[null,"Pozíció",{"$f":"MATCH(C7,ElsőÉvek,0)+1","v":4},{"$f":"MATCH(D7,ElsőÉvek,0)+1","v":5},{"$f":"MATCH(E7,ElsőÉvek,0)+1","v":6},{"$f":"MATCH(F7,ElsőÉvek,0)+1","v":7},{"$f":"MATCH(G7,ElsőÉvek,0)+1","v":8},null,{"$f":"COUNT(C6:G6)","v":5}]
[null,"Fő mérőszámok",{"$f":"D7-1","v":2012},{"$f":"E7-1","v":2013},{"$f":"F7-1","v":2014},{"$f":"G7-1","v":2015},{"$f":"C3","v":2016}]
[{"$f":"MATCH(B8,'Pénzügyi adatok bevitele'!$B$6:$B$30,0)","v":1},{"$f":"IF('Fő mérőszámok beállításai'!C5=\"\",\"\",'Fő mérőszámok beállításai'!C5)","v":"BEVÉTEL"},{"$f":"IFERROR(INDEX('Pénzügyi adatok bevitele'!$B$6:$I$30,$A8,C$6),NA())","v":28545676},{"$f":"IFERROR(INDEX('Pénzügyi adatok bevitele'!$B$6:$I$30,$A8,D$6),NA())","v":30137492},{"$f":"IFERROR(INDEX('Pénzügyi adatok bevitele'!$B$6:$I$30,$A8,E$6),NA())","v":33008912},{"$f":"IFERROR(INDEX('Pénzügyi adatok bevitele'!$B$6:$I$30,$A8,F$6),NA())","v":36005326},{"$f":"IFERROR(INDEX('Pénzügyi adatok bevitele'!$B$6:$I$30,$A8,G$6),NA())","v":36116776},{"$f":"IFERROR(G8/F8-1,\"\")","v":{"v":3.0953753897409175E-3,"d":"0%"}}]
[{"$f":"MATCH(B9,'Pénzügyi adatok bevitele'!$B$6:$B$30,0)","v":6},{"$f":"IF('Fő mérőszámok beállításai'!C6=\"\",\"\",'Fő mérőszámok beállításai'!C6)","v":"NETTÓ PROFIT"},{"$f":"IFERROR(INDEX('Pénzügyi adatok bevitele'!$B$6:$I$30,$A9,C$6),NA())","v":11172162},{"$f":"IFERROR(INDEX('Pénzügyi adatok bevitele'!$B$6:$I$30,$A9,D$6),NA())","v":11949590},{"$f":"IFERROR(INDEX('Pénzügyi adatok bevitele'!$B$6:$I$30,$A9,E$6),NA())","v":12296718},{"$f":"IFERROR(INDEX('Pénzügyi adatok bevitele'!$B$6:$I$30,$A9,F$6),NA())","v":13254420.000000002},{"$f":"IFERROR(INDEX('Pénzügyi adatok bevitele'!$B$6:$I$30,$A9,G$6),NA())","v":13494970.000000002},{"$f":"IFERROR(G9/F9-1,\"\")","v":{"v":0.018148662861143583,"d":"2%"}}]
[{"$f":"MATCH(B10,'Pénzügyi adatok bevitele'!$B$6:$B$30,0)","v":5},{"$f":"IF('Fő mérőszámok beállításai'!C7=\"\",\"\",'Fő mérőszámok beállításai'!C7)","v":"KAMAT"},{"$f":"IFERROR(INDEX('Pénzügyi adatok bevitele'!$B$6:$I$30,$A10,C$6),NA())","v":578622},{"$f":"IFERROR(INDEX('Pénzügyi adatok bevitele'!$B$6:$I$30,$A10,D$6),NA())","v":627224},{"$f":"IFERROR(INDEX('Pénzügyi adatok bevitele'!$B$6:$I$30,$A10,E$6),NA())","v":629706},{"$f":"IFERROR(INDEX('Pénzügyi adatok bevitele'!$B$6:$I$30,$A10,F$6),NA())","v":667660},{"$f":"IFERROR(INDEX('Pénzügyi adatok bevitele'!$B$6:$I$30,$A10,G$6),NA())","v":757894},{"v":0.13514962705568712,"d":"14%"}]
[{"$f":"MATCH(B11,'Pénzügyi adatok bevitele'!$B$6:$B$30,0)","v":4},{"$f":"IF('Fő mérőszámok beállításai'!C8=\"\",\"\",'Fő mérőszámok beállításai'!C8)","v":"ÉRTÉKCSÖKKENÉS"},{"$f":"IFERROR(INDEX('Pénzügyi adatok bevitele'!$B$6:$I$30,$A11,C$6),NA())","v":931384},{"$f":"IFERROR(INDEX('Pénzügyi adatok bevitele'!$B$6:$I$30,$A11,D$6),NA())","v":994842},{"$f":"IFERROR(INDEX('Pénzügyi adatok bevitele'!$B$6:$I$30,$A11,E$6),NA())","v":1004821.9999999999},{"$f":"IFERROR(INDEX('Pénzügyi adatok bevitele'!$B$6:$I$30,$A11,F$6),NA())","v":1013684},{"$f":"IFERROR(INDEX('Pénzügyi adatok bevitele'!$B$6:$I$30,$A11,G$6),NA())","v":1109376},{"v":0.09440022728976682,"d":"9%"}]
[{"$f":"MATCH(B12,'Pénzügyi adatok bevitele'!$B$6:$B$30,0)","v":3},{"$f":"IF('Fő mérőszámok beállításai'!C9=\"\",\"\",'Fő mérőszámok beállításai'!C9)","v":"MŰKÖDÉSI PROFIT"},{"$f":"IFERROR(INDEX('Pénzügyi adatok bevitele'!$B$6:$I$30,$A12,C$6),NA())","v":13771538},{"$f":"IFERROR(INDEX('Pénzügyi adatok bevitele'!$B$6:$I$30,$A12,D$6),NA())","v":15128650},{"$f":"IFERROR(INDEX('Pénzügyi adatok bevitele'!$B$6:$I$30,$A12,E$6),NA())","v":15351051.999999998},{"$f":"IFERROR(INDEX('Pénzügyi adatok bevitele'!$B$6:$I$30,$A12,F$6),NA())","v":15463566},{"$f":"IFERROR(INDEX('Pénzügyi adatok bevitele'!$B$6:$I$30,$A12,G$6),NA())","v":14685198.000000002},{"v":-0.05033560822904615,"d":"-5%"}]
[]
[null,"Összes mérőszám (legfeljebb 25 mérőszámig működik)"]
[{"$f":"ROWS($B$15:B15)","v":1},{"$f":"IF('Pénzügyi adatok bevitele'!B6=0,\"\",'Pénzügyi adatok bevitele'!B6)","v":"BEVÉTEL"},{"$f":"IF($B15=\"\",NA(),IFERROR(INDEX('Pénzügyi adatok bevitele'!$B$6:$I$30,$A15,C$6),NA()))","v":28545676},{"$f":"IF($B15=\"\",NA(),IFERROR(INDEX('Pénzügyi adatok bevitele'!$B$6:$I$30,$A15,D$6),NA()))","v":30137492},{"$f":"IF($B15=\"\",NA(),IFERROR(INDEX('Pénzügyi adatok bevitele'!$B$6:$I$30,$A15,E$6),NA()))","v":33008912},{"$f":"IF($B15=\"\",NA(),IFERROR(INDEX('Pénzügyi adatok bevitele'!$B$6:$I$30,$A15,F$6),NA()))","v":36005326},{"$f":"IF($B15=\"\",NA(),IFERROR(INDEX('Pénzügyi adatok bevitele'!$B$6:$I$30,$A15,G$6),NA()))","v":36116776}]
[{"$f":"ROWS($B$15:B16)","v":2},{"$f":"IF('Pénzügyi adatok bevitele'!B7=0,\"\",'Pénzügyi adatok bevitele'!B7)","v":"MŰKÖDÉSI KIADÁSOK"},{"$f":"IF($B16=\"\",NA(),IFERROR(INDEX('Pénzügyi adatok bevitele'!$B$6:$I$30,$A16,C$6),NA()))","v":15184972},{"$f":"IF($B16=\"\",NA(),IFERROR(INDEX('Pénzügyi adatok bevitele'!$B$6:$I$30,$A16,D$6),NA()))","v":15780254},{"$f":"IF($B16=\"\",NA(),IFERROR(INDEX('Pénzügyi adatok bevitele'!$B$6:$I$30,$A16,E$6),NA()))","v":16334874},{"$f":"IF($B16=\"\",NA(),IFERROR(INDEX('Pénzügyi adatok bevitele'!$B$6:$I$30,$A16,F$6),NA()))","v":16176666},{"$f":"IF($B16=\"\",NA(),IFERROR(INDEX('Pénzügyi adatok bevitele'!$B$6:$I$30,$A16,G$6),NA()))","v":18883890}]
[{"$f":"ROWS($B$15:B17)","v":3},{"$f":"IF('Pénzügyi adatok bevitele'!B8=0,\"\",'Pénzügyi adatok bevitele'!B8)","v":"MŰKÖDÉSI PROFIT"},{"$f":"IF($B17=\"\",NA(),IFERROR(INDEX('Pénzügyi adatok bevitele'!$B$6:$I$30,$A17,C$6),NA()))","v":13771538},{"$f":"IF($B17=\"\",NA(),IFERROR(INDEX('Pénzügyi adatok bevitele'!$B$6:$I$30,$A17,D$6),NA()))","v":15128650},{"$f":"IF($B17=\"\",NA(),IFERROR(INDEX('Pénzügyi adatok bevitele'!$B$6:$I$30,$A17,E$6),NA()))","v":15351051.999999998},{"$f":"IF($B17=\"\",NA(),IFERROR(INDEX('Pénzügyi adatok bevitele'!$B$6:$I$30,$A17,F$6),NA()))","v":15463566},{"$f":"IF($B17=\"\",NA(),IFERROR(INDEX('Pénzügyi adatok bevitele'!$B$6:$I$30,$A17,G$6),NA()))","v":14685198.000000002}]
[{"$f":"ROWS($B$15:B18)","v":4},{"$f":"IF('Pénzügyi adatok bevitele'!B9=0,\"\",'Pénzügyi adatok bevitele'!B9)","v":"ÉRTÉKCSÖKKENÉS"},{"$f":"IF($B18=\"\",NA(),IFERROR(INDEX('Pénzügyi adatok bevitele'!$B$6:$I$30,$A18,C$6),NA()))","v":931384},{"$f":"IF($B18=\"\",NA(),IFERROR(INDEX('Pénzügyi adatok bevitele'!$B$6:$I$30,$A18,D$6),NA()))","v":994842},{"$f":"IF($B18=\"\",NA(),IFERROR(INDEX('Pénzügyi adatok bevitele'!$B$6:$I$30,$A18,E$6),NA()))","v":1004821.9999999999},{"$f":"IF($B18=\"\",NA(),IFERROR(INDEX('Pénzügyi adatok bevitele'!$B$6:$I$30,$A18,F$6),NA()))","v":1013684},{"$f":"IF($B18=\"\",NA(),IFERROR(INDEX('Pénzügyi adatok bevitele'!$B$6:$I$30,$A18,G$6),NA()))","v":1109376}]
[{"$f":"ROWS($B$15:B19)","v":5},{"$f":"IF('Pénzügyi adatok bevitele'!B10=0,\"\",'Pénzügyi adatok bevitele'!B10)","v":"KAMAT"},{"$f":"IF($B19=\"\",NA(),IFERROR(INDEX('Pénzügyi adatok bevitele'!$B$6:$I$30,$A19,C$6),NA()))","v":578622},{"$f":"IF($B19=\"\",NA(),IFERROR(INDEX('Pénzügyi adatok bevitele'!$B$6:$I$30,$A19,D$6),NA()))","v":627224},{"$f":"IF($B19=\"\",NA(),IFERROR(INDEX('Pénzügyi adatok bevitele'!$B$6:$I$30,$A19,E$6),NA()))","v":629706},{"$f":"IF($B19=\"\",NA(),IFERROR(INDEX('Pénzügyi adatok bevitele'!$B$6:$I$30,$A19,F$6),NA()))","v":667660},{"$f":"IF($B19=\"\",NA(),IFERROR(INDEX('Pénzügyi adatok bevitele'!$B$6:$I$30,$A19,G$6),NA()))","v":757894}]
[{"$f":"ROWS($B$15:B20)","v":6},{"$f":"IF('Pénzügyi adatok bevitele'!B11=0,\"\",'Pénzügyi adatok bevitele'!B11)","v":"NETTÓ PROFIT"},{"$f":"IF($B20=\"\",NA(),IFERROR(INDEX('Pénzügyi adatok bevitele'!$B$6:$I$30,$A20,C$6),NA()))","v":11172162},{"$f":"IF($B20=\"\",NA(),IFERROR(INDEX('Pénzügyi adatok bevitele'!$B$6:$I$30,$A20,D$6),NA()))","v":11949590},{"$f":"IF($B20=\"\",NA(),IFERROR(INDEX('Pénzügyi adatok bevitele'!$B$6:$I$30,$A20,E$6),NA()))","v":12296718},{"$f":"IF($B20=\"\",NA(),IFERROR(INDEX('Pénzügyi adatok bevitele'!$B$6:$I$30,$A20,F$6),NA()))","v":13254420.000000002},{"$f":"IF($B20=\"\",NA(),IFERROR(INDEX('Pénzügyi adatok bevitele'!$B$6:$I$30,$A20,G$6),NA()))","v":13494970.000000002}]
{"$rows_left_out":19}