{"text_format":"3","workbook":"xlsx","n_sheets":4,"sheets":["Početak","PARAMETRI PROJEKTA","DETALJI O PROJEKTU","UKUPNI ZBROJEVI ZA PROJEKT"],"not_rendered":{"charts":2,"defined_names":3,"pivot_tables":1},"read":"whole","date_system":"1900"}

{"sheet":"Početak","index":0,"n_rows":8,"n_cols":2,"rows_kept":8}
[null,"O OVOM PREDLOŠKU"]
[]
[null,"Pomoću ove radne knjige pratite parametri projekta, detalji o projektu i ukupni zbrojevi za projekt tijekom Planiranje projekata za odvjetničke urede."]
[null,"Na radnom listu Parametri projekta ispunite polje Naziv tvrtke i ono će se automatski ažurirati na svim drugim radnim listovima."]
[null,"Na radni list Parametri projekta unesite podatke da biste ažurirali stupčaste grafikone, a isto učinite i na radnom listu Detalji o projektu. Automatski se ažurira i zaokretna tablica na radnom listu Ukupni zbrojevi za projekt."]
[null,"Napomena:  "]
{"$rows_left_out":3}
{"sheet":"PARAMETRI PROJEKTA","index":1,"n_rows":19,"n_cols":9,"rows_kept":19}
["Na ovom radnom listu stvorite parametri projekta. U ćeliju zdesna unesite naziv tvrtke. Korisne upute nalaze se u ćelijama u tom stupcu.","Naziv tvrtke"]
["U ćeliji zdesna nalazi se naslov ovog radnog lista.","Planiranje projekata za odvjetničke urede"]
["Poruka o povjerljivosti podataka nalazi se u ćeliji s desne strane.",{"$f":"B1&\" – povjerljivo\"","v":"Naziv tvrtke – povjerljivo"}]
["U ćeliji zdesna nalazi se savjet.","Osjenčane se ćelije izračunavaju automatski. U njih ne morate ništa unositi."]
["Unesite pojedinosti u tablicu Parametri počevši s ćelijom s desne strane. Sljedeća je uputa u ćeliji A12.","VRSTA PROJEKTA","PARTNER ZA OPĆE PRAVNE POSLOVE","PRAVNIK ZA KORPORATIVNO PRAVO","BRANITELJ PARNIČAR","PRAVNIK ZA INTELEKTUALNO VLASNIŠTVO","PRAVNIK ZA STEČAJEVE","ADMINISTRATORI","Zbroj"]
[null,"Osnivanje tvrtke",{"v":0.1,"d":"10%"},{"v":0.4,"d":"40%"},{"v":0,"d":"0%"},{"v":0,"d":"0%"},{"v":0,"d":"0%"},{"v":0.5,"d":"50%"},{"$f":"SUM(Parametri[[#This Row],[PARTNER ZA OPĆE PRAVNE POSLOVE]:[ADMINISTRATORI]])","v":{"v":1,"d":"100%"}}]
{"$rows_left_out":14}
{"sheet":"DETALJI O PROJEKTU","index":2,"n_rows":10,"n_cols":25,"rows_kept":10,"merged":[[1,24,8,28]]}
["Na ovom radnom listu stvorite detaljo o projektu. Naziv tvrtke automatski se ažurira u ćeliji zdesna. Korisne upute nalaze se u ćelijama u tom stupcu. Pomoću tipke sa strelicom prema dolje počnite s radom.",{"$f":"'PARAMETRI PROJEKTA'!B1","v":"Naziv tvrtke"}]
["Naslov tog radnog lista nalazi se u ćeliji s desno strane, a savjet s informacijama u ćeliji Y2.",{"$f":"'PARAMETRI PROJEKTA'!B2","v":"Planiranje projekata za odvjetničke urede"},{"$nulls":22},"INFORMACIJE:\nDa biste dodali redak, odaberite najdonju ćeliju u tijelu tablice (ne redak zbroja) pa pritisnite tablulator ili pritisnite SHIFT pa F10 u tablici ondje gdje želite umetnuti redak te odaberite Umetani | Reci tablice iznad/ispod.\nObavezno izbrišite sve neiskorištene retke jer bi se inače, s obzirom na to da se u zaokretnoj tablici UKUPNI ZBROJEVI ZA PROJEKT koriste sve ćelije tablice, dobili pogrešni rezultati."]
["Poruka o povjerljivosti podataka nalazi se u ćeliji s desne strane.",{"$f":"'PARAMETRI PROJEKTA'!B3","v":"Naziv tvrtke – povjerljivo"}]
["Unesite informacije u tablicu Detalji počevši s ćelijom s desne strane. Vrsta projekata u tablici Detalji s desne strane automatski se ažuriraju iz tablice Parametri na radnom listu Parametri projekta.","NAZIV PROJEKTA","VRSTA PROJEKTA","PROCIJENJENI POČETAK","PROCIJENJENI ZAVRŠETAK","STVARNI POČETAK","STVARNI ZAVRŠETAK","PROCIJENJENI RAD","STVARNI RAD","PROCIJENJENO TRAJANJE","STVARNO TRAJANJE","PARTNER ZA OPĆE PRAVNE POSLOVE","PRAVNIK ZA KORPORATIVNO PRAVO","BRANITELJ PARNIČAR","PRAVNIK ZA INTELEKTUALNO VLASNIŠTVO","PRAVNIK ZA STEČAJEVE","ADMINISTRATORI","PARTNER ZA OPĆE PRAVNE POSLOVE 2","PRAVNIK ZA KORPORATIVNO PRAVO 2","BRANITELJ PARNIČAR 2","PRAVNIK ZA INTELEKTUALNO VLASNIŠTVO 2","PRAVNIK ZA STEČAJEVE 2","ADMINISTRATORI 2"]
[null,"Projekt 1","Osnivanje tvrtke",{"$f":"TODAY()","v":"2019-02-19"},{"$f":"TODAY()+60","v":"2019-04-20"},{"$f":"TODAY()+10","v":"2019-03-01"},{"$f":"TODAY()+65","v":"2019-04-25"},200,220,{"$f":"DAYS360(Detalji[[#This Row],[PROCIJENJENI POČETAK]],Detalji[[#This Row],[PROCIJENJENI ZAVRŠETAK]],FALSE)","v":61},{"$f":"DAYS360(Detalji[[#This Row],[STVARNI POČETAK]],Detalji[[#This Row],[STVARNI ZAVRŠETAK]],FALSE)","v":54},{"$f":"INDEX(Parametri[],MATCH(Detalji[[#This Row],[VRSTA PROJEKTA]],Parametri[VRSTA PROJEKTA],0),MATCH(Detalji[[#Headers],[PARTNER ZA OPĆE PRAVNE POSLOVE]],Parametri[#Headers],0))*INDEX('PARAMETRI PROJEKTA'!$B$12:$H$12,1,MATCH(Detalji[[#Headers],[PARTNER ZA OPĆE PRAVNE POSLOVE]],Parametri[#Headers],0))*Detalji[[#This Row],[PROCIJENJENI RAD]]","v":{"v":7000,"d":"7,000.00 kn"}},{"$f":"INDEX(Parametri[],MATCH(Detalji[[#This Row],[VRSTA PROJEKTA]],Parametri[VRSTA PROJEKTA],0),MATCH(Detalji[[#Headers],[PRAVNIK ZA KORPORATIVNO PRAVO]],Parametri[#Headers],0))*INDEX('PARAMETRI PROJEKTA'!$B$12:$H$12,1,MATCH(Detalji[[#Headers],[PRAVNIK ZA KORPORATIVNO PRAVO]],Parametri[#Headers],0))*Detalji[[#This Row],[PROCIJENJENI RAD]]","v":{"v":20000,"d":"20,000.00 kn"}},{"$f":"INDEX(Parametri[],MATCH(Detalji[[#This Row],[VRSTA PROJEKTA]],Parametri[VRSTA PROJEKTA],0),MATCH(Detalji[[#Headers],[BRANITELJ PARNIČAR]],Parametri[#Headers],0))*INDEX('PARAMETRI PROJEKTA'!$B$12:$H$12,1,MATCH(Detalji[[#Headers],[BRANITELJ PARNIČAR]],Parametri[#Headers],0))*Detalji[[#This Row],[PROCIJENJENI RAD]]","v":{"v":0,"d":"0.00 kn"}},{"$f":"INDEX(Parametri[],MATCH(Detalji[[#This Row],[VRSTA PROJEKTA]],Parametri[VRSTA PROJEKTA],0),MATCH(Detalji[[#Headers],[PRAVNIK ZA INTELEKTUALNO VLASNIŠTVO]],Parametri[#Headers],0))*INDEX('PARAMETRI PROJEKTA'!$B$12:$H$12,1,MATCH(Detalji[[#Headers],[PRAVNIK ZA INTELEKTUALNO VLASNIŠTVO]],Parametri[#Headers],0))*Detalji[[#This Row],[PROCIJENJENI RAD]]","v":{"v":0,"d":"0.00 kn"}},{"$f":"INDEX(Parametri[],MATCH(Detalji[[#This Row],[VRSTA PROJEKTA]],Parametri[VRSTA PROJEKTA],0),MATCH(Detalji[[#Headers],[PRAVNIK ZA STEČAJEVE]],Parametri[#Headers],0))*INDEX('PARAMETRI PROJEKTA'!$B$12:$H$12,1,MATCH(Detalji[[#Headers],[PRAVNIK ZA STEČAJEVE]],Parametri[#Headers],0))*Detalji[[#This Row],[PROCIJENJENI RAD]]","v":{"v":0,"d":"0.00 kn"}},{"$f":"INDEX(Parametri[],MATCH(Detalji[[#This Row],[VRSTA PROJEKTA]],Parametri[VRSTA PROJEKTA],0),MATCH(Detalji[[#Headers],[ADMINISTRATORI]],Parametri[#Headers],0))*INDEX('PARAMETRI PROJEKTA'!$B$12:$H$12,1,MATCH(Detalji[[#Headers],[ADMINISTRATORI]],Parametri[#Headers],0))*Detalji[[#This Row],[PROCIJENJENI RAD]]","v":{"v":12500,"d":"12,500.00 kn"}},{"$f":"INDEX(Parametri[],MATCH(Detalji[[#This Row],[VRSTA PROJEKTA]],Parametri[VRSTA PROJEKTA],0),MATCH(Detalji[[#Headers],[PARTNER ZA OPĆE PRAVNE POSLOVE]],Parametri[#Headers],0))*INDEX('PARAMETRI PROJEKTA'!$B$12:$H$12,1,MATCH(Detalji[[#Headers],[PARTNER ZA OPĆE PRAVNE POSLOVE]],Parametri[#Headers],0))*Detalji[[#This Row],[STVARNI RAD]]","v":{"v":7700,"d":"7,700.00 kn"}},{"$f":"INDEX(Parametri[],MATCH(Detalji[[#This Row],[VRSTA PROJEKTA]],Parametri[VRSTA PROJEKTA],0),MATCH(Detalji[[#Headers],[PRAVNIK ZA KORPORATIVNO PRAVO]],Parametri[#Headers],0))*INDEX('PARAMETRI PROJEKTA'!$B$12:$H$12,1,MATCH(Detalji[[#Headers],[PRAVNIK ZA KORPORATIVNO PRAVO]],Parametri[#Headers],0))*Detalji[[#This Row],[STVARNI RAD]]","v":{"v":22000,"d":"22,000.00 kn"}},{"$f":"INDEX(Parametri[],MATCH(Detalji[[#This Row],[VRSTA PROJEKTA]],Parametri[VRSTA PROJEKTA],0),MATCH(Detalji[[#Headers],[BRANITELJ PARNIČAR]],Parametri[#Headers],0))*INDEX('PARAMETRI PROJEKTA'!$B$12:$H$12,1,MATCH(Detalji[[#Headers],[BRANITELJ PARNIČAR]],Parametri[#Headers],0))*Detalji[[#This Row],[STVARNI RAD]]","v":{"v":0,"d":"0.00 kn"}},{"$f":"INDEX(Parametri[],MATCH(Detalji[[#This Row],[VRSTA PROJEKTA]],Parametri[VRSTA PROJEKTA],0),MATCH(Detalji[[#Headers],[PRAVNIK ZA INTELEKTUALNO VLASNIŠTVO]],Parametri[#Headers],0))*INDEX('PARAMETRI PROJEKTA'!$B$12:$H$12,1,MATCH(Detalji[[#Headers],[PRAVNIK ZA INTELEKTUALNO VLASNIŠTVO]],Parametri[#Headers],0))*Detalji[[#This Row],[STVARNI RAD]]","v":{"v":0,"d":"0.00 kn"}},{"$f":"INDEX(Parametri[],MATCH(Detalji[[#This Row],[VRSTA PROJEKTA]],Parametri[VRSTA PROJEKTA],0),MATCH(Detalji[[#Headers],[PRAVNIK ZA STEČAJEVE]],Parametri[#Headers],0))*INDEX('PARAMETRI PROJEKTA'!$B$12:$H$12,1,MATCH(Detalji[[#Headers],[PRAVNIK ZA STEČAJEVE]],Parametri[#Headers],0))*Detalji[[#This Row],[STVARNI RAD]]","v":{"v":0,"d":"0.00 kn"}},{"$f":"INDEX(Parametri[],MATCH(Detalji[[#This Row],[VRSTA PROJEKTA]],Parametri[VRSTA PROJEKTA],0),MATCH(Detalji[[#Headers],[ADMINISTRATORI]],Parametri[#Headers],0))*INDEX('PARAMETRI PROJEKTA'!$B$12:$H$12,1,MATCH(Detalji[[#Headers],[ADMINISTRATORI]],Parametri[#Headers],0))*Detalji[[#This Row],[STVARNI RAD]]","v":{"v":13750,"d":"13,750.00 kn"}}]
[null,"Projekt 2","Preuzimanje tvrtke",{"$f":"TODAY()+30","v":"2019-03-21"},{"$f":"TODAY()+100","v":"2019-05-30"},{"$f":"TODAY()+40","v":"2019-03-31"},{"$f":"TODAY()+110","v":"2019-06-09"},400,390,{"$f":"DAYS360(Detalji[[#This Row],[PROCIJENJENI POČETAK]],Detalji[[#This Row],[PROCIJENJENI ZAVRŠETAK]],FALSE)","v":69},{"$f":"DAYS360(Detalji[[#This Row],[STVARNI POČETAK]],Detalji[[#This Row],[STVARNI ZAVRŠETAK]],FALSE)","v":69},{"$f":"INDEX(Parametri[],MATCH(Detalji[[#This Row],[VRSTA PROJEKTA]],Parametri[VRSTA PROJEKTA],0),MATCH(Detalji[[#Headers],[PARTNER ZA OPĆE PRAVNE POSLOVE]],Parametri[#Headers],0))*INDEX('PARAMETRI PROJEKTA'!$B$12:$H$12,1,MATCH(Detalji[[#Headers],[PARTNER ZA OPĆE PRAVNE POSLOVE]],Parametri[#Headers],0))*Detalji[[#This Row],[PROCIJENJENI RAD]]","v":{"v":14000,"d":"14,000.00 kn"}},{"$f":"INDEX(Parametri[],MATCH(Detalji[[#This Row],[VRSTA PROJEKTA]],Parametri[VRSTA PROJEKTA],0),MATCH(Detalji[[#Headers],[PRAVNIK ZA KORPORATIVNO PRAVO]],Parametri[#Headers],0))*INDEX('PARAMETRI PROJEKTA'!$B$12:$H$12,1,MATCH(Detalji[[#Headers],[PRAVNIK ZA KORPORATIVNO PRAVO]],Parametri[#Headers],0))*Detalji[[#This Row],[PROCIJENJENI RAD]]","v":{"v":40000,"d":"40,000.00 kn"}},{"$f":"INDEX(Parametri[],MATCH(Detalji[[#This Row],[VRSTA PROJEKTA]],Parametri[VRSTA PROJEKTA],0),MATCH(Detalji[[#Headers],[BRANITELJ PARNIČAR]],Parametri[#Headers],0))*INDEX('PARAMETRI PROJEKTA'!$B$12:$H$12,1,MATCH(Detalji[[#Headers],[BRANITELJ PARNIČAR]],Parametri[#Headers],0))*Detalji[[#This Row],[PROCIJENJENI RAD]]","v":{"v":0,"d":"0.00 kn"}},{"$f":"INDEX(Parametri[],MATCH(Detalji[[#This Row],[VRSTA PROJEKTA]],Parametri[VRSTA PROJEKTA],0),MATCH(Detalji[[#Headers],[PRAVNIK ZA INTELEKTUALNO VLASNIŠTVO]],Parametri[#Headers],0))*INDEX('PARAMETRI PROJEKTA'!$B$12:$H$12,1,MATCH(Detalji[[#Headers],[PRAVNIK ZA INTELEKTUALNO VLASNIŠTVO]],Parametri[#Headers],0))*Detalji[[#This Row],[PROCIJENJENI RAD]]","v":{"v":11000,"d":"11,000.00 kn"}},{"$f":"INDEX(Parametri[],MATCH(Detalji[[#This Row],[VRSTA PROJEKTA]],Parametri[VRSTA PROJEKTA],0),MATCH(Detalji[[#Headers],[PRAVNIK ZA STEČAJEVE]],Parametri[#Headers],0))*INDEX('PARAMETRI PROJEKTA'!$B$12:$H$12,1,MATCH(Detalji[[#Headers],[PRAVNIK ZA STEČAJEVE]],Parametri[#Headers],0))*Detalji[[#This Row],[PROCIJENJENI RAD]]","v":{"v":0,"d":"0.00 kn"}},{"$f":"INDEX(Parametri[],MATCH(Detalji[[#This Row],[VRSTA PROJEKTA]],Parametri[VRSTA PROJEKTA],0),MATCH(Detalji[[#Headers],[ADMINISTRATORI]],Parametri[#Headers],0))*INDEX('PARAMETRI PROJEKTA'!$B$12:$H$12,1,MATCH(Detalji[[#Headers],[ADMINISTRATORI]],Parametri[#Headers],0))*Detalji[[#This Row],[PROCIJENJENI RAD]]","v":{"v":20000,"d":"20,000.00 kn"}},{"$f":"INDEX(Parametri[],MATCH(Detalji[[#This Row],[VRSTA PROJEKTA]],Parametri[VRSTA PROJEKTA],0),MATCH(Detalji[[#Headers],[PARTNER ZA OPĆE PRAVNE POSLOVE]],Parametri[#Headers],0))*INDEX('PARAMETRI PROJEKTA'!$B$12:$H$12,1,MATCH(Detalji[[#Headers],[PARTNER ZA OPĆE PRAVNE POSLOVE]],Parametri[#Headers],0))*Detalji[[#This Row],[STVARNI RAD]]","v":{"v":13650,"d":"13,650.00 kn"}},{"$f":"INDEX(Parametri[],MATCH(Detalji[[#This Row],[VRSTA PROJEKTA]],Parametri[VRSTA PROJEKTA],0),MATCH(Detalji[[#Headers],[PRAVNIK ZA KORPORATIVNO PRAVO]],Parametri[#Headers],0))*INDEX('PARAMETRI PROJEKTA'!$B$12:$H$12,1,MATCH(Detalji[[#Headers],[PRAVNIK ZA KORPORATIVNO PRAVO]],Parametri[#Headers],0))*Detalji[[#This Row],[STVARNI RAD]]","v":{"v":39000,"d":"39,000.00 kn"}},{"$f":"INDEX(Parametri[],MATCH(Detalji[[#This Row],[VRSTA PROJEKTA]],Parametri[VRSTA PROJEKTA],0),MATCH(Detalji[[#Headers],[BRANITELJ PARNIČAR]],Parametri[#Headers],0))*INDEX('PARAMETRI PROJEKTA'!$B$12:$H$12,1,MATCH(Detalji[[#Headers],[BRANITELJ PARNIČAR]],Parametri[#Headers],0))*Detalji[[#This Row],[STVARNI RAD]]","v":{"v":0,"d":"0.00 kn"}},{"$f":"INDEX(Parametri[],MATCH(Detalji[[#This Row],[VRSTA PROJEKTA]],Parametri[VRSTA PROJEKTA],0),MATCH(Detalji[[#Headers],[PRAVNIK ZA INTELEKTUALNO VLASNIŠTVO]],Parametri[#Headers],0))*INDEX('PARAMETRI PROJEKTA'!$B$12:$H$12,1,MATCH(Detalji[[#Headers],[PRAVNIK ZA INTELEKTUALNO VLASNIŠTVO]],Parametri[#Headers],0))*Detalji[[#This Row],[STVARNI RAD]]","v":{"v":10725,"d":"10,725.00 kn"}},{"$f":"INDEX(Parametri[],MATCH(Detalji[[#This Row],[VRSTA PROJEKTA]],Parametri[VRSTA PROJEKTA],0),MATCH(Detalji[[#Headers],[PRAVNIK ZA STEČAJEVE]],Parametri[#Headers],0))*INDEX('PARAMETRI PROJEKTA'!$B$12:$H$12,1,MATCH(Detalji[[#Headers],[PRAVNIK ZA STEČAJEVE]],Parametri[#Headers],0))*Detalji[[#This Row],[STVARNI RAD]]","v":{"v":0,"d":"0.00 kn"}},{"$f":"INDEX(Parametri[],MATCH(Detalji[[#This Row],[VRSTA PROJEKTA]],Parametri[VRSTA PROJEKTA],0),MATCH(Detalji[[#Headers],[ADMINISTRATORI]],Parametri[#Headers],0))*INDEX('PARAMETRI PROJEKTA'!$B$12:$H$12,1,MATCH(Detalji[[#Headers],[ADMINISTRATORI]],Parametri[#Headers],0))*Detalji[[#This Row],[STVARNI RAD]]","v":{"v":19500,"d":"19,500.00 kn"}}]
{"$rows_left_out":5}
{"sheet":"UKUPNI ZBROJEVI ZA PROJEKT","index":3,"n_rows":11,"n_cols":16,"rows_kept":11,"merged":[[3,2,3,7],[3,8,3,13],[3,15,14,19]]}
["Dohvatite tablicu Ukupni zbrojevi za projekt na ovom radnom listu. Naziv tvrtke automatski se ažurira u ćeliji zdesna. Korisne upute nalaze se u ćelijama u tom stupcu. Pomoću tipke sa strelicom prema dolje počnite s radom.",{"$f":"'PARAMETRI PROJEKTA'!B1","v":"Naziv tvrtke"}]
["U ćeliji zdesna nalazi se naslov ovog radnog lista.",{"$f":"'PARAMETRI PROJEKTA'!B2","v":"Planiranje projekata za odvjetničke urede"}]
["Poruka o povjerljivosti podataka nalazi se u ćeliji s desne strane.",{"$f":"'PARAMETRI PROJEKTA'!B3","v":"Naziv tvrtke – povjerljivo"}]
["Natpis Procijenjeno nalazi se u ćeliji C4, natpis Stvarno u ćeliji I4, a savjet s informacijama u ćeliji P4.",null,"PROCIJENJENO",{"$nulls":5},"STVARNO",{"$nulls":6},"INFORMACIJE: \nTa se zaokretna tablica neće automatski osvježavati.  Da biste je osvježili, odaberite je (odaberite bilo koju ćeliju u zaokretnoj tablici) pa na kartici vrpce ALATI ZAOKRETNE TABLICE | ANALIZA odaberite Osvježi.  Ili, odabravši zaokretnu tablicu, pritisnite SHIFT + F10 pa odaberite Osvježi."]
["Zaokretna tablica koja počinje u ćeliji s desne strane ažurira se automatski","NAZIV PROJEKTA","PARTNER ZA OPĆE PRAVNE POSLOVE ","KORPORATIVNO PRAVO ","BRANITELJ PARNIČAR ","INTELEKTUALNOG VLASNIŠTVO ","STEČAJ ","ADMINISTRATORI ","PARTNER ZA OPĆE PRAVNE POSLOVE  ","KORPORATIVNO PRAVO","BRANITELJ PARNIČAR  ","STEČAJ","INTELEKTUALNOG VLASNIŠTVO","ADMINISTRATORI  "]
[null,"Projekt 1",{"v":7000,"d":"7,000.00 kn"},{"v":20000,"d":"20,000.00 kn"},{"v":0,"d":"0.00 kn"},{"v":0,"d":"0.00 kn"},{"v":0,"d":"0.00 kn"},{"v":12500,"d":"12,500.00 kn"},{"v":7700,"d":"7,700.00 kn"},{"v":22000,"d":"22,000.00 kn"},{"v":0,"d":"0.00 kn"},{"v":0,"d":"0.00 kn"},{"v":0,"d":"0.00 kn"},{"v":13750,"d":"13,750.00 kn"}]
{"$rows_left_out":5}