{"text_format":"3","workbook":"xlsx","n_sheets":4,"sheets":["Evidencija rezultata","Vaš uspjeh","Postavke","Izračuni"],"not_rendered":{"defined_names":3,"comments":1},"read":"whole","date_system":"1900"}

{"sheet":"Evidencija rezultata","index":0,"n_rows":14,"n_cols":6,"rows_kept":14}
[null,"Ovdje unesite rezultate"]
[]
[null,null,"Predmet","Vrsta","Opis","Rezultat"]
[null,null,"Moderni francuski","Domaća zadaća","Povijest 2. svjetskog rata",{"v":0.8,"d":"80%"}]
[null,null,"Napredno programiranje u jeziku Java","Polusemestralni ispit",null,{"v":0.75,"d":"75%"}]
[null,null,"Španjolski","Domaća zadaća",null,{"v":0.5,"d":"50%"}]
[null,null,"Teorijska fizika","Domaća zadaća",null,{"v":0.95,"d":"95%"}]
[null,null,"Moderni francuski","Domaća zadaća","Povijest 2. svjetskog rata",{"v":0.9,"d":"90%"}]
[null,null,"Moderni francuski","Domaća zadaća","Stranice 30. – 41.",{"v":0.8,"d":"80%"}]
[null,null,"Sastavak","Esej","Rasprava",{"v":0.95,"d":"95%"}]
{"$rows_left_out":5}
{"sheet":"Vaš uspjeh","index":1,"n_rows":31,"n_cols":8,"rows_kept":31}
[null,"Vaš uspjeh"]
[]
[null,null,"Ukupne vrijednosti"]
[null,null,{"$f":"\"Sati: \"&SUM(tblKlase[Broj sati])","v":"Sati: 24"},{"$f":"AVERAGE(D7:D31)","v":{"v":0.8104761904761906,"d":"81%"}},{"$f":"AVERAGE(E7:E31)","v":{"v":2.7142857142857144,"d":"2.71"}},{"$f":"SUM(F7:F31)","v":{"v":2.625,"d":"2.63"}},{"$f":"IFERROR(HLOOKUP(D4,Popis_mapiranja_prosjeka_ocjena,2),\"\")","v":"B-"}]
[]
[null,null,"Predmeti","%","Prosjek","Ponderirani prosjek ocjena","Slovo","Ukupni uspjeh"]
[null,null,{"$f":"Izračuni!C6","v":"Moderni francuski"},{"$f":"Izračuni!AL6","v":{"v":0.8333333333333334,"d":"83%"}},{"$f":"Izračuni!AM6","v":{"v":3,"d":"3.00"}},{"$f":"IFERROR(E7*Postavke!D9/SUM(tblKlase[Broj sati]),\"\")","v":{"v":0.375,"d":"0.38"}},{"$f":"Izračuni!AN6","v":"B"}]
[null,null,{"$f":"Izračuni!C7","v":"Teorijska fizika"},{"$f":"Izračuni!AL7","v":{"v":0.95,"d":"95%"}},{"$f":"Izračuni!AM7","v":{"v":4,"d":"4.00"}},{"$f":"IFERROR(E8*Postavke!D10/SUM(tblKlase[Broj sati]),\"\")","v":{"v":0.5,"d":"0.50"}},{"$f":"Izračuni!AN7","v":"A"}]
[null,null,{"$f":"Izračuni!C8","v":"Matematika 1"},{"$f":"Izračuni!AL8","v":{"v":0.8000000000000002,"d":"80%"}},{"$f":"Izračuni!AM8","v":2.67},{"$f":"IFERROR(E9*Postavke!D11/SUM(tblKlase[Broj sati]),\"\")","v":{"v":0.445,"d":"0.45"}},{"$f":"Izračuni!AN8","v":"B-"}]
[null,null,{"$f":"Izračuni!C9","v":"Matematika 2"},{"$f":"Izračuni!AL9","v":{"v":0.89,"d":"89%"}},{"$f":"Izračuni!AM9","v":3.33},{"$f":"IFERROR(E10*Postavke!D12/SUM(tblKlase[Broj sati]),\"\")","v":{"v":0.555,"d":"0.56"}},{"$f":"Izračuni!AN9","v":"B+"}]
{"$rows_left_out":22}
{"sheet":"Postavke","index":2,"n_rows":15,"n_cols":16,"rows_kept":15,"merged":[[5,2,5,15]]}
[null,"Postavke"]
[null,null,"Mapiranje rezultata i prosjeka ocjena"]
[null,null,"Postotak",{"v":0,"d":"0%"},{"v":0.6,"d":"60%"},{"v":0.63,"d":"63%"},{"v":0.67,"d":"67%"},{"v":0.7,"d":"70%"},{"v":0.73,"d":"73%"},{"v":0.77,"d":"77%"},{"v":0.8,"d":"80%"},{"v":0.83,"d":"83%"},{"v":0.87,"d":"87%"},{"v":0.9,"d":"90%"},{"v":0.93,"d":"93%"},{"v":0.97,"d":"97%"}]
[null,null,"Slovna ocjena","F","D-","D","D+","C-","C","C+","B-","B","B+","A-","A","A+"]
[null,null,"Prosjek",0,0.67,1,1.33,1.67,2,2.33,2.67,3,3.33,3.67,4,4]
[]
[null,null,"Ponderirani rezultati za do 25 predmeta"]
[null,null,"Predmeti koje slušate","Broj sati","Domaća zadaća","Esej","Test","Projekt","Polusemestralni ispit","Završni ispit","Drugo","% ukupnoga"]
[null,null,"Moderni francuski",{"v":3,"d":"3.0"},{"v":0.1,"d":"10%"},{"v":0.15,"d":"15%"},{"v":0.15,"d":"15%"},{"v":0.1,"d":"10%"},{"v":0.2,"d":"20%"},{"v":0.3,"d":"30%"},null,{"$f":"SUM(tblKlase[[#This Row],[Domaća zadaća]:[Drugo]])","v":{"v":1,"d":"100%"}}]
[null,null,"Teorijska fizika",{"v":3,"d":"3.0"},{"v":0.15,"d":"15%"},{"v":0.15,"d":"15%"},{"v":0.1,"d":"10%"},{"v":0.1,"d":"10%"},{"v":0.15,"d":"15%"},{"v":0.3,"d":"30%"},{"v":0.05,"d":"5%"},{"$f":"SUM(tblKlase[[#This Row],[Domaća zadaća]:[Drugo]])","v":{"v":1,"d":"100%"}}]
{"$rows_left_out":6}
{"sheet":"Izračuni","index":3,"n_rows":657,"n_cols":40,"rows_kept":657,"hidden":true}
[null,"Izračuni"]
[null,null,"Na ovom radnom listu izračunavaju se ocjene i prosjek ocjena te bi trebao ostati skriven. Svaka promjena na njemu mogla bi dovesti do pogreške."]
[]
[null,null,"Trenutni popis predmeta","Rezultat (od 1)",{"$nulls":24},"Izračun ocjene"]
[null,null,"Predmet",1,2,3,4,5,6,7,8,9,10,11,12,13,14,15,16,17,18,19,20,21,22,23,24,25,{"$f":"tblKlase[[#Headers],[Domaća zadaća]]","v":"Domaća zadaća"},{"$f":"tblKlase[[#Headers],[Esej]]","v":"Esej"},{"$f":"tblKlase[[#Headers],[Test]]","v":"Test"},{"$f":"tblKlase[[#Headers],[Projekt]]","v":"Projekt"},{"$f":"tblKlase[[#Headers],[Polusemestralni ispit]]","v":"Polusemestralni ispit"},{"$f":"tblKlase[[#Headers],[Završni ispit]]","v":"Završni ispit"},{"$f":"tblKlase[[#Headers],[Drugo]]","v":"Drugo"},"Ukupno","Ukupno mogućih bodova","% ukupnog","Brojčana ocjena","Slovna ocjena"]
[null,null,{"$f":"IF(Postavke!C9=\"\",\"\",Postavke!C9)","v":"Moderni francuski"},{"$f":"IFERROR(INDEX(Tablica_rezultata_razrednih_odjeljenja[],MATCH($C6:$C30&D$5:AB$5,Izračuni!$C$33:$C$657,0),4),\"\")","v":{"v":0.8,"d":"80%"}},{"v":0.9,"d":"90%"},{"v":0.8,"d":"80%"},"","","","","","","","","","","","","","","","","","","","","","",{"$f":"IFERROR(AVERAGEIFS(Tablica_rezultata_razrednih_odjeljenja[Rezultat],Tablica_rezultata_razrednih_odjeljenja[Predmet],Izračuni!$C6,Tablica_rezultata_razrednih_odjeljenja[Vrsta],Izračuni!AC$5)*Postavke!E9,\"\")","v":0.08333333333333334},{"$f":"IFERROR(AVERAGEIFS(Tablica_rezultata_razrednih_odjeljenja[Rezultat],Tablica_rezultata_razrednih_odjeljenja[Predmet],Izračuni!$C6,Tablica_rezultata_razrednih_odjeljenja[Vrsta],Izračuni!AD$5)*Postavke!F9,\"\")","v":""},{"$f":"IFERROR(AVERAGEIFS(Tablica_rezultata_razrednih_odjeljenja[Rezultat],Tablica_rezultata_razrednih_odjeljenja[Predmet],Izračuni!$C6,Tablica_rezultata_razrednih_odjeljenja[Vrsta],Izračuni!AE$5)*Postavke!G9,\"\")","v":""},{"$f":"IFERROR(AVERAGEIFS(Tablica_rezultata_razrednih_odjeljenja[Rezultat],Tablica_rezultata_razrednih_odjeljenja[Predmet],Izračuni!$C6,Tablica_rezultata_razrednih_odjeljenja[Vrsta],Izračuni!AF$5)*Postavke!H9,\"\")","v":""},{"$f":"IFERROR(AVERAGEIFS(Tablica_rezultata_razrednih_odjeljenja[Rezultat],Tablica_rezultata_razrednih_odjeljenja[Predmet],Izračuni!$C6,Tablica_rezultata_razrednih_odjeljenja[Vrsta],Izračuni!AG$5)*Postavke!I9,\"\")","v":""},{"$f":"IFERROR(AVERAGEIFS(Tablica_rezultata_razrednih_odjeljenja[Rezultat],Tablica_rezultata_razrednih_odjeljenja[Predmet],Izračuni!$C6,Tablica_rezultata_razrednih_odjeljenja[Vrsta],Izračuni!AH$5)*Postavke!J9,\"\")","v":""},{"$f":"IFERROR(AVERAGEIFS(Tablica_rezultata_razrednih_odjeljenja[Rezultat],Tablica_rezultata_razrednih_odjeljenja[Predmet],Izračuni!$C6,Tablica_rezultata_razrednih_odjeljenja[Vrsta],Izračuni!AI$5)*Postavke!K9,\"\")","v":""},{"$f":"SUM(AC6:AI6)","v":0.08333333333333334},{"$f":"SUMIFS(Postavke!E9:K9,Izračuni!AC6:AI6,\">0\")","v":0.1},{"$f":"IFERROR(AJ6/AK6,\"\")","v":{"v":0.8333333333333334,"d":"83%"}},{"$f":"IFERROR(HLOOKUP(AL6,Popis_mapiranja_prosjeka_ocjena,3),\"\")","v":3},{"$f":"IFERROR(HLOOKUP(AL6,Popis_mapiranja_prosjeka_ocjena,2),\"\")","v":"B"}]
[null,null,{"$f":"IF(Postavke!C10=\"\",\"\",Postavke!C10)","v":"Teorijska fizika"},{"v":0.95,"d":"95%"},"","","","","","","","","","","","","","","","","","","","","","","","",{"$f":"IFERROR(AVERAGEIFS(Tablica_rezultata_razrednih_odjeljenja[Rezultat],Tablica_rezultata_razrednih_odjeljenja[Predmet],Izračuni!$C7,Tablica_rezultata_razrednih_odjeljenja[Vrsta],Izračuni!AC$5)*Postavke!E10,\"\")","v":0.1425},{"$f":"IFERROR(AVERAGEIFS(Tablica_rezultata_razrednih_odjeljenja[Rezultat],Tablica_rezultata_razrednih_odjeljenja[Predmet],Izračuni!$C7,Tablica_rezultata_razrednih_odjeljenja[Vrsta],Izračuni!AD$5)*Postavke!F10,\"\")","v":""},{"$f":"IFERROR(AVERAGEIFS(Tablica_rezultata_razrednih_odjeljenja[Rezultat],Tablica_rezultata_razrednih_odjeljenja[Predmet],Izračuni!$C7,Tablica_rezultata_razrednih_odjeljenja[Vrsta],Izračuni!AE$5)*Postavke!G10,\"\")","v":""},{"$f":"IFERROR(AVERAGEIFS(Tablica_rezultata_razrednih_odjeljenja[Rezultat],Tablica_rezultata_razrednih_odjeljenja[Predmet],Izračuni!$C7,Tablica_rezultata_razrednih_odjeljenja[Vrsta],Izračuni!AF$5)*Postavke!H10,\"\")","v":""},{"$f":"IFERROR(AVERAGEIFS(Tablica_rezultata_razrednih_odjeljenja[Rezultat],Tablica_rezultata_razrednih_odjeljenja[Predmet],Izračuni!$C7,Tablica_rezultata_razrednih_odjeljenja[Vrsta],Izračuni!AG$5)*Postavke!I10,\"\")","v":""},{"$f":"IFERROR(AVERAGEIFS(Tablica_rezultata_razrednih_odjeljenja[Rezultat],Tablica_rezultata_razrednih_odjeljenja[Predmet],Izračuni!$C7,Tablica_rezultata_razrednih_odjeljenja[Vrsta],Izračuni!AH$5)*Postavke!J10,\"\")","v":""},{"$f":"IFERROR(AVERAGEIFS(Tablica_rezultata_razrednih_odjeljenja[Rezultat],Tablica_rezultata_razrednih_odjeljenja[Predmet],Izračuni!$C7,Tablica_rezultata_razrednih_odjeljenja[Vrsta],Izračuni!AI$5)*Postavke!K10,\"\")","v":""},{"$f":"SUM(AC7:AI7)","v":0.1425},{"$f":"SUMIFS(Postavke!E10:K10,Izračuni!AC7:AI7,\">0\")","v":0.15},{"$f":"IFERROR(AJ7/AK7,\"\")","v":{"v":0.95,"d":"95%"}},4,"A"]
[null,null,{"$f":"IF(Postavke!C11=\"\",\"\",Postavke!C11)","v":"Matematika 1"},{"v":0.8,"d":"80%"},{"v":0.8,"d":"80%"},"","","","","","","","","","","","","","","","","","","","","","","",{"$f":"IFERROR(AVERAGEIFS(Tablica_rezultata_razrednih_odjeljenja[Rezultat],Tablica_rezultata_razrednih_odjeljenja[Predmet],Izračuni!$C8,Tablica_rezultata_razrednih_odjeljenja[Vrsta],Izračuni!AC$5)*Postavke!E11,\"\")","v":0.08000000000000002},{"$f":"IFERROR(AVERAGEIFS(Tablica_rezultata_razrednih_odjeljenja[Rezultat],Tablica_rezultata_razrednih_odjeljenja[Predmet],Izračuni!$C8,Tablica_rezultata_razrednih_odjeljenja[Vrsta],Izračuni!AD$5)*Postavke!F11,\"\")","v":""},{"$f":"IFERROR(AVERAGEIFS(Tablica_rezultata_razrednih_odjeljenja[Rezultat],Tablica_rezultata_razrednih_odjeljenja[Predmet],Izračuni!$C8,Tablica_rezultata_razrednih_odjeljenja[Vrsta],Izračuni!AE$5)*Postavke!G11,\"\")","v":""},{"$f":"IFERROR(AVERAGEIFS(Tablica_rezultata_razrednih_odjeljenja[Rezultat],Tablica_rezultata_razrednih_odjeljenja[Predmet],Izračuni!$C8,Tablica_rezultata_razrednih_odjeljenja[Vrsta],Izračuni!AF$5)*Postavke!H11,\"\")","v":""},{"$f":"IFERROR(AVERAGEIFS(Tablica_rezultata_razrednih_odjeljenja[Rezultat],Tablica_rezultata_razrednih_odjeljenja[Predmet],Izračuni!$C8,Tablica_rezultata_razrednih_odjeljenja[Vrsta],Izračuni!AG$5)*Postavke!I11,\"\")","v":""},{"$f":"IFERROR(AVERAGEIFS(Tablica_rezultata_razrednih_odjeljenja[Rezultat],Tablica_rezultata_razrednih_odjeljenja[Predmet],Izračuni!$C8,Tablica_rezultata_razrednih_odjeljenja[Vrsta],Izračuni!AH$5)*Postavke!J11,\"\")","v":""},{"$f":"IFERROR(AVERAGEIFS(Tablica_rezultata_razrednih_odjeljenja[Rezultat],Tablica_rezultata_razrednih_odjeljenja[Predmet],Izračuni!$C8,Tablica_rezultata_razrednih_odjeljenja[Vrsta],Izračuni!AI$5)*Postavke!K11,\"\")","v":""},0.08000000000000002,{"$f":"SUMIFS(Postavke!E11:K11,Izračuni!AC8:AI8,\">0\")","v":0.1},{"v":0.8000000000000002,"d":"80%"},2.67,"B-"]
[null,null,{"$f":"IF(Postavke!C12=\"\",\"\",Postavke!C12)","v":"Matematika 2"},{"v":0.85,"d":"85%"},{"v":0.95,"d":"95%"},"","","","","","","","","","","","","","","","","","","","","","","",{"$f":"IFERROR(AVERAGEIFS(Tablica_rezultata_razrednih_odjeljenja[Rezultat],Tablica_rezultata_razrednih_odjeljenja[Predmet],Izračuni!$C9,Tablica_rezultata_razrednih_odjeljenja[Vrsta],Izračuni!AC$5)*Postavke!E12,\"\")","v":0.1275},{"$f":"IFERROR(AVERAGEIFS(Tablica_rezultata_razrednih_odjeljenja[Rezultat],Tablica_rezultata_razrednih_odjeljenja[Predmet],Izračuni!$C9,Tablica_rezultata_razrednih_odjeljenja[Vrsta],Izračuni!AD$5)*Postavke!F12,\"\")","v":""},{"$f":"IFERROR(AVERAGEIFS(Tablica_rezultata_razrednih_odjeljenja[Rezultat],Tablica_rezultata_razrednih_odjeljenja[Predmet],Izračuni!$C9,Tablica_rezultata_razrednih_odjeljenja[Vrsta],Izračuni!AE$5)*Postavke!G12,\"\")","v":0.095},{"$f":"IFERROR(AVERAGEIFS(Tablica_rezultata_razrednih_odjeljenja[Rezultat],Tablica_rezultata_razrednih_odjeljenja[Predmet],Izračuni!$C9,Tablica_rezultata_razrednih_odjeljenja[Vrsta],Izračuni!AF$5)*Postavke!H12,\"\")","v":""},{"$f":"IFERROR(AVERAGEIFS(Tablica_rezultata_razrednih_odjeljenja[Rezultat],Tablica_rezultata_razrednih_odjeljenja[Predmet],Izračuni!$C9,Tablica_rezultata_razrednih_odjeljenja[Vrsta],Izračuni!AG$5)*Postavke!I12,\"\")","v":""},{"$f":"IFERROR(AVERAGEIFS(Tablica_rezultata_razrednih_odjeljenja[Rezultat],Tablica_rezultata_razrednih_odjeljenja[Predmet],Izračuni!$C9,Tablica_rezultata_razrednih_odjeljenja[Vrsta],Izračuni!AH$5)*Postavke!J12,\"\")","v":""},{"$f":"IFERROR(AVERAGEIFS(Tablica_rezultata_razrednih_odjeljenja[Rezultat],Tablica_rezultata_razrednih_odjeljenja[Predmet],Izračuni!$C9,Tablica_rezultata_razrednih_odjeljenja[Vrsta],Izračuni!AI$5)*Postavke!K12,\"\")","v":""},0.2225,{"$f":"SUMIFS(Postavke!E12:K12,Izračuni!AC9:AI9,\">0\")","v":0.25},{"v":0.89,"d":"89%"},3.33,"B+"]
[null,null,{"$f":"IF(Postavke!C13=\"\",\"\",Postavke!C13)","v":"Napredno programiranje u jeziku Java"},{"v":0.75,"d":"75%"},"","","","","","","","","","","","","","","","","","","","","","","","",{"$f":"IFERROR(AVERAGEIFS(Tablica_rezultata_razrednih_odjeljenja[Rezultat],Tablica_rezultata_razrednih_odjeljenja[Predmet],Izračuni!$C10,Tablica_rezultata_razrednih_odjeljenja[Vrsta],Izračuni!AC$5)*Postavke!E13,\"\")","v":""},{"$f":"IFERROR(AVERAGEIFS(Tablica_rezultata_razrednih_odjeljenja[Rezultat],Tablica_rezultata_razrednih_odjeljenja[Predmet],Izračuni!$C10,Tablica_rezultata_razrednih_odjeljenja[Vrsta],Izračuni!AD$5)*Postavke!F13,\"\")","v":""},{"$f":"IFERROR(AVERAGEIFS(Tablica_rezultata_razrednih_odjeljenja[Rezultat],Tablica_rezultata_razrednih_odjeljenja[Predmet],Izračuni!$C10,Tablica_rezultata_razrednih_odjeljenja[Vrsta],Izračuni!AE$5)*Postavke!G13,\"\")","v":""},{"$f":"IFERROR(AVERAGEIFS(Tablica_rezultata_razrednih_odjeljenja[Rezultat],Tablica_rezultata_razrednih_odjeljenja[Predmet],Izračuni!$C10,Tablica_rezultata_razrednih_odjeljenja[Vrsta],Izračuni!AF$5)*Postavke!H13,\"\")","v":""},{"$f":"IFERROR(AVERAGEIFS(Tablica_rezultata_razrednih_odjeljenja[Rezultat],Tablica_rezultata_razrednih_odjeljenja[Predmet],Izračuni!$C10,Tablica_rezultata_razrednih_odjeljenja[Vrsta],Izračuni!AG$5)*Postavke!I13,\"\")","v":0.15000000000000002},{"$f":"IFERROR(AVERAGEIFS(Tablica_rezultata_razrednih_odjeljenja[Rezultat],Tablica_rezultata_razrednih_odjeljenja[Predmet],Izračuni!$C10,Tablica_rezultata_razrednih_odjeljenja[Vrsta],Izračuni!AH$5)*Postavke!J13,\"\")","v":""},{"$f":"IFERROR(AVERAGEIFS(Tablica_rezultata_razrednih_odjeljenja[Rezultat],Tablica_rezultata_razrednih_odjeljenja[Predmet],Izračuni!$C10,Tablica_rezultata_razrednih_odjeljenja[Vrsta],Izračuni!AI$5)*Postavke!K13,\"\")","v":""},0.15000000000000002,{"$f":"SUMIFS(Postavke!E13:K13,Izračuni!AC10:AI10,\">0\")","v":0.2},{"v":0.7500000000000001,"d":"75%"},2,"C"]
{"$rows_left_out":647}