{"text_format":"3","workbook":"xlsx","n_sheets":3,"sheets":["Zapisnik o obuci","Popis tečajeva","Podaci o osoblju"],"not_rendered":{"defined_names":13},"read":"whole","date_system":"1900"}

{"sheet":"Zapisnik o obuci","index":0,"n_rows":23,"n_cols":9,"rows_kept":23}
[]
[]
[null,null,"ZAPISNIK O OBUCI"]
{"$rows_empty":8}
[null,null,"DATUM OBUKE","IME I PREZIME","TEČAJ","PREDAVAČ","POHAĐAO","PROLAZ/PAD","NAPOMENE"]
[null,null,"2012-06-01","Marija Poljak","Uvod za zaposlenika",{"$f":"IF(tblZapisnikOObuci[[#This Row],[TEČAJ]]=\"\",\"\",IFERROR(VLOOKUP(tblZapisnikOObuci[[#This Row],[TEČAJ]],tblPopisTečajeva[],2,0),\"Not Found\"))","v":"Ivo Salmre"},"Da","Prolaz","Izvrstan predavač."]
[null,null,"2012-06-02","Dragan Tomić","Uvod za zaposlenika",{"$f":"IF(tblZapisnikOObuci[[#This Row],[TEČAJ]]=\"\",\"\",IFERROR(VLOOKUP(tblZapisnikOObuci[[#This Row],[TEČAJ]],tblPopisTečajeva[],2,0),\"Not Found\"))","v":"Ivo Salmre"},"Da","Pad","Morao ranije napustiti, nije uspio dovršiti."]
[null,null,"2012-06-03","Ana Pavičić","Uvod za zaposlenika",{"$f":"IF(tblZapisnikOObuci[[#This Row],[TEČAJ]]=\"\",\"\",IFERROR(VLOOKUP(tblZapisnikOObuci[[#This Row],[TEČAJ]],tblPopisTečajeva[],2,0),\"Not Found\"))","v":"Ivo Salmre"},"Da","Prolaz","Posljednja ponuda za ovo tromjesečje."]
[null,null,"2012-06-03","Dragan Tomić","Uvod za zaposlenika",{"$f":"IF(tblZapisnikOObuci[[#This Row],[TEČAJ]]=\"\",\"\",IFERROR(VLOOKUP(tblZapisnikOObuci[[#This Row],[TEČAJ]],tblPopisTečajeva[],2,0),\"Not Found\"))","v":"Ivo Salmre"},"Da","Prolaz","Posljednja ponuda za ovo tromjesečje."]
[null,null,"2012-06-04","Dragan Tomić","Operacije zaposlenika",{"$f":"IF(tblZapisnikOObuci[[#This Row],[TEČAJ]]=\"\",\"\",IFERROR(VLOOKUP(tblZapisnikOObuci[[#This Row],[TEČAJ]],tblPopisTečajeva[],2,0),\"Not Found\"))","v":"Vlatka Jurić-Sedić"},"Da","Prolaz","Početna ponuda za ovo tromjesečje"]
[null,null,"2012-06-04","Ana Pavičić","Operacije zaposlenika",{"$f":"IF(tblZapisnikOObuci[[#This Row],[TEČAJ]]=\"\",\"\",IFERROR(VLOOKUP(tblZapisnikOObuci[[#This Row],[TEČAJ]],tblPopisTečajeva[],2,0),\"Not Found\"))","v":"Vlatka Jurić-Sedić"},"Da","Prolaz","Početna ponuda za ovo tromjesečje"]
[null,null,"2012-06-04","Ana Pavičić","Računovodstvo – srednji stupanj",{"$f":"IF(tblZapisnikOObuci[[#This Row],[TEČAJ]]=\"\",\"\",IFERROR(VLOOKUP(tblZapisnikOObuci[[#This Row],[TEČAJ]],tblPopisTečajeva[],2,0),\"Not Found\"))","v":"Vlatka Jurić-Sedić"},"Da","Prolaz","Samo odabrani sudionici."]
[null,null,"2012-06-04","Marija Poljak","Operacije zaposlenika",{"$f":"IF(tblZapisnikOObuci[[#This Row],[TEČAJ]]=\"\",\"\",IFERROR(VLOOKUP(tblZapisnikOObuci[[#This Row],[TEČAJ]],tblPopisTečajeva[],2,0),\"Not Found\"))","v":"Vlatka Jurić-Sedić"},"Da","Prolaz","Početna ponuda za ovo tromjesečje"]
[null,null,"2012-06-05","Marija Poljak","Računovodstvo – srednji stupanj",{"$f":"IF(tblZapisnikOObuci[[#This Row],[TEČAJ]]=\"\",\"\",IFERROR(VLOOKUP(tblZapisnikOObuci[[#This Row],[TEČAJ]],tblPopisTečajeva[],2,0),\"Not Found\"))","v":"Vlatka Jurić-Sedić"},"Ne","Budući","Još nije pohađao."]
[null,null,"2012-06-05","Dragan Tomić","Računovodstvo – napredni stupanj",{"$f":"IF(tblZapisnikOObuci[[#This Row],[TEČAJ]]=\"\",\"\",IFERROR(VLOOKUP(tblZapisnikOObuci[[#This Row],[TEČAJ]],tblPopisTečajeva[],2,0),\"Not Found\"))","v":"Ivo Salmre"},"Ne","Budući","Još nije pohađao."]
[{"$nulls":5},{"$f":"IF(tblZapisnikOObuci[[#This Row],[TEČAJ]]=\"\",\"\",IFERROR(VLOOKUP(tblZapisnikOObuci[[#This Row],[TEČAJ]],tblPopisTečajeva[],2,0),\"Not Found\"))","v":""}]

{"sheet":"Popis tečajeva","index":1,"n_rows":10,"n_cols":6,"rows_kept":10}
[]
[]
[null,null,"POPIS TEČAJEVA"]
[]
[null,null,"NASLOV","PREDAVAČ","OPIS","VRIJEME"]
[null,null,"Uvod za zaposlenika","Ivo Salmre","Osnovni uvodni tečaj za nove zaposlenike. Definiraju se ciljevi i očekivanja odjela te rokovi i granice.",2]
[null,null,"Operacije zaposlenika","Vlatka Jurić-Sedić","Osnovne operacije zaposlenika, uključujući priručnik za zaposlenike.",1]
[null,null,"Operacije zaposlenika","Ivo Salmre","Osnovni postupci i smjernice u računovodstvu",1.5]
[null,null,"Računovodstvo – srednji stupanj","Vlatka Jurić-Sedić","Srednje zahtjevni postupci i smjernice u računovodstvu.",2]
[null,null,"Računovodstvo – napredni stupanj","Ivo Salmre","Napredni postupci i smjernice u računovodstvu.",2]

{"sheet":"Podaci o osoblju","index":2,"n_rows":9,"n_cols":5,"rows_kept":9}
[]
[]
[null,null,"PODACI O OSOBLJU"]
[]
[null,null,"IME I PREZIME","ODJEL","NASLOV"]
[null,null,"Marija Poljak","Prodaja","Viši računovođa"]
[null,null,"Dragan Tomić","Računovodstvo","Računovođa"]
[null,null,"Ana Pavičić","Računovodstvo","Računovođa"]
[null,null,"Dubravka Salopek","Računovodstvo","Računovođa"]