{"text_format":"3","workbook":"xlsx","n_sheets":3,"sheets":["Unos podataka","Izvješće o prodaji","Predviđanje prodaje"],"not_rendered":{"charts":5,"defined_names":7,"pivot_tables":1},"read":"whole","date_system":"1900"}

{"sheet":"Unos podataka","index":0,"n_rows":24,"n_cols":17,"rows_kept":24}
[{"$nulls":9},{"$f":"365*2","v":730}]
[null,"MJESEČNO UNOS PODATAKA"]
[{"$nulls":11},"UKUPNO",null,null,"PREDVIĐANJE"]
[]
[null,"DATUM","TVRTKA","IZNOS","PLANIRANO","TROŠAK","PRIHOD","MJESEC","TROMJESEČJE","GODINA","BR. MJESECA (SAKRIJ)"," MJESEC","TROMJESEČJE2","GODIŠNJE"," MJESEC3","TROMJESEČJE4","GODINA5"]
[null,{"$f":"40657+(365*2)","v":"2013-04-23"},"A. Datum Corporation",{"v":6400,"d":"6,400.00 kn"},{"v":6200,"d":"6,200.00 kn"},{"v":4450,"d":"4,450.00 kn"},{"$f":"tblPodaci[IZNOS]-tblPodaci[TROŠAK]","v":{"v":1950,"d":"1,950.00 kn"}},{"$f":"DATE(YEAR('Unos podataka'!$B6),MONTH('Unos podataka'!$B6),1)","v":"2013-04-01"},{"$f":"LOOKUP(MONTH('Unos podataka'!$H6),{1,1;2,1;3,1;4,2;5,2;6,2;7,3;8,3;9,3;10,4;11,4;12,4})","v":{"v":2,"d":"Tromjesečje 2"}},{"$f":"YEAR('Unos podataka'!$B6)","v":2013},{"$f":"MONTH(tblPodaci[[#This Row],[DATUM]])","v":4},{"$f":"SUMIFS(tblPodaci[IZNOS],tblPodaci[DATUM],\">=\"&EOMONTH(tblPodaci[[#This Row],[DATUM]],-1)+1,tblPodaci[DATUM],\"<=\"&EOMONTH(tblPodaci[[#This Row],[DATUM]],0))","v":{"v":14600,"d":"14,600.00 kn"}},{"$f":"SUMIFS(tblPodaci[IZNOS],tblPodaci[DATUM],\">=\"&DATE(YEAR(tblPodaci[[#This Row],[DATUM]]),1,1),tblPodaci[DATUM],\"<=\"&DATE(YEAR(tblPodaci[[#This Row],[DATUM]]),12,31),tblPodaci[TROMJESEČJE],tblPodaci[[#This Row],[TROMJESEČJE]])","v":{"v":50800,"d":"50,800.00 kn"}},{"$f":"SUMIFS(tblPodaci[IZNOS],tblPodaci[DATUM],\">=\"&DATE(YEAR(tblPodaci[[#This Row],[DATUM]]),1,1),tblPodaci[DATUM],\"<=\"&DATE(YEAR(tblPodaci[[#This Row],[DATUM]]),12,31))","v":{"v":143800,"d":"143,800.00 kn"}},{"$f":"IFERROR(TREND($L$6:INDEX($L:$L,ROW(),1),$K$6:INDEX($K:$K,ROW(),1),IF(MONTH(tblPodaci[[#This Row],[DATUM]])=12,13,MONTH(tblPodaci[[#This Row],[DATUM]])+1)),\"\")","v":{"v":14600,"d":"14,600.00 kn"}},{"$f":"IFERROR(TREND($M$6:INDEX($M:$M,ROW(),1),$I$6:INDEX($I:$I,ROW(),1),IF(tblPodaci[[#This Row],[TROMJESEČJE]]=4,5,tblPodaci[[#This Row],[TROMJESEČJE]]+1)),\"\")","v":{"v":50800,"d":"50,800.00 kn"}},{"$f":"IFERROR(TREND($N$6:INDEX($N:$N,ROW(),1),$J$6:INDEX($J:$J,ROW(),1),tblPodaci[[#This Row],[GODINA]]+1),\"\")","v":{"v":143800,"d":"143,800.00 kn"}}]
[null,{"$f":"40659+(365*2)","v":"2013-04-25"},"Contoso Pharmaceuticals",{"v":8200,"d":"8,200.00 kn"},{"v":8000,"d":"8,000.00 kn"},{"v":6400,"d":"6,400.00 kn"},{"$f":"tblPodaci[IZNOS]-tblPodaci[TROŠAK]","v":{"v":1800,"d":"1,800.00 kn"}},{"$f":"DATE(YEAR('Unos podataka'!$B7),MONTH('Unos podataka'!$B7),1)","v":"2013-04-01"},{"$f":"LOOKUP(MONTH('Unos podataka'!$H7),{1,1;2,1;3,1;4,2;5,2;6,2;7,3;8,3;9,3;10,4;11,4;12,4})","v":{"v":2,"d":"Tromjesečje 2"}},{"$f":"YEAR('Unos podataka'!$B7)","v":2013},{"$f":"MONTH(tblPodaci[[#This Row],[DATUM]])","v":4},{"$f":"SUMIFS(tblPodaci[IZNOS],tblPodaci[DATUM],\">=\"&EOMONTH(tblPodaci[[#This Row],[DATUM]],-1)+1,tblPodaci[DATUM],\"<=\"&EOMONTH(tblPodaci[[#This Row],[DATUM]],0))","v":{"v":14600,"d":"14,600.00 kn"}},{"$f":"SUMIFS(tblPodaci[IZNOS],tblPodaci[DATUM],\">=\"&DATE(YEAR(tblPodaci[[#This Row],[DATUM]]),1,1),tblPodaci[DATUM],\"<=\"&DATE(YEAR(tblPodaci[[#This Row],[DATUM]]),12,31),tblPodaci[TROMJESEČJE],tblPodaci[[#This Row],[TROMJESEČJE]])","v":{"v":50800,"d":"50,800.00 kn"}},{"$f":"SUMIFS(tblPodaci[IZNOS],tblPodaci[DATUM],\">=\"&DATE(YEAR(tblPodaci[[#This Row],[DATUM]]),1,1),tblPodaci[DATUM],\"<=\"&DATE(YEAR(tblPodaci[[#This Row],[DATUM]]),12,31))","v":{"v":143800,"d":"143,800.00 kn"}},{"$f":"IFERROR(TREND($L$6:INDEX($L:$L,ROW(),1),$K$6:INDEX($K:$K,ROW(),1),IF(MONTH(tblPodaci[[#This Row],[DATUM]])=12,13,MONTH(tblPodaci[[#This Row],[DATUM]])+1)),\"\")","v":{"v":14600,"d":"14,600.00 kn"}},{"$f":"IFERROR(TREND($M$6:INDEX($M:$M,ROW(),1),$I$6:INDEX($I:$I,ROW(),1),IF(tblPodaci[[#This Row],[TROMJESEČJE]]=4,5,tblPodaci[[#This Row],[TROMJESEČJE]]+1)),\"\")","v":{"v":50800,"d":"50,800.00 kn"}},{"$f":"IFERROR(TREND($N$6:INDEX($N:$N,ROW(),1),$J$6:INDEX($J:$J,ROW(),1),tblPodaci[[#This Row],[GODINA]]+1),\"\")","v":{"v":143800,"d":"143,800.00 kn"}}]
[null,{"$f":"40671+(365*2)","v":"2013-05-07"},"Consolidated Messenger",{"v":4400,"d":"4,400.00 kn"},{"v":4200,"d":"4,200.00 kn"},{"v":2600,"d":"2,600.00 kn"},{"$f":"tblPodaci[IZNOS]-tblPodaci[TROŠAK]","v":{"v":1800,"d":"1,800.00 kn"}},{"$f":"DATE(YEAR('Unos podataka'!$B8),MONTH('Unos podataka'!$B8),1)","v":"2013-05-01"},{"$f":"LOOKUP(MONTH('Unos podataka'!$H8),{1,1;2,1;3,1;4,2;5,2;6,2;7,3;8,3;9,3;10,4;11,4;12,4})","v":{"v":2,"d":"Tromjesečje 2"}},{"$f":"YEAR('Unos podataka'!$B8)","v":2013},{"$f":"MONTH(tblPodaci[[#This Row],[DATUM]])","v":5},{"$f":"SUMIFS(tblPodaci[IZNOS],tblPodaci[DATUM],\">=\"&EOMONTH(tblPodaci[[#This Row],[DATUM]],-1)+1,tblPodaci[DATUM],\"<=\"&EOMONTH(tblPodaci[[#This Row],[DATUM]],0))","v":{"v":21800,"d":"21,800.00 kn"}},{"$f":"SUMIFS(tblPodaci[IZNOS],tblPodaci[DATUM],\">=\"&DATE(YEAR(tblPodaci[[#This Row],[DATUM]]),1,1),tblPodaci[DATUM],\"<=\"&DATE(YEAR(tblPodaci[[#This Row],[DATUM]]),12,31),tblPodaci[TROMJESEČJE],tblPodaci[[#This Row],[TROMJESEČJE]])","v":{"v":50800,"d":"50,800.00 kn"}},{"$f":"SUMIFS(tblPodaci[IZNOS],tblPodaci[DATUM],\">=\"&DATE(YEAR(tblPodaci[[#This Row],[DATUM]]),1,1),tblPodaci[DATUM],\"<=\"&DATE(YEAR(tblPodaci[[#This Row],[DATUM]]),12,31))","v":{"v":143800,"d":"143,800.00 kn"}},{"$f":"IFERROR(TREND($L$6:INDEX($L:$L,ROW(),1),$K$6:INDEX($K:$K,ROW(),1),IF(MONTH(tblPodaci[[#This Row],[DATUM]])=12,13,MONTH(tblPodaci[[#This Row],[DATUM]])+1)),\"\")","v":{"v":28999.999999999996,"d":"29,000.00 kn"}},{"$f":"IFERROR(TREND($M$6:INDEX($M:$M,ROW(),1),$I$6:INDEX($I:$I,ROW(),1),IF(tblPodaci[[#This Row],[TROMJESEČJE]]=4,5,tblPodaci[[#This Row],[TROMJESEČJE]]+1)),\"\")","v":{"v":50800,"d":"50,800.00 kn"}},{"$f":"IFERROR(TREND($N$6:INDEX($N:$N,ROW(),1),$J$6:INDEX($J:$J,ROW(),1),tblPodaci[[#This Row],[GODINA]]+1),\"\")","v":{"v":143800,"d":"143,800.00 kn"}}]
[null,{"$f":"40678+(365*2)","v":"2013-05-14"},"Proseware, Inc.",{"v":5400,"d":"5,400.00 kn"},{"v":5500,"d":"5,500.00 kn"},{"v":4500,"d":"4,500.00 kn"},{"$f":"tblPodaci[IZNOS]-tblPodaci[TROŠAK]","v":{"v":900,"d":"900.00 kn"}},{"$f":"DATE(YEAR('Unos podataka'!$B9),MONTH('Unos podataka'!$B9),1)","v":"2013-05-01"},{"$f":"LOOKUP(MONTH('Unos podataka'!$H9),{1,1;2,1;3,1;4,2;5,2;6,2;7,3;8,3;9,3;10,4;11,4;12,4})","v":{"v":2,"d":"Tromjesečje 2"}},{"$f":"YEAR('Unos podataka'!$B9)","v":2013},{"$f":"MONTH(tblPodaci[[#This Row],[DATUM]])","v":5},{"$f":"SUMIFS(tblPodaci[IZNOS],tblPodaci[DATUM],\">=\"&EOMONTH(tblPodaci[[#This Row],[DATUM]],-1)+1,tblPodaci[DATUM],\"<=\"&EOMONTH(tblPodaci[[#This Row],[DATUM]],0))","v":{"v":21800,"d":"21,800.00 kn"}},{"$f":"SUMIFS(tblPodaci[IZNOS],tblPodaci[DATUM],\">=\"&DATE(YEAR(tblPodaci[[#This Row],[DATUM]]),1,1),tblPodaci[DATUM],\"<=\"&DATE(YEAR(tblPodaci[[#This Row],[DATUM]]),12,31),tblPodaci[TROMJESEČJE],tblPodaci[[#This Row],[TROMJESEČJE]])","v":{"v":50800,"d":"50,800.00 kn"}},{"$f":"SUMIFS(tblPodaci[IZNOS],tblPodaci[DATUM],\">=\"&DATE(YEAR(tblPodaci[[#This Row],[DATUM]]),1,1),tblPodaci[DATUM],\"<=\"&DATE(YEAR(tblPodaci[[#This Row],[DATUM]]),12,31))","v":{"v":143800,"d":"143,800.00 kn"}},{"$f":"IFERROR(TREND($L$6:INDEX($L:$L,ROW(),1),$K$6:INDEX($K:$K,ROW(),1),IF(MONTH(tblPodaci[[#This Row],[DATUM]])=12,13,MONTH(tblPodaci[[#This Row],[DATUM]])+1)),\"\")","v":{"v":29000,"d":"29,000.00 kn"}},{"$f":"IFERROR(TREND($M$6:INDEX($M:$M,ROW(),1),$I$6:INDEX($I:$I,ROW(),1),IF(tblPodaci[[#This Row],[TROMJESEČJE]]=4,5,tblPodaci[[#This Row],[TROMJESEČJE]]+1)),\"\")","v":{"v":50800,"d":"50,800.00 kn"}},{"$f":"IFERROR(TREND($N$6:INDEX($N:$N,ROW(),1),$J$6:INDEX($J:$J,ROW(),1),tblPodaci[[#This Row],[GODINA]]+1),\"\")","v":{"v":143800,"d":"143,800.00 kn"}}]
[null,{"$f":"40678+(365*2)","v":"2013-05-14"},"School of Fine Art",{"v":5800,"d":"5,800.00 kn"},{"v":6000,"d":"6,000.00 kn"},{"v":4500,"d":"4,500.00 kn"},{"$f":"tblPodaci[IZNOS]-tblPodaci[TROŠAK]","v":{"v":1300,"d":"1,300.00 kn"}},{"$f":"DATE(YEAR('Unos podataka'!$B10),MONTH('Unos podataka'!$B10),1)","v":"2013-05-01"},{"$f":"LOOKUP(MONTH('Unos podataka'!$H10),{1,1;2,1;3,1;4,2;5,2;6,2;7,3;8,3;9,3;10,4;11,4;12,4})","v":{"v":2,"d":"Tromjesečje 2"}},{"$f":"YEAR('Unos podataka'!$B10)","v":2013},{"$f":"MONTH(tblPodaci[[#This Row],[DATUM]])","v":5},{"$f":"SUMIFS(tblPodaci[IZNOS],tblPodaci[DATUM],\">=\"&EOMONTH(tblPodaci[[#This Row],[DATUM]],-1)+1,tblPodaci[DATUM],\"<=\"&EOMONTH(tblPodaci[[#This Row],[DATUM]],0))","v":{"v":21800,"d":"21,800.00 kn"}},{"$f":"SUMIFS(tblPodaci[IZNOS],tblPodaci[DATUM],\">=\"&DATE(YEAR(tblPodaci[[#This Row],[DATUM]]),1,1),tblPodaci[DATUM],\"<=\"&DATE(YEAR(tblPodaci[[#This Row],[DATUM]]),12,31),tblPodaci[TROMJESEČJE],tblPodaci[[#This Row],[TROMJESEČJE]])","v":{"v":50800,"d":"50,800.00 kn"}},{"$f":"SUMIFS(tblPodaci[IZNOS],tblPodaci[DATUM],\">=\"&DATE(YEAR(tblPodaci[[#This Row],[DATUM]]),1,1),tblPodaci[DATUM],\"<=\"&DATE(YEAR(tblPodaci[[#This Row],[DATUM]]),12,31))","v":{"v":143800,"d":"143,800.00 kn"}},{"$f":"IFERROR(TREND($L$6:INDEX($L:$L,ROW(),1),$K$6:INDEX($K:$K,ROW(),1),IF(MONTH(tblPodaci[[#This Row],[DATUM]])=12,13,MONTH(tblPodaci[[#This Row],[DATUM]])+1)),\"\")","v":{"v":29000,"d":"29,000.00 kn"}},{"$f":"IFERROR(TREND($M$6:INDEX($M:$M,ROW(),1),$I$6:INDEX($I:$I,ROW(),1),IF(tblPodaci[[#This Row],[TROMJESEČJE]]=4,5,tblPodaci[[#This Row],[TROMJESEČJE]]+1)),\"\")","v":{"v":50800,"d":"50,800.00 kn"}},{"$f":"IFERROR(TREND($N$6:INDEX($N:$N,ROW(),1),$J$6:INDEX($J:$J,ROW(),1),tblPodaci[[#This Row],[GODINA]]+1),\"\")","v":{"v":143800,"d":"143,800.00 kn"}}]
[null,{"$f":"40693+(365*2)","v":"2013-05-29"},"Trey Research",{"v":6200,"d":"6,200.00 kn"},{"v":6000,"d":"6,000.00 kn"},{"v":4500,"d":"4,500.00 kn"},{"$f":"tblPodaci[IZNOS]-tblPodaci[TROŠAK]","v":{"v":1700,"d":"1,700.00 kn"}},{"$f":"DATE(YEAR('Unos podataka'!$B11),MONTH('Unos podataka'!$B11),1)","v":"2013-05-01"},{"$f":"LOOKUP(MONTH('Unos podataka'!$H11),{1,1;2,1;3,1;4,2;5,2;6,2;7,3;8,3;9,3;10,4;11,4;12,4})","v":{"v":2,"d":"Tromjesečje 2"}},{"$f":"YEAR('Unos podataka'!$B11)","v":2013},{"$f":"MONTH(tblPodaci[[#This Row],[DATUM]])","v":5},{"$f":"SUMIFS(tblPodaci[IZNOS],tblPodaci[DATUM],\">=\"&EOMONTH(tblPodaci[[#This Row],[DATUM]],-1)+1,tblPodaci[DATUM],\"<=\"&EOMONTH(tblPodaci[[#This Row],[DATUM]],0))","v":{"v":21800,"d":"21,800.00 kn"}},{"$f":"SUMIFS(tblPodaci[IZNOS],tblPodaci[DATUM],\">=\"&DATE(YEAR(tblPodaci[[#This Row],[DATUM]]),1,1),tblPodaci[DATUM],\"<=\"&DATE(YEAR(tblPodaci[[#This Row],[DATUM]]),12,31),tblPodaci[TROMJESEČJE],tblPodaci[[#This Row],[TROMJESEČJE]])","v":{"v":50800,"d":"50,800.00 kn"}},{"$f":"SUMIFS(tblPodaci[IZNOS],tblPodaci[DATUM],\">=\"&DATE(YEAR(tblPodaci[[#This Row],[DATUM]]),1,1),tblPodaci[DATUM],\"<=\"&DATE(YEAR(tblPodaci[[#This Row],[DATUM]]),12,31))","v":{"v":143800,"d":"143,800.00 kn"}},{"$f":"IFERROR(TREND($L$6:INDEX($L:$L,ROW(),1),$K$6:INDEX($K:$K,ROW(),1),IF(MONTH(tblPodaci[[#This Row],[DATUM]])=12,13,MONTH(tblPodaci[[#This Row],[DATUM]])+1)),\"\")","v":{"v":29000,"d":"29,000.00 kn"}},{"$f":"IFERROR(TREND($M$6:INDEX($M:$M,ROW(),1),$I$6:INDEX($I:$I,ROW(),1),IF(tblPodaci[[#This Row],[TROMJESEČJE]]=4,5,tblPodaci[[#This Row],[TROMJESEČJE]]+1)),\"\")","v":{"v":50800,"d":"50,800.00 kn"}},{"$f":"IFERROR(TREND($N$6:INDEX($N:$N,ROW(),1),$J$6:INDEX($J:$J,ROW(),1),tblPodaci[[#This Row],[GODINA]]+1),\"\")","v":{"v":143800,"d":"143,800.00 kn"}}]
[null,{"$f":"40705+(365*2)","v":"2013-06-10"},"A. Datum Corporation",{"v":6900,"d":"6,900.00 kn"},{"v":7500,"d":"7,500.00 kn"},{"v":5400,"d":"5,400.00 kn"},{"$f":"tblPodaci[IZNOS]-tblPodaci[TROŠAK]","v":{"v":1500,"d":"1,500.00 kn"}},{"$f":"DATE(YEAR('Unos podataka'!$B12),MONTH('Unos podataka'!$B12),1)","v":"2013-06-01"},{"$f":"LOOKUP(MONTH('Unos podataka'!$H12),{1,1;2,1;3,1;4,2;5,2;6,2;7,3;8,3;9,3;10,4;11,4;12,4})","v":{"v":2,"d":"Tromjesečje 2"}},{"$f":"YEAR('Unos podataka'!$B12)","v":2013},{"$f":"MONTH(tblPodaci[[#This Row],[DATUM]])","v":6},{"$f":"SUMIFS(tblPodaci[IZNOS],tblPodaci[DATUM],\">=\"&EOMONTH(tblPodaci[[#This Row],[DATUM]],-1)+1,tblPodaci[DATUM],\"<=\"&EOMONTH(tblPodaci[[#This Row],[DATUM]],0))","v":{"v":14400,"d":"14,400.00 kn"}},{"$f":"SUMIFS(tblPodaci[IZNOS],tblPodaci[DATUM],\">=\"&DATE(YEAR(tblPodaci[[#This Row],[DATUM]]),1,1),tblPodaci[DATUM],\"<=\"&DATE(YEAR(tblPodaci[[#This Row],[DATUM]]),12,31),tblPodaci[TROMJESEČJE],tblPodaci[[#This Row],[TROMJESEČJE]])","v":{"v":50800,"d":"50,800.00 kn"}},{"$f":"SUMIFS(tblPodaci[IZNOS],tblPodaci[DATUM],\">=\"&DATE(YEAR(tblPodaci[[#This Row],[DATUM]]),1,1),tblPodaci[DATUM],\"<=\"&DATE(YEAR(tblPodaci[[#This Row],[DATUM]]),12,31))","v":{"v":143800,"d":"143,800.00 kn"}},{"$f":"IFERROR(TREND($L$6:INDEX($L:$L,ROW(),1),$K$6:INDEX($K:$K,ROW(),1),IF(MONTH(tblPodaci[[#This Row],[DATUM]])=12,13,MONTH(tblPodaci[[#This Row],[DATUM]])+1)),\"\")","v":{"v":21600.000000000004,"d":"21,600.00 kn"}},{"$f":"IFERROR(TREND($M$6:INDEX($M:$M,ROW(),1),$I$6:INDEX($I:$I,ROW(),1),IF(tblPodaci[[#This Row],[TROMJESEČJE]]=4,5,tblPodaci[[#This Row],[TROMJESEČJE]]+1)),\"\")","v":{"v":50800,"d":"50,800.00 kn"}},{"$f":"IFERROR(TREND($N$6:INDEX($N:$N,ROW(),1),$J$6:INDEX($J:$J,ROW(),1),tblPodaci[[#This Row],[GODINA]]+1),\"\")","v":{"v":143800,"d":"143,800.00 kn"}}]
[null,{"$f":"40716+(365*2)","v":"2013-06-21"},"Contoso Pharmaceuticals",{"v":7500,"d":"7,500.00 kn"},{"v":7200,"d":"7,200.00 kn"},{"v":6500,"d":"6,500.00 kn"},{"$f":"tblPodaci[IZNOS]-tblPodaci[TROŠAK]","v":{"v":1000,"d":"1,000.00 kn"}},{"$f":"DATE(YEAR('Unos podataka'!$B13),MONTH('Unos podataka'!$B13),1)","v":"2013-06-01"},{"$f":"LOOKUP(MONTH('Unos podataka'!$H13),{1,1;2,1;3,1;4,2;5,2;6,2;7,3;8,3;9,3;10,4;11,4;12,4})","v":{"v":2,"d":"Tromjesečje 2"}},{"$f":"YEAR('Unos podataka'!$B13)","v":2013},{"$f":"MONTH(tblPodaci[[#This Row],[DATUM]])","v":6},{"$f":"SUMIFS(tblPodaci[IZNOS],tblPodaci[DATUM],\">=\"&EOMONTH(tblPodaci[[#This Row],[DATUM]],-1)+1,tblPodaci[DATUM],\"<=\"&EOMONTH(tblPodaci[[#This Row],[DATUM]],0))","v":{"v":14400,"d":"14,400.00 kn"}},{"$f":"SUMIFS(tblPodaci[IZNOS],tblPodaci[DATUM],\">=\"&DATE(YEAR(tblPodaci[[#This Row],[DATUM]]),1,1),tblPodaci[DATUM],\"<=\"&DATE(YEAR(tblPodaci[[#This Row],[DATUM]]),12,31),tblPodaci[TROMJESEČJE],tblPodaci[[#This Row],[TROMJESEČJE]])","v":{"v":50800,"d":"50,800.00 kn"}},{"$f":"SUMIFS(tblPodaci[IZNOS],tblPodaci[DATUM],\">=\"&DATE(YEAR(tblPodaci[[#This Row],[DATUM]]),1,1),tblPodaci[DATUM],\"<=\"&DATE(YEAR(tblPodaci[[#This Row],[DATUM]]),12,31))","v":{"v":143800,"d":"143,800.00 kn"}},{"$f":"IFERROR(TREND($L$6:INDEX($L:$L,ROW(),1),$K$6:INDEX($K:$K,ROW(),1),IF(MONTH(tblPodaci[[#This Row],[DATUM]])=12,13,MONTH(tblPodaci[[#This Row],[DATUM]])+1)),\"\")","v":{"v":17950,"d":"17,950.00 kn"}},{"$f":"IFERROR(TREND($M$6:INDEX($M:$M,ROW(),1),$I$6:INDEX($I:$I,ROW(),1),IF(tblPodaci[[#This Row],[TROMJESEČJE]]=4,5,tblPodaci[[#This Row],[TROMJESEČJE]]+1)),\"\")","v":{"v":50800,"d":"50,800.00 kn"}},{"$f":"IFERROR(TREND($N$6:INDEX($N:$N,ROW(),1),$J$6:INDEX($J:$J,ROW(),1),tblPodaci[[#This Row],[GODINA]]+1),\"\")","v":{"v":143800,"d":"143,800.00 kn"}}]
[null,{"$f":"40731+(365*2)","v":"2013-07-06"},"Consolidated Messenger",{"v":8700,"d":"8,700.00 kn"},{"v":8500,"d":"8,500.00 kn"},{"v":7250,"d":"7,250.00 kn"},{"$f":"tblPodaci[IZNOS]-tblPodaci[TROŠAK]","v":{"v":1450,"d":"1,450.00 kn"}},{"$f":"DATE(YEAR('Unos podataka'!$B14),MONTH('Unos podataka'!$B14),1)","v":"2013-07-01"},{"$f":"LOOKUP(MONTH('Unos podataka'!$H14),{1,1;2,1;3,1;4,2;5,2;6,2;7,3;8,3;9,3;10,4;11,4;12,4})","v":{"v":3,"d":"Tromjesečje 3"}},{"$f":"YEAR('Unos podataka'!$B14)","v":2013},{"$f":"MONTH(tblPodaci[[#This Row],[DATUM]])","v":7},{"$f":"SUMIFS(tblPodaci[IZNOS],tblPodaci[DATUM],\">=\"&EOMONTH(tblPodaci[[#This Row],[DATUM]],-1)+1,tblPodaci[DATUM],\"<=\"&EOMONTH(tblPodaci[[#This Row],[DATUM]],0))","v":{"v":8700,"d":"8,700.00 kn"}},{"$f":"SUMIFS(tblPodaci[IZNOS],tblPodaci[DATUM],\">=\"&DATE(YEAR(tblPodaci[[#This Row],[DATUM]]),1,1),tblPodaci[DATUM],\"<=\"&DATE(YEAR(tblPodaci[[#This Row],[DATUM]]),12,31),tblPodaci[TROMJESEČJE],tblPodaci[[#This Row],[TROMJESEČJE]])","v":{"v":49100,"d":"49,100.00 kn"}},{"$f":"SUMIFS(tblPodaci[IZNOS],tblPodaci[DATUM],\">=\"&DATE(YEAR(tblPodaci[[#This Row],[DATUM]]),1,1),tblPodaci[DATUM],\"<=\"&DATE(YEAR(tblPodaci[[#This Row],[DATUM]]),12,31))","v":{"v":143800,"d":"143,800.00 kn"}},{"$f":"IFERROR(TREND($L$6:INDEX($L:$L,ROW(),1),$K$6:INDEX($K:$K,ROW(),1),IF(MONTH(tblPodaci[[#This Row],[DATUM]])=12,13,MONTH(tblPodaci[[#This Row],[DATUM]])+1)),\"\")","v":{"v":10776.470588235294,"d":"10,776.47 kn"}},{"$f":"IFERROR(TREND($M$6:INDEX($M:$M,ROW(),1),$I$6:INDEX($I:$I,ROW(),1),IF(tblPodaci[[#This Row],[TROMJESEČJE]]=4,5,tblPodaci[[#This Row],[TROMJESEČJE]]+1)),\"\")","v":{"v":47400,"d":"47,400.00 kn"}},{"$f":"IFERROR(TREND($N$6:INDEX($N:$N,ROW(),1),$J$6:INDEX($J:$J,ROW(),1),tblPodaci[[#This Row],[GODINA]]+1),\"\")","v":{"v":143800,"d":"143,800.00 kn"}}]
[null,{"$f":"40761+(365*2)","v":"2013-08-05"},"Proseware, Inc.",{"v":8500,"d":"8,500.00 kn"},{"v":8300,"d":"8,300.00 kn"},{"v":7100,"d":"7,100.00 kn"},{"$f":"tblPodaci[IZNOS]-tblPodaci[TROŠAK]","v":{"v":1400,"d":"1,400.00 kn"}},{"$f":"DATE(YEAR('Unos podataka'!$B15),MONTH('Unos podataka'!$B15),1)","v":"2013-08-01"},{"$f":"LOOKUP(MONTH('Unos podataka'!$H15),{1,1;2,1;3,1;4,2;5,2;6,2;7,3;8,3;9,3;10,4;11,4;12,4})","v":{"v":3,"d":"Tromjesečje 3"}},{"$f":"YEAR('Unos podataka'!$B15)","v":2013},{"$f":"MONTH(tblPodaci[[#This Row],[DATUM]])","v":8},{"$f":"SUMIFS(tblPodaci[IZNOS],tblPodaci[DATUM],\">=\"&EOMONTH(tblPodaci[[#This Row],[DATUM]],-1)+1,tblPodaci[DATUM],\"<=\"&EOMONTH(tblPodaci[[#This Row],[DATUM]],0))","v":{"v":16400,"d":"16,400.00 kn"}},{"$f":"SUMIFS(tblPodaci[IZNOS],tblPodaci[DATUM],\">=\"&DATE(YEAR(tblPodaci[[#This Row],[DATUM]]),1,1),tblPodaci[DATUM],\"<=\"&DATE(YEAR(tblPodaci[[#This Row],[DATUM]]),12,31),tblPodaci[TROMJESEČJE],tblPodaci[[#This Row],[TROMJESEČJE]])","v":{"v":49100,"d":"49,100.00 kn"}},{"$f":"SUMIFS(tblPodaci[IZNOS],tblPodaci[DATUM],\">=\"&DATE(YEAR(tblPodaci[[#This Row],[DATUM]]),1,1),tblPodaci[DATUM],\"<=\"&DATE(YEAR(tblPodaci[[#This Row],[DATUM]]),12,31))","v":{"v":143800,"d":"143,800.00 kn"}},{"$f":"IFERROR(TREND($L$6:INDEX($L:$L,ROW(),1),$K$6:INDEX($K:$K,ROW(),1),IF(MONTH(tblPodaci[[#This Row],[DATUM]])=12,13,MONTH(tblPodaci[[#This Row],[DATUM]])+1)),\"\")","v":{"v":12455.862068965516,"d":"12,455.86 kn"}},{"$f":"IFERROR(TREND($M$6:INDEX($M:$M,ROW(),1),$I$6:INDEX($I:$I,ROW(),1),IF(tblPodaci[[#This Row],[TROMJESEČJE]]=4,5,tblPodaci[[#This Row],[TROMJESEČJE]]+1)),\"\")","v":{"v":47400,"d":"47,400.00 kn"}},{"$f":"IFERROR(TREND($N$6:INDEX($N:$N,ROW(),1),$J$6:INDEX($J:$J,ROW(),1),tblPodaci[[#This Row],[GODINA]]+1),\"\")","v":{"v":143800,"d":"143,800.00 kn"}}]
{"$rows_left_out":10}
{"sheet":"Izvješće o prodaji","index":1,"n_rows":28,"n_cols":6,"rows_kept":28}
[]
[null,"MJESEČNO IZVJEŠĆE O PRODAJI"]
[]
[]
[null,"GODINA","TROMJESEČJE","MJESEC","TVRTKA","PRODEJ CELKEM"]
[null,2013,{"v":2,"d":"Tromjesečje 2"},"2013-04-01","A. Datum Corporation",{"v":6400,"d":"6,400.00 kn"}]
[{"$nulls":4},"Contoso Pharmaceuticals",{"v":8200,"d":"8,200.00 kn"}]
[{"$nulls":3},"2013-05-01","Consolidated Messenger",{"v":4400,"d":"4,400.00 kn"}]
[{"$nulls":4},"Proseware, Inc.",{"v":5400,"d":"5,400.00 kn"}]
[{"$nulls":4},"School of Fine Art",{"v":5800,"d":"5,800.00 kn"}]
[{"$nulls":4},"Trey Research",{"v":6200,"d":"6,200.00 kn"}]
[{"$nulls":3},"2013-06-01","A. Datum Corporation",{"v":6900,"d":"6,900.00 kn"}]
[{"$nulls":4},"Contoso Pharmaceuticals",{"v":7500,"d":"7,500.00 kn"}]
[null,null,"Tromjesečje 2 Zbroj",null,null,{"v":50800,"d":"50,800.00 kn"}]
[null,null,{"v":3,"d":"Tromjesečje 3"},"2013-07-01","Consolidated Messenger",{"v":8700,"d":"8,700.00 kn"}]
{"$rows_left_out":14}
{"sheet":"Predviđanje prodaje","index":2,"n_rows":43,"n_cols":10,"rows_kept":43}
[]
[null,"MJESEČNO PREDVIĐANJE PRODAJE"]
[null,{"$f":"\"DANAŠNJI DATUM: \"&UPPER(TEXT(TODAY(),\"d.mmm.yyyy\"))","v":"DANAŠNJI DATUM: 29.LIS.2012"},null,{"$f":"--TRIM(RIGHT(B3,LEN(B3)-FIND(\":\",B3)))","v":"2012-10-29"}]
[]
[null,"OVAJ MJESEC","STVARNO","PLANIRANO –","ODSTUPANJE","%","OSTVARENJE ZA OVU GODINU DO DANAS","PLANIRANO ZA OVU GODINU DO DANAS","ODSTUPANJE ZA OVU GODINU DO DANAS","% OVE GODINE DO DANAS"]
[null,"Količina",{"$f":"COUNTIF('Unos podataka'!$B$6:$B$24,\">=\"&DATE(fGodina,MONTH(fDatum),1))-COUNTIF('Unos podataka'!$B$6:$B$24,\">\"&EOMONTH(fDatum,0))","v":0},{"$nulls":3},{"$f":"COUNTIF(tblPodaci[DATUM],\"<=\"&EOMONTH(fDatum,0))","v":0}]
[null,"Prodaja",{"$f":"SUMIF(tblPodaci[DATUM],\">=\"&DATE(fGodina,MONTH(fDatum),1),tblPodaci[IZNOS])-SUMIF(tblPodaci[DATUM],\">\"&EOMONTH(fDatum,0),tblPodaci[IZNOS])","v":{"v":0,"d":"0.00 kn"}},{"$f":"SUMIF('Unos podataka'!$B$6:$B$24,\">=\"&DATE(fGodina,MONTH(fDatum),1),'Unos podataka'!$E$6:$E$24)-SUMIF('Unos podataka'!$B$6:$B$24,\">\"&EOMONTH(fDatum,0),'Unos podataka'!$E$6:$E$24)","v":{"v":0,"d":"0.00 kn"}},{"$f":"D7-C7","v":{"v":0,"d":"0.00 kn"}},{"$f":"IFERROR(D7/C7,\"-\")","v":"-"},{"$f":"SUMIF(tblPodaci[DATUM],\"<=\"&EOMONTH(fDatum,0),tblPodaci[IZNOS])","v":{"v":0,"d":"0.00 kn"}},{"$f":"SUMIF(tblPodaci[DATUM],\"<=\"&EOMONTH(fDatum,0),tblPodaci[PLANIRANO])","v":{"v":0,"d":"0.00 kn"}},{"$f":"H7-G7","v":{"v":0,"d":"0.00 kn"}},{"$f":"IFERROR(H7/G7,\"\")","v":""}]
[null,"Prihodi",{"$f":"(SUMIF(tblPodaci[DATUM],\">=\"&DATE(fGodina,MONTH(fDatum),1),tblPodaci[IZNOS])-SUMIF(tblPodaci[DATUM],\">\"&EOMONTH(fDatum,0),tblPodaci[IZNOS]))-(SUMIF(tblPodaci[DATUM],\">=\"&DATE(fGodina,MONTH(fDatum),1),tblPodaci[TROŠAK])-SUMIF(tblPodaci[DATUM],\">\"&EOMONTH(fDatum,0),tblPodaci[TROŠAK]))","v":{"v":0,"d":"0.00 kn"}},{"$f":"(SUMIF('Unos podataka'!$B$6:$B$24,\">=\"&DATE(fGodina,MONTH(fDatum),1),'Unos podataka'!$E$6:$E$24)-SUMIF('Unos podataka'!$B$6:$B$24,\">\"&EOMONTH(fDatum,0),'Unos podataka'!$E$6:$E$24))-(SUMIF('Unos podataka'!$B$6:$B$24,\">=\"&DATE(fGodina,MONTH(fDatum),1),'Unos podataka'!$F$6:$F$24)-SUMIF('Unos podataka'!$B$6:$B$24,\">\"&EOMONTH(fDatum,0),'Unos podataka'!$F$6:$F$24))","v":{"v":0,"d":"0.00 kn"}},{"$f":"D8-C8","v":{"v":0,"d":"0.00 kn"}},{"$f":"IFERROR(D8/C8,\"-\")","v":"-"},{"$f":"SUMIF('Unos podataka'!$B$6:$B$24,\"<=\"&EOMONTH(fDatum,0),'Unos podataka'!$F$6:$F$24)","v":{"v":0,"d":"0.00 kn"}},{"$f":"SUMIF(tblPodaci[DATUM],\"<=\"&EOMONTH(fDatum,0),tblPodaci[TROŠAK])","v":{"v":0,"d":"0.00 kn"}},{"$f":"H8-G8","v":{"v":0,"d":"0.00 kn"}},{"$f":"IFERROR(H8/G8,\"\")","v":""}]
[null,"Marža",{"$f":"IFERROR(C8/C7,\"-\")","v":"-"},{"$f":"IFERROR(D8/D7,\"-\")","v":"-"},null,{"$f":"IFERROR(F8/F7,\"-\")","v":"-"},{"$f":"IFERROR(G8/G7,\"\")","v":""},{"$f":"IFERROR(H8/H7,\"\")","v":""},null,{"$f":"IFERROR(J8/J7,\"\")","v":""}]
[null,"Broj narudžbi",{"$f":"COUNTIF(tblPodaci[DATUM],\">=\"&DATE(fGodina,MONTH(fDatum),1))-COUNTIF(tblPodaci[DATUM],\">\"&EOMONTH(fDatum,0))","v":0},{"$nulls":3},{"$f":"COUNTIF(tblPodaci[DATUM],\">\"&EOMONTH(fDatum,0))","v":19}]
[null,"Prosječna vrijednost narudžbe",{"$f":"IFERROR(C7/C10,\"-\")","v":"-"},{"$nulls":3},{"$f":"IFERROR(G7/G10,\"-\")","v":{"v":0,"d":"0.00 kn"}}]
[]
[null,"PREDVIĐANJE",null,"SLJEDEĆI MJESEC",null,"SLJEDEĆE TROMJESEČJE",null,null,"SLJEDEĆA GODINA"]
[null,"Prodaja",null,{"$f":"TREND(tblPodaci[[ MJESEC]],tblPodaci[BR. MJESECA (SAKRIJ)],IF(MONTH(fDatum)=12,13,MONTH(fDatum)+1))","v":{"v":19802.70727580372,"d":"19,802.71 kn"}},null,{"$f":"TREND(tblPodaci[TROMJESEČJE2],tblPodaci[BR. MJESECA (SAKRIJ)],IF(MONTH(fDatum)=12,13,MONTH(fDatum)+1))","v":{"v":45107.44500846024,"d":"45,107.45 kn"}},null,null,{"$f":"TREND(tblPodaci[GODIŠNJE],tblPodaci[BR. MJESECA (SAKRIJ)],IF(MONTH(fDatum)=12,13,MONTH(fDatum)+1))","v":{"v":143800,"d":"143,800.00 kn"}}]
[]
{"$rows_left_out":10}