{"text_format":"3","workbook":"xlsx","n_sheets":9,"sheets":["Sažetak","Kolegij 1","Kolegij 2","Kolegij 3","Kolegij 4","Kolegij 5","Kolegij 6","Kolegij 7","Tablica prosjeka ocjena"],"not_rendered":{"defined_names":9},"read":"whole","date_system":"1900"}

{"sheet":"Sažetak","index":0,"n_rows":12,"n_cols":7,"rows_kept":12,"merged":[[1,1,1,2]]}
[]
[null,"Naziv škole",null,"  Ime",null," Semestar/Godina:"]
[]
[null,"Kolegiji","Sati kredita","Trenutačni postotak","Slovo ocjene","Prosjek ocjena","Ponderirani prosjek ocjena"]
[null,"Kolegij 1",{"v":3,"d":"3.0"},{"$f":"'Kolegij 1'!D$36","v":{"v":0.866176470588235,"d":"86.62%"}},{"$f":"IF(D5<>\"\",HLOOKUP(D5,'Tablica prosjeka ocjena'!$C$5:$O$7,2),\"\")","v":"B"},{"$f":"IF(D5<>\"\",HLOOKUP(D5,'Tablica prosjeka ocjena'!$C$5:$O$7,3),\"\")","v":{"v":3,"d":"3.00"}},{"$f":"IF(F5<>\"\",F5*C5/(SUM($C$5:$C$11)), \"\")","v":{"v":0.5625,"d":"0.56"}}]
[null,"Kolegij 2",{"v":4,"d":"4.0"},{"$f":"'Kolegij 2'!D$36","v":""},{"$f":"IF(D6<>\"\",HLOOKUP(D6,'Tablica prosjeka ocjena'!$C$5:$O$7,2),\"\")","v":""},{"$f":"IF(D6<>\"\",HLOOKUP(D6,'Tablica prosjeka ocjena'!$C$5:$O$7,3),\"\")","v":""},""]
[null,"Kolegij 3",{"v":2,"d":"2.0"},{"$f":"'Kolegij 3'!D$36","v":""},{"$f":"IF(D7<>\"\",HLOOKUP(D7,'Tablica prosjeka ocjena'!$C$5:$O$7,2),\"\")","v":""},{"$f":"IF(D7<>\"\",HLOOKUP(D7,'Tablica prosjeka ocjena'!$C$5:$O$7,3),\"\")","v":""},""]
[null,"Kolegij 4",{"v":4,"d":"4.0"},{"$f":"'Kolegij 4'!D$36","v":""},{"$f":"IF(D8<>\"\",HLOOKUP(D8,'Tablica prosjeka ocjena'!$C$5:$O$7,2),\"\")","v":""},{"$f":"IF(D8<>\"\",HLOOKUP(D8,'Tablica prosjeka ocjena'!$C$5:$O$7,3),\"\")","v":""},""]
[null,"Kolegij 5",{"v":1,"d":"1.0"},{"$f":"'Kolegij 5'!D$36","v":""},{"$f":"IF(D9<>\"\",HLOOKUP(D9,'Tablica prosjeka ocjena'!$C$5:$O$7,2),\"\")","v":""},{"$f":"IF(D9<>\"\",HLOOKUP(D9,'Tablica prosjeka ocjena'!$C$5:$O$7,3),\"\")","v":""},""]
[null,"Kolegij 6",{"v":1,"d":"1.0"},{"$f":"'Kolegij 6'!D$36","v":""},{"$f":"IF(D10<>\"\",HLOOKUP(D10,'Tablica prosjeka ocjena'!$C$5:$O$7,2),\"\")","v":""},{"$f":"IF(D10<>\"\",HLOOKUP(D10,'Tablica prosjeka ocjena'!$C$5:$O$7,3),\"\")","v":""},""]
[null,"Kolegij 7",{"v":1,"d":"1.0"},{"$f":"'Kolegij 7'!D$36","v":""},{"$f":"IF(D11<>\"\",HLOOKUP(D11,'Tablica prosjeka ocjena'!$C$5:$O$7,2),\"\")","v":""},{"$f":"IF(D11<>\"\",HLOOKUP(D11,'Tablica prosjeka ocjena'!$C$5:$O$7,3),\"\")","v":""},""]
[null,"Ukupno",{"$f":"SUM(C5:C11)","v":16},{"$f":"AVERAGE(D5:D11)","v":{"v":0.866176470588235,"d":"86.62%"}},{"$f":"IF(D12<>\"\",HLOOKUP(D12,'Tablica prosjeka ocjena'!$C$5:$O$7,2),\"\")","v":"B"},{"$f":"AVERAGE(F5:F11)","v":{"v":3,"d":"3.00"}},{"$f":"SUM(G5:G11)","v":{"v":0.5625,"d":"0.56"}}]

{"sheet":"Kolegij 1","index":1,"n_rows":38,"n_cols":8,"rows_kept":38,"merged":[[1,1,1,2]]}
[]
[null,{"$f":"Sažetak!B5","v":"Kolegij 1"}]
[null,"Profesor",null,null,"Postotak ukupnog broja bodova",null,null,{"$f":"IF(SUM($C$35:$H$35) <> 0,SUM($C$34:$H$34)/SUM($C$35:$H$35),\"\")","v":{"v":0.866176470588235,"d":"86.62%"}}]
[null,"E-pošta:",null,null,"Trenutačna ocjena",null,null,{"$f":"SUM($C$34:$H$34)","v":{"v":0.17323529411764702,"d":"17.32%"}}]
[]
[null,"Zadaci","Domaći uradci","Sastavci","Testovi","Projekti","Polugodišnji test","Završni ispit"]
[null,"Težina",{"v":0.1,"d":"10.0%"},{"v":0.1,"d":"10.0%"},{"v":0.15,"d":"15.0%"},{"v":0.15,"d":"15.0%"},{"v":0.2,"d":"20.0%"},{"v":0.3,"d":"30.0%"}]
[null,"Prvi domaći uradak",{"v":0.88235294117647,"d":"0.88"}]
[null,"Referat",null,0.85]
{"$rows_empty":24}
[null,"Ukupni bodovi",{"$f":"IF(COUNT(C8:C33) <> 0,AVERAGE(C8:C33) *C7, \"\")","v":{"v":0.08823529411764701,"d":"0.0882"}},{"v":0.085,"d":"0.0850"},"","","",""]
[null,"Ukupni moguće bodova",{"$f":"IF(COUNT(C8:C33)<>0,C7,\"\")","v":0.1},0.1,"","","",""]
[null,"Postotak ukupno mogućih bodova",null,{"$f":"IF(SUM($C$35:$H$35) <> 0,SUM($C$34:$H$34)/SUM($C$35:$H$35),\"\")","v":{"v":0.866176470588235,"d":"86.62%"}}]
[null,"Da biste unijeli ocjene:","Unesite broj dobivenih bodova u odnosu na ukupan mogući broj bodova (i.e. 15/17)."]
[null,null,"Unesite postotak koji ste postigli (npr. 85%)."]

{"sheet":"Kolegij 2","index":2,"n_rows":38,"n_cols":8,"rows_kept":38,"merged":[[1,1,1,2]]}
[]
[null,{"$f":"Sažetak!B6","v":"Kolegij 2"}]
[null,"Profesor",null,null,"Postotak ukupno mogućih bodova",null,null,{"$f":"IF(SUM($C$35:$H$35) <> 0,SUM($C$34:$H$34)/SUM($C$35:$H$35),\"\")","v":""}]
[null,"E-pošta:",null,null,"Trenutačna ocjena",null,null,{"$f":"SUM($C$34:$H$34)","v":{"v":0,"d":"0.00%"}}]
[]
[null,"Zadaci","Domaći uradci","Sastavci","Testovi","Projekti","Polugodišnji test","Završni ispit"]
[null,"Težina",{"v":0.1,"d":"10.0%"},{"v":0.1,"d":"10.0%"},{"v":0.15,"d":"15.0%"},{"v":0.15,"d":"15.0%"},{"v":0.2,"d":"20.0%"},{"v":0.3,"d":"30.0%"}]
{"$rows_empty":26}
[null,"Ukupni bodovi",{"$f":"IF(COUNT(C8:C33) <> 0,AVERAGE(C8:C33) *C7, \"\")","v":""},"","","","",""]
[null,"Ukupni moguće bodova",{"$f":"IF(COUNT(C8:C33)<>0,C7,\"\")","v":""},"","","","",""]
[null,"Postotak ukupno mogućih bodova",null,{"$f":"IF(SUM($C$35:$H$35) <> 0,SUM($C$34:$H$34)/SUM($C$35:$H$35),\"\")","v":""}]
[null,"Da biste unijeli ocjene:","Unesite broj dobivenih bodova u odnosu na ukupan mogući broj bodova (i.e. 15/17)."]
[null,null,"Unesite postotak koji ste postigli (npr. 85%)."]

{"sheet":"Kolegij 3","index":3,"n_rows":38,"n_cols":8,"rows_kept":38,"merged":[[1,1,1,2]]}
[]
[null,{"$f":"Sažetak!B7","v":"Kolegij 3"}]
[null,"Profesor",null,null,"Postotak ukupno mogućih bodova",null,null,{"$f":"IF(SUM($C$35:$H$35) <> 0,SUM($C$34:$H$34)/SUM($C$35:$H$35),\"\")","v":""}]
[null,"E-pošta:",null,null,"Trenutačna ocjena",null,null,{"$f":"SUM($C$34:$H$34)","v":{"v":0,"d":"0.00%"}}]
[]
[null,"Zadaci","Domaći uradci","Sastavci","Testovi","Projekti","Polugodišnji test","Završni ispit"]
[null,"Težina",{"v":0.1,"d":"10.0%"},{"v":0.1,"d":"10.0%"},{"v":0.15,"d":"15.0%"},{"v":0.15,"d":"15.0%"},{"v":0.2,"d":"20.0%"},{"v":0.3,"d":"30.0%"}]
{"$rows_empty":26}
[null,"Ukupni bodovi",{"$f":"IF(COUNT(C8:C33) <> 0,AVERAGE(C8:C33) *C7, \"\")","v":""},"","","","",""]
[null,"Ukupni moguće bodova",{"$f":"IF(COUNT(C8:C33)<>0,C7,\"\")","v":""},"","","","",""]
[null,"Postotak ukupno mogućih bodova",null,{"$f":"IF(SUM($C$35:$H$35) <> 0,SUM($C$34:$H$34)/SUM($C$35:$H$35),\"\")","v":""}]
[null,"Da biste unijeli ocjene:","Unesite broj dobivenih bodova u odnosu na ukupan mogući broj bodova (i.e. 15/17)."]
[null,null,"Unesite postotak koji ste postigli (npr. 85%)."]

{"sheet":"Kolegij 4","index":4,"n_rows":38,"n_cols":8,"rows_kept":38,"merged":[[1,1,1,2]]}
[]
[null,{"$f":"Sažetak!B8","v":"Kolegij 4"}]
[null,"Profesor",null,null,"Postotak ukupno mogućih bodova"]
[null,"E-pošta:",null,null,"Trenutačna ocjena",null,null,{"$f":"SUM($C$34:$H$34)","v":{"v":0,"d":"0.00%"}}]
[]
[null,"Zadaci","Domaći uradci","Sastavci","Testovi","Projekti","Polugodišnji test","Završni ispit"]
[null,"Težina",{"v":0.1,"d":"10.0%"},{"v":0.1,"d":"10.0%"},{"v":0.15,"d":"15.0%"},{"v":0.15,"d":"15.0%"},{"v":0.2,"d":"20.0%"},{"v":0.3,"d":"30.0%"}]
{"$rows_empty":26}
[null,"Ukupni bodovi",{"$f":"IF(COUNT(C8:C33) <> 0,AVERAGE(C8:C33) *C7, \"\")","v":""},"","","","",""]
[null,"Ukupni moguće bodova",{"$f":"IF(COUNT(C8:C33)<>0,C7,\"\")","v":""},"","","","",""]
[null,"Postotak ukupno mogućih bodova",null,{"$f":"IF(SUM($C$35:$H$35) <> 0,SUM($C$34:$H$34)/SUM($C$35:$H$35),\"\")","v":""}]
[null,"Da biste unijeli ocjene:","Unesite broj dobivenih bodova u odnosu na ukupan mogući broj bodova (i.e. 15/17)."]
[null,null,"Unesite postotak koji ste postigli (npr. 85%)."]

{"sheet":"Kolegij 5","index":5,"n_rows":38,"n_cols":8,"rows_kept":38,"merged":[[1,1,1,2]]}
[]
[null,{"$f":"Sažetak!B9","v":"Kolegij 5"}]
[null,"Profesor",null,null,"Postotak ukupno mogućih bodova",null,null,{"$f":"IF(SUM($C$35:$H$35) <> 0,SUM($C$34:$H$34)/SUM($C$35:$H$35),\"\")","v":""}]
[null,"E-pošta:",null,null,"Trenutačna ocjena",null,null,{"$f":"SUM($C$34:$H$34)","v":{"v":0,"d":"0.00%"}}]
[]
[null,"Zadaci","Domaći uradci","Sastavci","Testovi","Projekti","Polugodišnji test","Završni ispit"]
[null,"Težina",{"v":0.1,"d":"10.0%"},{"v":0.1,"d":"10.0%"},{"v":0.15,"d":"15.0%"},{"v":0.15,"d":"15.0%"},{"v":0.2,"d":"20.0%"},{"v":0.3,"d":"30.0%"}]
{"$rows_empty":26}
[null,"Ukupni bodovi",{"$f":"IF(COUNT(C8:C33) <> 0,AVERAGE(C8:C33) *C7, \"\")","v":""},"","","","",""]
[null,"Ukupni moguće bodova",{"$f":"IF(COUNT(C8:C33)<>0,C7,\"\")","v":""},"","","","",""]
[null,"Postotak ukupno mogućih bodova",null,{"$f":"IF(SUM($C$35:$H$35) <> 0,SUM($C$34:$H$34)/SUM($C$35:$H$35),\"\")","v":""}]
[null,"Da biste unijeli ocjene:","Unesite broj dobivenih bodova u odnosu na ukupan mogući broj bodova (i.e. 15/17)."]
[null,null,"Unesite postotak koji ste postigli (npr. 85%)."]

{"sheet":"Kolegij 6","index":6,"n_rows":38,"n_cols":8,"rows_kept":38,"merged":[[1,1,1,2]]}
[]
[null,{"$f":"Sažetak!B10","v":"Kolegij 6"}]
[null,"Profesor",null,null,"Postotak ukupno mogućih bodova",null,null,{"$f":"IF(SUM($C$35:$H$35) <> 0,SUM($C$34:$H$34)/SUM($C$35:$H$35),\"\")","v":""}]
[null,"E-pošta:",null,null,"Trenutačna ocjena",null,null,{"$f":"SUM($C$34:$H$34)","v":{"v":0,"d":"0.00%"}}]
[]
[null,"Zadaci","Domaći uradci","Sastavci","Testovi","Projekti","Polugodišnji test","Završni ispit"]
[null,"Težina",{"v":0.1,"d":"10.0%"},{"v":0.1,"d":"10.0%"},{"v":0.15,"d":"15.0%"},{"v":0.15,"d":"15.0%"},{"v":0.2,"d":"20.0%"},{"v":0.3,"d":"30.0%"}]
{"$rows_empty":26}
[null,"Ukupni bodovi",{"$f":"IF(COUNT(C8:C33) <> 0,AVERAGE(C8:C33) *C7, \"\")","v":""},"","","","",""]
[null,"Ukupni moguće bodova",{"$f":"IF(COUNT(C8:C33)<>0,C7,\"\")","v":""},"","","","",""]
[null,"Postotak ukupno mogućih bodova",null,{"$f":"IF(SUM($C$35:$H$35) <> 0,SUM($C$34:$H$34)/SUM($C$35:$H$35),\"\")","v":""},{"$f":"IF(SUM($C$35:$H$35) <> 0,SUM($C$34:$H$34)/SUM($C$35:$H$35),\"\")","v":""}]
[null,"Da biste unijeli ocjene:","Unesite broj dobivenih bodova u odnosu na ukupan mogući broj bodova (i.e. 15/17)."]
[null,null,"Unesite postotak koji ste postigli (npr. 85%)."]

{"sheet":"Kolegij 7","index":7,"n_rows":38,"n_cols":8,"rows_kept":38,"merged":[[1,1,1,2]]}
[]
[null,{"$f":"Sažetak!B11","v":"Kolegij 7"}]
[null,"Profesor",null,null,"Postotak ukupno mogućih bodova",null,null,{"$f":"IF(SUM($C$35:$H$35) <> 0,SUM($C$34:$H$34)/SUM($C$35:$H$35),\"\")","v":""}]
[null,"E-pošta:",null,null,"Trenutačna ocjena",null,null,{"$f":"SUM($C$34:$H$34)","v":{"v":0,"d":"0.00%"}}]
[]
[null,"Zadaci","Domaći uradci","Sastavci","Testovi","Projekti","Polugodišnji test","Završni ispit"]
[null,"Težina",{"v":0.1,"d":"10.0%"},{"v":0.1,"d":"10.0%"},{"v":0.15,"d":"15.0%"},{"v":0.15,"d":"15.0%"},{"v":0.2,"d":"20.0%"},{"v":0.3,"d":"30.0%"}]
{"$rows_empty":26}
[null,"Ukupni bodovi",{"$f":"IF(COUNT(C8:C33) <> 0,AVERAGE(C8:C33) *C7, \"\")","v":""},"","","","",""]
[null,"Ukupni moguće bodova",{"$f":"IF(COUNT(C8:C33)<>0,C7,\"\")","v":""},"","","","",""]
[null,"Postotak ukupno mogućih bodova",null,{"$f":"IF(SUM($C$35:$H$35) <> 0,SUM($C$34:$H$34)/SUM($C$35:$H$35),\"\")","v":""}]
[null,"Da biste unijeli ocjene:","Unesite broj dobivenih bodova u odnosu na ukupan mogući broj bodova (i.e. 15/17)."]
[null,null,"Unesite postotak koji ste postigli (npr. 85%)."]

{"sheet":"Tablica prosjeka ocjena","index":8,"n_rows":7,"n_cols":15,"rows_kept":7}
[]
[]
[]
[null,"Ocjena i tablica prosjeka ocjena"]
[null,"Prosjek",{"v":0,"d":"0%"},{"v":0.6,"d":"60%"},{"v":0.63,"d":"63%"},{"v":0.67,"d":"67%"},{"v":0.7,"d":"70%"},{"v":0.73,"d":"73%"},{"v":0.77,"d":"77%"},{"v":0.8,"d":"80%"},{"v":0.83,"d":"83%"},{"v":0.87,"d":"87%"},{"v":0.9,"d":"90%"},{"v":0.93,"d":"93%"},{"v":0.97,"d":"97%"}]
[null,"Slovo ocjene","F","D-","D","D+","C-","C","C+","B-","B","B+","A-","A","A+"]
[null,"Prosjek ocjena",{"v":0,"d":"0.00"},0.67,{"v":1,"d":"1.00"},1.33,1.67,{"v":2,"d":"2.00"},2.33,2.67,{"v":3,"d":"3.00"},3.33,3.67,{"v":4,"d":"4.00"},{"v":4,"d":"4.00"}]