{"text_format":"3","workbook":"xlsx","n_sheets":4,"sheets":["ईवेंट्स","कैलेंडर","मुद्रण संस्करण","व्यवस्थापक"],"not_rendered":{"defined_names":19},"read":"whole","date_system":"1900"}

{"sheet":"ईवेंट्स","index":0,"n_rows":38,"n_cols":5,"rows_kept":38}
[]
[null,"मासिक समुदाय"]
[null,"ईवेंट प्लानर"]
[]
[]
[]
[]
[null,"दिनांक","दिन","महीना","ईवेंट नाम"]
[null,"2016-07-01",{"$f":"IF(ISBLANK(tblEvents[[#This Row],[दिनांक]]),\"\",UPPER(TEXT(tblEvents[[#This Row],[दिनांक]],\"[$-4010439]ddd\")))","v":"शुक्र."},{"$f":"IF(ISBLANK(tblEvents[[#This Row],[दिनांक]]),\"\",VLOOKUP(_xlfn.NUMBERVALUE(TEXT(tblEvents[[#This Row],[दिनांक]],\"m\")),monthtb,2,FALSE))","v":"जुलाई"},"समुदाय गार्डन"]
[null,"2016-07-01",{"$f":"IF(ISBLANK(tblEvents[[#This Row],[दिनांक]]),\"\",UPPER(TEXT(tblEvents[[#This Row],[दिनांक]],\"[$-4010439]ddd\")))","v":"शुक्र."},{"$f":"IF(ISBLANK(tblEvents[[#This Row],[दिनांक]]),\"\",VLOOKUP(_xlfn.NUMBERVALUE(TEXT(tblEvents[[#This Row],[दिनांक]],\"m\")),monthtb,2,FALSE))","v":"जुलाई"},"शहर परिषद"]
[null,"2016-07-02",{"$f":"IF(ISBLANK(tblEvents[[#This Row],[दिनांक]]),\"\",UPPER(TEXT(tblEvents[[#This Row],[दिनांक]],\"[$-4010439]ddd\")))","v":"शनि."},{"$f":"IF(ISBLANK(tblEvents[[#This Row],[दिनांक]]),\"\",VLOOKUP(_xlfn.NUMBERVALUE(TEXT(tblEvents[[#This Row],[दिनांक]],\"m\")),monthtb,2,FALSE))","v":"जुलाई"},"समुदाय गार्डन"]
[null,"2016-07-03",{"$f":"IF(ISBLANK(tblEvents[[#This Row],[दिनांक]]),\"\",UPPER(TEXT(tblEvents[[#This Row],[दिनांक]],\"[$-4010439]ddd\")))","v":"रवि."},{"$f":"IF(ISBLANK(tblEvents[[#This Row],[दिनांक]]),\"\",VLOOKUP(_xlfn.NUMBERVALUE(TEXT(tblEvents[[#This Row],[दिनांक]],\"m\")),monthtb,2,FALSE))","v":"जुलाई"},"पार्क में मूवी नाइट"]
[null,"2016-07-08",{"$f":"IF(ISBLANK(tblEvents[[#This Row],[दिनांक]]),\"\",UPPER(TEXT(tblEvents[[#This Row],[दिनांक]],\"[$-4010439]ddd\")))","v":"शुक्र."},{"$f":"IF(ISBLANK(tblEvents[[#This Row],[दिनांक]]),\"\",VLOOKUP(_xlfn.NUMBERVALUE(TEXT(tblEvents[[#This Row],[दिनांक]],\"m\")),monthtb,2,FALSE))","v":"जुलाई"},"शहर परिषद"]
[null,"2016-07-11",{"$f":"IF(ISBLANK(tblEvents[[#This Row],[दिनांक]]),\"\",UPPER(TEXT(tblEvents[[#This Row],[दिनांक]],\"[$-4010439]ddd\")))","v":"सोम."},{"$f":"IF(ISBLANK(tblEvents[[#This Row],[दिनांक]]),\"\",VLOOKUP(_xlfn.NUMBERVALUE(TEXT(tblEvents[[#This Row],[दिनांक]],\"m\")),monthtb,2,FALSE))","v":"जुलाई"},"समुदाय का चेंबर दोपहर का भोजन"]
[null,"2016-07-12",{"$f":"IF(ISBLANK(tblEvents[[#This Row],[दिनांक]]),\"\",UPPER(TEXT(tblEvents[[#This Row],[दिनांक]],\"[$-4010439]ddd\")))","v":"मंगल."},{"$f":"IF(ISBLANK(tblEvents[[#This Row],[दिनांक]]),\"\",VLOOKUP(_xlfn.NUMBERVALUE(TEXT(tblEvents[[#This Row],[दिनांक]],\"m\")),monthtb,2,FALSE))","v":"जुलाई"},"प्राचीन वस्तुओं की प्रदर्शनी"]
[null,"2016-07-14",{"$f":"IF(ISBLANK(tblEvents[[#This Row],[दिनांक]]),\"\",UPPER(TEXT(tblEvents[[#This Row],[दिनांक]],\"[$-4010439]ddd\")))","v":"गुरु."},{"$f":"IF(ISBLANK(tblEvents[[#This Row],[दिनांक]]),\"\",VLOOKUP(_xlfn.NUMBERVALUE(TEXT(tblEvents[[#This Row],[दिनांक]],\"m\")),monthtb,2,FALSE))","v":"जुलाई"},"समुदाय वर्कशॉप"]
[null,"2016-07-15",{"$f":"IF(ISBLANK(tblEvents[[#This Row],[दिनांक]]),\"\",UPPER(TEXT(tblEvents[[#This Row],[दिनांक]],\"[$-4010439]ddd\")))","v":"शुक्र."},{"$f":"IF(ISBLANK(tblEvents[[#This Row],[दिनांक]]),\"\",VLOOKUP(_xlfn.NUMBERVALUE(TEXT(tblEvents[[#This Row],[दिनांक]],\"m\")),monthtb,2,FALSE))","v":"जुलाई"},"शहर परिषद"]
[null,"2016-07-19",{"$f":"IF(ISBLANK(tblEvents[[#This Row],[दिनांक]]),\"\",UPPER(TEXT(tblEvents[[#This Row],[दिनांक]],\"[$-4010439]ddd\")))","v":"मंगल."},{"$f":"IF(ISBLANK(tblEvents[[#This Row],[दिनांक]]),\"\",VLOOKUP(_xlfn.NUMBERVALUE(TEXT(tblEvents[[#This Row],[दिनांक]],\"m\")),monthtb,2,FALSE))","v":"जुलाई"},"कार्यनीतिक योजना वर्कशॉप"]
[null,"2016-07-20",{"$f":"IF(ISBLANK(tblEvents[[#This Row],[दिनांक]]),\"\",UPPER(TEXT(tblEvents[[#This Row],[दिनांक]],\"[$-4010439]ddd\")))","v":"बुध."},{"$f":"IF(ISBLANK(tblEvents[[#This Row],[दिनांक]]),\"\",VLOOKUP(_xlfn.NUMBERVALUE(TEXT(tblEvents[[#This Row],[दिनांक]],\"m\")),monthtb,2,FALSE))","v":"जुलाई"},"पार्क क्लीन-अप"]
[null,"2016-07-22",{"$f":"IF(ISBLANK(tblEvents[[#This Row],[दिनांक]]),\"\",UPPER(TEXT(tblEvents[[#This Row],[दिनांक]],\"[$-4010439]ddd\")))","v":"शुक्र."},{"$f":"IF(ISBLANK(tblEvents[[#This Row],[दिनांक]]),\"\",VLOOKUP(_xlfn.NUMBERVALUE(TEXT(tblEvents[[#This Row],[दिनांक]],\"m\")),monthtb,2,FALSE))","v":"जुलाई"},"शहर परिषद"]
{"$rows_left_out":19}
{"sheet":"कैलेंडर","index":1,"n_rows":35,"n_cols":21,"rows_kept":35,"merged":[[1,5,1,11],[30,8,34,20]]}
[]
[null,null,2016,null,null,{"$f":"LOOKUP(MonthNum,tblMonths[संख्या],tblMonths[महीना])","v":"जुलाई"}]
[null,null,7,null,null,{"$f":"DATE(ViewYear,MonthNum,1)","v":"2016-07-01"},null,null,{"$f":"WEEKDAY(StartDate)","v":6}]
[null,null,"सोम",null,null,"मंगल",null,null,"बुध",null,null,"गुरु",null,null,"शुक्र",null,null,"शनि",null,null,"रवि"]
[]
[null,null,{"$f":"StartDate-(WEEKDAY(StartDate,2))+{0;1;2;3;4;5}*7 +{2,3,4,5,6,7,1}-3+COLUMN(B1)","v":"2016-06-27"},null,null,{"$f":"StartDate-(WEEKDAY(StartDate,2))+{0;1;2;3;4;5}*7 +{2,3,4,5,6,7,1}-3+COLUMN(C1)","v":"2016-06-28"},null,null,{"$f":"StartDate-(WEEKDAY(StartDate,2))+{0;1;2;3;4;5}*7 +{2,3,4,5,6,7,1}-3+COLUMN(D1)","v":"2016-06-29"},null,null,{"$f":"StartDate-(WEEKDAY(StartDate,2))+{0;1;2;3;4;5}*7 +{2,3,4,5,6,7,1}-3+COLUMN(E1)","v":"2016-06-30"},null,null,{"$f":"StartDate-(WEEKDAY(StartDate,2))+{0;1;2;3;4;5}*7 +{2,3,4,5,6,7,1}-3+COLUMN(F1)","v":"2016-07-01"},null,null,{"$f":"StartDate-(WEEKDAY(StartDate,2))+{0;1;2;3;4;5}*7 +{2,3,4,5,6,7,1}-3+COLUMN(G1)","v":"2016-07-02"},null,null,{"$f":"StartDate-(WEEKDAY(StartDate,2))+{0;1;2;3;4;5}*7 +{2,3,4,5,6,7,1}-3+COLUMN(H1)","v":"2016-07-03"}]
[null,null,{"$f":"IFERROR(INDEX(tblEvents[],SMALL(IF(Dates=C$6,ROW(Dates)),ROW(1:1))-TableRowStart,4),\"\")","v":""},null,null,{"$f":"IFERROR(INDEX(tblEvents[],SMALL(IF(Dates=F$6,ROW(Dates)),ROW(1:1))-TableRowStart,4),\"\")","v":""},null,null,{"$f":"IFERROR(INDEX(tblEvents[],SMALL(IF(Dates=I$6,ROW(Dates)),ROW(1:1))-TableRowStart,4),\"\")","v":""},null,null,{"$f":"IFERROR(INDEX(tblEvents[],SMALL(IF(Dates=L$6,ROW(Dates)),ROW(1:1))-TableRowStart,4),\"\")","v":""},null,null,{"$f":"IFERROR(INDEX(tblEvents[],SMALL(IF(Dates=O$6,ROW(Dates)),ROW(1:1))-TableRowStart,4),\"\")","v":"समुदाय गार्डन"},null,null,{"$f":"IFERROR(INDEX(tblEvents[],SMALL(IF(Dates=R$6,ROW(Dates)),ROW(1:1))-TableRowStart,4),\"\")","v":"समुदाय गार्डन"},null,null,{"$f":"IFERROR(INDEX(tblEvents[],SMALL(IF(Dates=U$6,ROW(Dates)),ROW(1:1))-TableRowStart,4),\"\")","v":"पार्क में मूवी नाइट"}]
[null,null,{"$f":"IFERROR(INDEX(tblEvents[],SMALL(IF(Dates=C$6,ROW(Dates)),ROW(2:2))-TableRowStart,4),\"\")","v":""},null,null,{"$f":"IFERROR(INDEX(tblEvents[],SMALL(IF(Dates=F$6,ROW(Dates)),ROW(2:2))-TableRowStart,4),\"\")","v":""},null,null,{"$f":"IFERROR(INDEX(tblEvents[],SMALL(IF(Dates=I$6,ROW(Dates)),ROW(2:2))-TableRowStart,4),\"\")","v":""},null,null,{"$f":"IFERROR(INDEX(tblEvents[],SMALL(IF(Dates=L$6,ROW(Dates)),ROW(2:2))-TableRowStart,4),\"\")","v":""},null,null,{"$f":"IFERROR(INDEX(tblEvents[],SMALL(IF(Dates=O$6,ROW(Dates)),ROW(2:2))-TableRowStart,4),\"\")","v":"शहर परिषद"},null,null,{"$f":"IFERROR(INDEX(tblEvents[],SMALL(IF(Dates=R$6,ROW(Dates)),ROW(2:2))-TableRowStart,4),\"\")","v":""},null,null,{"$f":"IFERROR(INDEX(tblEvents[],SMALL(IF(Dates=U$6,ROW(Dates)),ROW(2:2))-TableRowStart,4),\"\")","v":""}]
[null,null,{"$f":"IFERROR(INDEX(tblEvents[],SMALL(IF(Dates=C$6,ROW(Dates)),ROW(3:3))-TableRowStart,4),\"\")","v":""},null,null,{"$f":"IFERROR(INDEX(tblEvents[],SMALL(IF(Dates=F$6,ROW(Dates)),ROW(3:3))-TableRowStart,4),\"\")","v":""},null,null,{"$f":"IFERROR(INDEX(tblEvents[],SMALL(IF(Dates=I$6,ROW(Dates)),ROW(3:3))-TableRowStart,4),\"\")","v":""},null,null,{"$f":"IFERROR(INDEX(tblEvents[],SMALL(IF(Dates=L$6,ROW(Dates)),ROW(3:3))-TableRowStart,4),\"\")","v":""},null,null,{"$f":"IFERROR(INDEX(tblEvents[],SMALL(IF(Dates=O$6,ROW(Dates)),ROW(3:3))-TableRowStart,4),\"\")","v":""},null,null,{"$f":"IFERROR(INDEX(tblEvents[],SMALL(IF(Dates=R$6,ROW(Dates)),ROW(3:3))-TableRowStart,4),\"\")","v":""},null,null,{"$f":"IFERROR(INDEX(tblEvents[],SMALL(IF(Dates=U$6,ROW(Dates)),ROW(3:3))-TableRowStart,4),\"\")","v":""}]
[null,null,{"$f":"IFERROR(INDEX(tblEvents[],SMALL(IF(Dates=C$6,ROW(Dates)),ROW(#REF!))-TableRowStart,4),\"\")","v":""},null,null,{"$f":"IFERROR(INDEX(tblEvents[],SMALL(IF(Dates=F$6,ROW(Dates)),ROW(#REF!))-TableRowStart,4),\"\")","v":""},null,null,{"$f":"IFERROR(INDEX(tblEvents[],SMALL(IF(Dates=I$6,ROW(Dates)),ROW(#REF!))-TableRowStart,4),\"\")","v":""},null,null,{"$f":"IFERROR(INDEX(tblEvents[],SMALL(IF(Dates=L$6,ROW(Dates)),ROW(#REF!))-TableRowStart,4),\"\")","v":""},null,null,{"$f":"IFERROR(INDEX(tblEvents[],SMALL(IF(Dates=O$6,ROW(Dates)),ROW(#REF!))-TableRowStart,4),\"\")","v":""},null,null,{"$f":"IFERROR(INDEX(tblEvents[],SMALL(IF(Dates=R$6,ROW(Dates)),ROW(#REF!))-TableRowStart,4),\"\")","v":""},null,null,{"$f":"IFERROR(INDEX(tblEvents[],SMALL(IF(Dates=U$6,ROW(Dates)),ROW(#REF!))-TableRowStart,4),\"\")","v":""}]
[null,null,{"$f":"U6+1","v":"2016-07-04"},null,null,{"$f":"C11+1","v":"2016-07-05"},null,null,{"$f":"F11+1","v":"2016-07-06"},null,null,{"$f":"I11+1","v":"2016-07-07"},null,null,{"$f":"L11+1","v":"2016-07-08"},null,null,{"$f":"O11+1","v":"2016-07-09"},null,null,{"$f":"R11+1","v":"2016-07-10"}]
[null,null,{"$f":"IFERROR(INDEX(tblEvents[],SMALL(IF(Dates=C$11,ROW(Dates)),ROW(1:1))-TableRowStart,4),\"\")","v":""},null,null,{"$f":"IFERROR(INDEX(tblEvents[],SMALL(IF(Dates=F$11,ROW(Dates)),ROW(1:1))-TableRowStart,4),\"\")","v":""},null,null,{"$f":"IFERROR(INDEX(tblEvents[],SMALL(IF(Dates=I$11,ROW(Dates)),ROW(1:1))-TableRowStart,4),\"\")","v":""},null,null,{"$f":"IFERROR(INDEX(tblEvents[],SMALL(IF(Dates=L$11,ROW(Dates)),ROW(1:1))-TableRowStart,4),\"\")","v":""},null,null,{"$f":"IFERROR(INDEX(tblEvents[],SMALL(IF(Dates=O$11,ROW(Dates)),ROW(1:1))-TableRowStart,4),\"\")","v":"शहर परिषद"},null,null,{"$f":"IFERROR(INDEX(tblEvents[],SMALL(IF(Dates=R$11,ROW(Dates)),ROW(1:1))-TableRowStart,4),\"\")","v":""},null,null,{"$f":"IFERROR(INDEX(tblEvents[],SMALL(IF(Dates=U$11,ROW(Dates)),ROW(1:1))-TableRowStart,4),\"\")","v":""}]
[null,null,{"$f":"IFERROR(INDEX(tblEvents[],SMALL(IF(Dates=C$11,ROW(Dates)),ROW(2:2))-TableRowStart,4),\"\")","v":""},null,null,{"$f":"IFERROR(INDEX(tblEvents[],SMALL(IF(Dates=F$11,ROW(Dates)),ROW(2:2))-TableRowStart,4),\"\")","v":""},null,null,{"$f":"IFERROR(INDEX(tblEvents[],SMALL(IF(Dates=I$11,ROW(Dates)),ROW(2:2))-TableRowStart,4),\"\")","v":""},null,null,{"$f":"IFERROR(INDEX(tblEvents[],SMALL(IF(Dates=L$11,ROW(Dates)),ROW(2:2))-TableRowStart,4),\"\")","v":""},null,null,{"$f":"IFERROR(INDEX(tblEvents[],SMALL(IF(Dates=O$11,ROW(Dates)),ROW(2:2))-TableRowStart,4),\"\")","v":""},null,null,{"$f":"IFERROR(INDEX(tblEvents[],SMALL(IF(Dates=R$11,ROW(Dates)),ROW(2:2))-TableRowStart,4),\"\")","v":""},null,null,{"$f":"IFERROR(INDEX(tblEvents[],SMALL(IF(Dates=U$11,ROW(Dates)),ROW(2:2))-TableRowStart,4),\"\")","v":""}]
[null,null,{"$f":"IFERROR(INDEX(tblEvents[],SMALL(IF(Dates=C$11,ROW(Dates)),ROW(3:3))-TableRowStart,4),\"\")","v":""},null,null,{"$f":"IFERROR(INDEX(tblEvents[],SMALL(IF(Dates=F$11,ROW(Dates)),ROW(3:3))-TableRowStart,4),\"\")","v":""},null,null,{"$f":"IFERROR(INDEX(tblEvents[],SMALL(IF(Dates=I$11,ROW(Dates)),ROW(3:3))-TableRowStart,4),\"\")","v":""},null,null,{"$f":"IFERROR(INDEX(tblEvents[],SMALL(IF(Dates=L$11,ROW(Dates)),ROW(3:3))-TableRowStart,4),\"\")","v":""},null,null,{"$f":"IFERROR(INDEX(tblEvents[],SMALL(IF(Dates=O$11,ROW(Dates)),ROW(3:3))-TableRowStart,4),\"\")","v":""},null,null,{"$f":"IFERROR(INDEX(tblEvents[],SMALL(IF(Dates=R$11,ROW(Dates)),ROW(3:3))-TableRowStart,4),\"\")","v":""},null,null,{"$f":"IFERROR(INDEX(tblEvents[],SMALL(IF(Dates=U$11,ROW(Dates)),ROW(3:3))-TableRowStart,4),\"\")","v":""}]
[null,null,{"$f":"IFERROR(INDEX(tblEvents[],SMALL(IF(Dates=C$11,ROW(Dates)),ROW(#REF!))-TableRowStart,4),\"\")","v":""},null,null,{"$f":"IFERROR(INDEX(tblEvents[],SMALL(IF(Dates=F$11,ROW(Dates)),ROW(#REF!))-TableRowStart,4),\"\")","v":""},null,null,{"$f":"IFERROR(INDEX(tblEvents[],SMALL(IF(Dates=I$11,ROW(Dates)),ROW(#REF!))-TableRowStart,4),\"\")","v":""},null,null,{"$f":"IFERROR(INDEX(tblEvents[],SMALL(IF(Dates=L$11,ROW(Dates)),ROW(#REF!))-TableRowStart,4),\"\")","v":""},null,null,{"$f":"IFERROR(INDEX(tblEvents[],SMALL(IF(Dates=O$11,ROW(Dates)),ROW(#REF!))-TableRowStart,4),\"\")","v":""},null,null,{"$f":"IFERROR(INDEX(tblEvents[],SMALL(IF(Dates=R$11,ROW(Dates)),ROW(#REF!))-TableRowStart,4),\"\")","v":""},null,null,{"$f":"IFERROR(INDEX(tblEvents[],SMALL(IF(Dates=U$11,ROW(Dates)),ROW(#REF!))-TableRowStart,4),\"\")","v":""}]
[null,null,{"$f":"U11+1","v":"2016-07-11"},null,null,{"$f":"C16+1","v":"2016-07-12"},null,null,{"$f":"F16+1","v":"2016-07-13"},null,null,{"$f":"I16+1","v":"2016-07-14"},null,null,{"$f":"L16+1","v":"2016-07-15"},null,null,{"$f":"O16+1","v":"2016-07-16"},null,null,{"$f":"R16+1","v":"2016-07-17"}]
[null,null,{"$f":"IFERROR(INDEX(tblEvents[],SMALL(IF(Dates=C$16,ROW(Dates)),ROW(1:1))-TableRowStart,4),\"\")","v":"समुदाय का चेंबर दोपहर का भोजन"},null,null,{"$f":"IFERROR(INDEX(tblEvents[],SMALL(IF(Dates=F$16,ROW(Dates)),ROW(1:1))-TableRowStart,4),\"\")","v":"प्राचीन वस्तुओं की प्रदर्शनी"},null,null,{"$f":"IFERROR(INDEX(tblEvents[],SMALL(IF(Dates=I$16,ROW(Dates)),ROW(1:1))-TableRowStart,4),\"\")","v":""},null,null,{"$f":"IFERROR(INDEX(tblEvents[],SMALL(IF(Dates=L$16,ROW(Dates)),ROW(1:1))-TableRowStart,4),\"\")","v":"समुदाय वर्कशॉप"},null,null,{"$f":"IFERROR(INDEX(tblEvents[],SMALL(IF(Dates=O$16,ROW(Dates)),ROW(1:1))-TableRowStart,4),\"\")","v":"शहर परिषद"},null,null,{"$f":"IFERROR(INDEX(tblEvents[],SMALL(IF(Dates=R$16,ROW(Dates)),ROW(1:1))-TableRowStart,4),\"\")","v":""},null,null,{"$f":"IFERROR(INDEX(tblEvents[],SMALL(IF(Dates=U$16,ROW(Dates)),ROW(1:1))-TableRowStart,4),\"\")","v":""}]
[null,null,{"$f":"IFERROR(INDEX(tblEvents[],SMALL(IF(Dates=C$16,ROW(Dates)),ROW(2:2))-TableRowStart,4),\"\")","v":""},null,null,{"$f":"IFERROR(INDEX(tblEvents[],SMALL(IF(Dates=F$16,ROW(Dates)),ROW(2:2))-TableRowStart,4),\"\")","v":""},null,null,{"$f":"IFERROR(INDEX(tblEvents[],SMALL(IF(Dates=I$16,ROW(Dates)),ROW(2:2))-TableRowStart,4),\"\")","v":""},null,null,{"$f":"IFERROR(INDEX(tblEvents[],SMALL(IF(Dates=L$16,ROW(Dates)),ROW(2:2))-TableRowStart,4),\"\")","v":""},null,null,{"$f":"IFERROR(INDEX(tblEvents[],SMALL(IF(Dates=O$16,ROW(Dates)),ROW(2:2))-TableRowStart,4),\"\")","v":""},null,null,{"$f":"IFERROR(INDEX(tblEvents[],SMALL(IF(Dates=R$16,ROW(Dates)),ROW(2:2))-TableRowStart,4),\"\")","v":""},null,null,{"$f":"IFERROR(INDEX(tblEvents[],SMALL(IF(Dates=U$16,ROW(Dates)),ROW(2:2))-TableRowStart,4),\"\")","v":""}]
[null,null,{"$f":"IFERROR(INDEX(tblEvents[],SMALL(IF(Dates=C$16,ROW(Dates)),ROW(3:3))-TableRowStart,4),\"\")","v":""},null,null,{"$f":"IFERROR(INDEX(tblEvents[],SMALL(IF(Dates=F$16,ROW(Dates)),ROW(3:3))-TableRowStart,4),\"\")","v":""},null,null,{"$f":"IFERROR(INDEX(tblEvents[],SMALL(IF(Dates=I$16,ROW(Dates)),ROW(3:3))-TableRowStart,4),\"\")","v":""},null,null,{"$f":"IFERROR(INDEX(tblEvents[],SMALL(IF(Dates=L$16,ROW(Dates)),ROW(3:3))-TableRowStart,4),\"\")","v":""},null,null,{"$f":"IFERROR(INDEX(tblEvents[],SMALL(IF(Dates=O$16,ROW(Dates)),ROW(3:3))-TableRowStart,4),\"\")","v":""},null,null,{"$f":"IFERROR(INDEX(tblEvents[],SMALL(IF(Dates=R$16,ROW(Dates)),ROW(3:3))-TableRowStart,4),\"\")","v":""},null,null,{"$f":"IFERROR(INDEX(tblEvents[],SMALL(IF(Dates=U$16,ROW(Dates)),ROW(3:3))-TableRowStart,4),\"\")","v":""}]
[null,null,{"$f":"IFERROR(INDEX(tblEvents[],SMALL(IF(Dates=C$16,ROW(Dates)),ROW(#REF!))-TableRowStart,4),\"\")","v":""},null,null,{"$f":"IFERROR(INDEX(tblEvents[],SMALL(IF(Dates=F$16,ROW(Dates)),ROW(#REF!))-TableRowStart,4),\"\")","v":""},null,null,{"$f":"IFERROR(INDEX(tblEvents[],SMALL(IF(Dates=I$16,ROW(Dates)),ROW(#REF!))-TableRowStart,4),\"\")","v":""},null,null,{"$f":"IFERROR(INDEX(tblEvents[],SMALL(IF(Dates=L$16,ROW(Dates)),ROW(#REF!))-TableRowStart,4),\"\")","v":""},null,null,{"$f":"IFERROR(INDEX(tblEvents[],SMALL(IF(Dates=O$16,ROW(Dates)),ROW(#REF!))-TableRowStart,4),\"\")","v":""},null,null,{"$f":"IFERROR(INDEX(tblEvents[],SMALL(IF(Dates=R$16,ROW(Dates)),ROW(#REF!))-TableRowStart,4),\"\")","v":""},null,null,{"$f":"IFERROR(INDEX(tblEvents[],SMALL(IF(Dates=U$16,ROW(Dates)),ROW(#REF!))-TableRowStart,4),\"\")","v":""}]
{"$rows_left_out":16}
{"sheet":"मुद्रण संस्करण","index":2,"n_rows":35,"n_cols":21,"rows_kept":35,"merged":[[1,5,1,11],[30,8,34,20]]}
[]
[null,null,{"$f":"ViewYear","v":2016},null,null,{"$f":"ViewMonth","v":"जुलाई"},{"$f":"कैलेंडर!G2","v":0},{"$f":"कैलेंडर!H2","v":0},{"$f":"कैलेंडर!I2","v":0},{"$f":"कैलेंडर!J2","v":0},{"$f":"कैलेंडर!K2","v":0},{"$f":"कैलेंडर!L2","v":0}]
[]
[null,null,"सोम",null,null,"मंगल",null,null,"बुध",null,null,"गुरु",null,null,"शुक्र",null,null,"शनि",null,null,"रवि"]
[]
[null,null,{"$f":"कैलेंडर!C6","v":"2016-06-27"},{"$f":"कैलेंडर!D6","v":0},{"$f":"कैलेंडर!E6","v":0},{"$f":"कैलेंडर!F6","v":"2016-06-28"},{"$f":"कैलेंडर!G6","v":0},{"$f":"कैलेंडर!H6","v":0},{"$f":"कैलेंडर!I6","v":"2016-06-29"},{"$f":"कैलेंडर!J6","v":0},{"$f":"कैलेंडर!K6","v":0},{"$f":"कैलेंडर!L6","v":"2016-06-30"},{"$f":"कैलेंडर!M6","v":0},{"$f":"कैलेंडर!N6","v":0},{"$f":"कैलेंडर!O6","v":"2016-07-01"},{"$f":"कैलेंडर!P6","v":0},{"$f":"कैलेंडर!Q6","v":0},{"$f":"कैलेंडर!R6","v":"2016-07-02"},{"$f":"कैलेंडर!S6","v":0},{"$f":"कैलेंडर!T6","v":0},{"$f":"कैलेंडर!U6","v":"2016-07-03"}]
[null,null,{"$f":"कैलेंडर!C7","v":""},{"$f":"कैलेंडर!D7","v":0},{"$f":"कैलेंडर!E7","v":0},{"$f":"कैलेंडर!F7","v":""},{"$f":"कैलेंडर!G7","v":0},{"$f":"कैलेंडर!H7","v":0},{"$f":"कैलेंडर!I7","v":""},{"$f":"कैलेंडर!J7","v":0},{"$f":"कैलेंडर!K7","v":0},{"$f":"कैलेंडर!L7","v":""},{"$f":"कैलेंडर!M7","v":0},{"$f":"कैलेंडर!N7","v":0},{"$f":"कैलेंडर!O7","v":"समुदाय गार्डन"},{"$f":"कैलेंडर!P7","v":0},{"$f":"कैलेंडर!Q7","v":0},{"$f":"कैलेंडर!R7","v":"समुदाय गार्डन"},{"$f":"कैलेंडर!S7","v":0},{"$f":"कैलेंडर!T7","v":0},{"$f":"कैलेंडर!U7","v":"पार्क में मूवी नाइट"}]
[null,null,{"$f":"कैलेंडर!C8","v":""},{"$f":"कैलेंडर!D8","v":"00:00:00"},{"$f":"कैलेंडर!E8","v":"00:00:00"},{"$f":"कैलेंडर!F8","v":""},{"$f":"कैलेंडर!G8","v":"00:00:00"},{"$f":"कैलेंडर!H8","v":"00:00:00"},{"$f":"कैलेंडर!I8","v":""},{"$f":"कैलेंडर!J8","v":"00:00:00"},{"$f":"कैलेंडर!K8","v":"00:00:00"},{"$f":"कैलेंडर!L8","v":""},{"$f":"कैलेंडर!M8","v":"00:00:00"},{"$f":"कैलेंडर!N8","v":"00:00:00"},{"$f":"कैलेंडर!O8","v":"शहर परिषद"},{"$f":"कैलेंडर!P8","v":"00:00:00"},{"$f":"कैलेंडर!Q8","v":"00:00:00"},{"$f":"कैलेंडर!R8","v":""},{"$f":"कैलेंडर!S8","v":"00:00:00"},{"$f":"कैलेंडर!T8","v":"00:00:00"},{"$f":"कैलेंडर!U8","v":""}]
[null,null,{"$f":"कैलेंडर!C9","v":""},{"$f":"कैलेंडर!D9","v":0},{"$f":"कैलेंडर!E9","v":0},{"$f":"कैलेंडर!F9","v":""},{"$f":"कैलेंडर!G9","v":0},{"$f":"कैलेंडर!H9","v":0},{"$f":"कैलेंडर!I9","v":""},{"$f":"कैलेंडर!J9","v":0},{"$f":"कैलेंडर!K9","v":0},{"$f":"कैलेंडर!L9","v":""},{"$f":"कैलेंडर!M9","v":0},{"$f":"कैलेंडर!N9","v":0},{"$f":"कैलेंडर!O9","v":""},{"$f":"कैलेंडर!P9","v":0},{"$f":"कैलेंडर!Q9","v":0},{"$f":"कैलेंडर!R9","v":""},{"$f":"कैलेंडर!S9","v":0},{"$f":"कैलेंडर!T9","v":0},{"$f":"कैलेंडर!U9","v":""}]
[null,null,{"$f":"कैलेंडर!C10","v":""},{"$f":"कैलेंडर!D10","v":0},{"$f":"कैलेंडर!E10","v":0},{"$f":"कैलेंडर!F10","v":""},{"$f":"कैलेंडर!G10","v":0},{"$f":"कैलेंडर!H10","v":0},{"$f":"कैलेंडर!I10","v":""},{"$f":"कैलेंडर!J10","v":0},{"$f":"कैलेंडर!K10","v":0},{"$f":"कैलेंडर!L10","v":""},{"$f":"कैलेंडर!M10","v":0},{"$f":"कैलेंडर!N10","v":0},{"$f":"कैलेंडर!O10","v":""},{"$f":"कैलेंडर!P10","v":0},{"$f":"कैलेंडर!Q10","v":0},{"$f":"कैलेंडर!R10","v":""},{"$f":"कैलेंडर!S10","v":0},{"$f":"कैलेंडर!T10","v":0},{"$f":"कैलेंडर!U10","v":""}]
[null,null,{"$f":"कैलेंडर!C11","v":"2016-07-04"},{"$f":"कैलेंडर!D11","v":0},{"$f":"कैलेंडर!E11","v":0},{"$f":"कैलेंडर!F11","v":"2016-07-05"},{"$f":"कैलेंडर!G11","v":0},{"$f":"कैलेंडर!H11","v":0},{"$f":"कैलेंडर!I11","v":"2016-07-06"},{"$f":"कैलेंडर!J11","v":0},{"$f":"कैलेंडर!K11","v":0},{"$f":"कैलेंडर!L11","v":"2016-07-07"},{"$f":"कैलेंडर!M11","v":0},{"$f":"कैलेंडर!N11","v":0},{"$f":"कैलेंडर!O11","v":"2016-07-08"},{"$f":"कैलेंडर!P11","v":0},{"$f":"कैलेंडर!Q11","v":0},{"$f":"कैलेंडर!R11","v":"2016-07-09"},{"$f":"कैलेंडर!S11","v":0},{"$f":"कैलेंडर!T11","v":0},{"$f":"कैलेंडर!U11","v":"2016-07-10"}]
[null,null,{"$f":"कैलेंडर!C12","v":""},{"$f":"कैलेंडर!D12","v":0},{"$f":"कैलेंडर!E12","v":0},{"$f":"कैलेंडर!F12","v":""},{"$f":"कैलेंडर!G12","v":0},{"$f":"कैलेंडर!H12","v":0},{"$f":"कैलेंडर!I12","v":""},{"$f":"कैलेंडर!J12","v":0},{"$f":"कैलेंडर!K12","v":0},{"$f":"कैलेंडर!L12","v":""},{"$f":"कैलेंडर!M12","v":0},{"$f":"कैलेंडर!N12","v":0},{"$f":"कैलेंडर!O12","v":"शहर परिषद"},{"$f":"कैलेंडर!P12","v":0},{"$f":"कैलेंडर!Q12","v":0},{"$f":"कैलेंडर!R12","v":""},{"$f":"कैलेंडर!S12","v":0},{"$f":"कैलेंडर!T12","v":0},{"$f":"कैलेंडर!U12","v":""}]
[null,null,{"$f":"कैलेंडर!C13","v":""},{"$f":"कैलेंडर!D13","v":0},{"$f":"कैलेंडर!E13","v":0},{"$f":"कैलेंडर!F13","v":""},{"$f":"कैलेंडर!G13","v":0},{"$f":"कैलेंडर!H13","v":0},{"$f":"कैलेंडर!I13","v":""},{"$f":"कैलेंडर!J13","v":0},{"$f":"कैलेंडर!K13","v":0},{"$f":"कैलेंडर!L13","v":""},{"$f":"कैलेंडर!M13","v":0},{"$f":"कैलेंडर!N13","v":0},{"$f":"कैलेंडर!O13","v":""},{"$f":"कैलेंडर!P13","v":0},{"$f":"कैलेंडर!Q13","v":0},{"$f":"कैलेंडर!R13","v":""},{"$f":"कैलेंडर!S13","v":0},{"$f":"कैलेंडर!T13","v":0},{"$f":"कैलेंडर!U13","v":""}]
[null,null,{"$f":"कैलेंडर!C14","v":""},{"$f":"कैलेंडर!D14","v":0},{"$f":"कैलेंडर!E14","v":0},{"$f":"कैलेंडर!F14","v":""},{"$f":"कैलेंडर!G14","v":0},{"$f":"कैलेंडर!H14","v":0},{"$f":"कैलेंडर!I14","v":""},{"$f":"कैलेंडर!J14","v":0},{"$f":"कैलेंडर!K14","v":0},{"$f":"कैलेंडर!L14","v":""},{"$f":"कैलेंडर!M14","v":0},{"$f":"कैलेंडर!N14","v":0},{"$f":"कैलेंडर!O14","v":""},{"$f":"कैलेंडर!P14","v":0},{"$f":"कैलेंडर!Q14","v":0},{"$f":"कैलेंडर!R14","v":""},{"$f":"कैलेंडर!S14","v":0},{"$f":"कैलेंडर!T14","v":0},{"$f":"कैलेंडर!U14","v":""}]
[null,null,{"$f":"कैलेंडर!C15","v":""},{"$f":"कैलेंडर!D15","v":0},{"$f":"कैलेंडर!E15","v":0},{"$f":"कैलेंडर!F15","v":""},{"$f":"कैलेंडर!G15","v":0},{"$f":"कैलेंडर!H15","v":0},{"$f":"कैलेंडर!I15","v":""},{"$f":"कैलेंडर!J15","v":0},{"$f":"कैलेंडर!K15","v":0},{"$f":"कैलेंडर!L15","v":""},{"$f":"कैलेंडर!M15","v":0},{"$f":"कैलेंडर!N15","v":0},{"$f":"कैलेंडर!O15","v":""},{"$f":"कैलेंडर!P15","v":0},{"$f":"कैलेंडर!Q15","v":0},{"$f":"कैलेंडर!R15","v":""},{"$f":"कैलेंडर!S15","v":0},{"$f":"कैलेंडर!T15","v":0},{"$f":"कैलेंडर!U15","v":""}]
[null,null,{"$f":"कैलेंडर!C16","v":"2016-07-11"},{"$f":"कैलेंडर!D16","v":0},{"$f":"कैलेंडर!E16","v":0},{"$f":"कैलेंडर!F16","v":"2016-07-12"},{"$f":"कैलेंडर!G16","v":0},{"$f":"कैलेंडर!H16","v":0},{"$f":"कैलेंडर!I16","v":"2016-07-13"},{"$f":"कैलेंडर!J16","v":0},{"$f":"कैलेंडर!K16","v":0},{"$f":"कैलेंडर!L16","v":"2016-07-14"},{"$f":"कैलेंडर!M16","v":0},{"$f":"कैलेंडर!N16","v":0},{"$f":"कैलेंडर!O16","v":"2016-07-15"},{"$f":"कैलेंडर!P16","v":0},{"$f":"कैलेंडर!Q16","v":0},{"$f":"कैलेंडर!R16","v":"2016-07-16"},{"$f":"कैलेंडर!S16","v":0},{"$f":"कैलेंडर!T16","v":0},{"$f":"कैलेंडर!U16","v":"2016-07-17"}]
[null,null,{"$f":"कैलेंडर!C17","v":"समुदाय का चेंबर दोपहर का भोजन"},{"$f":"कैलेंडर!D17","v":0},{"$f":"कैलेंडर!E17","v":0},{"$f":"कैलेंडर!F17","v":"प्राचीन वस्तुओं की प्रदर्शनी"},{"$f":"कैलेंडर!G17","v":0},{"$f":"कैलेंडर!H17","v":0},{"$f":"कैलेंडर!I17","v":""},{"$f":"कैलेंडर!J17","v":0},{"$f":"कैलेंडर!K17","v":0},{"$f":"कैलेंडर!L17","v":"समुदाय वर्कशॉप"},{"$f":"कैलेंडर!M17","v":0},{"$f":"कैलेंडर!N17","v":0},{"$f":"कैलेंडर!O17","v":"शहर परिषद"},{"$f":"कैलेंडर!P17","v":0},{"$f":"कैलेंडर!Q17","v":0},{"$f":"कैलेंडर!R17","v":""},{"$f":"कैलेंडर!S17","v":0},{"$f":"कैलेंडर!T17","v":0},{"$f":"कैलेंडर!U17","v":""}]
[null,null,{"$f":"कैलेंडर!C18","v":""},{"$f":"कैलेंडर!D18","v":0},{"$f":"कैलेंडर!E18","v":0},{"$f":"कैलेंडर!F18","v":""},{"$f":"कैलेंडर!G18","v":0},{"$f":"कैलेंडर!H18","v":0},{"$f":"कैलेंडर!I18","v":""},{"$f":"कैलेंडर!J18","v":0},{"$f":"कैलेंडर!K18","v":0},{"$f":"कैलेंडर!L18","v":""},{"$f":"कैलेंडर!M18","v":0},{"$f":"कैलेंडर!N18","v":0},{"$f":"कैलेंडर!O18","v":""},{"$f":"कैलेंडर!P18","v":0},{"$f":"कैलेंडर!Q18","v":0},{"$f":"कैलेंडर!R18","v":""},{"$f":"कैलेंडर!S18","v":0},{"$f":"कैलेंडर!T18","v":0},{"$f":"कैलेंडर!U18","v":""}]
[null,null,{"$f":"कैलेंडर!C19","v":""},{"$f":"कैलेंडर!D19","v":0},{"$f":"कैलेंडर!E19","v":0},{"$f":"कैलेंडर!F19","v":""},{"$f":"कैलेंडर!G19","v":0},{"$f":"कैलेंडर!H19","v":0},{"$f":"कैलेंडर!I19","v":""},{"$f":"कैलेंडर!J19","v":0},{"$f":"कैलेंडर!K19","v":0},{"$f":"कैलेंडर!L19","v":""},{"$f":"कैलेंडर!M19","v":0},{"$f":"कैलेंडर!N19","v":0},{"$f":"कैलेंडर!O19","v":""},{"$f":"कैलेंडर!P19","v":0},{"$f":"कैलेंडर!Q19","v":0},{"$f":"कैलेंडर!R19","v":""},{"$f":"कैलेंडर!S19","v":0},{"$f":"कैलेंडर!T19","v":0},{"$f":"कैलेंडर!U19","v":""}]
[null,null,{"$f":"कैलेंडर!C20","v":""},{"$f":"कैलेंडर!D20","v":0},{"$f":"कैलेंडर!E20","v":0},{"$f":"कैलेंडर!F20","v":""},{"$f":"कैलेंडर!G20","v":0},{"$f":"कैलेंडर!H20","v":0},{"$f":"कैलेंडर!I20","v":""},{"$f":"कैलेंडर!J20","v":0},{"$f":"कैलेंडर!K20","v":0},{"$f":"कैलेंडर!L20","v":""},{"$f":"कैलेंडर!M20","v":0},{"$f":"कैलेंडर!N20","v":0},{"$f":"कैलेंडर!O20","v":""},{"$f":"कैलेंडर!P20","v":0},{"$f":"कैलेंडर!Q20","v":0},{"$f":"कैलेंडर!R20","v":""},{"$f":"कैलेंडर!S20","v":0},{"$f":"कैलेंडर!T20","v":0},{"$f":"कैलेंडर!U20","v":""}]
{"$rows_left_out":16}
{"sheet":"व्यवस्थापक","index":3,"n_rows":28,"n_cols":3,"rows_kept":28,"hidden":true}
[]
[null,"महीना","संख्या"]
[null,"जनवरी",1]
[null,"फ़रवरी",2]
[null,"मार्च",3]
[null,"अप्रैल",4]
[null,"मई",5]
[null,"जून",6]
[null,"जुलाई",7]
[null,"अगस्त",8]
[null,"सितंबर",9]
[null,"अक्टूबर",10]
[null,"नवंबर",11]
[null,"दिसंबर",12]
[]
[]
[null,1,"जनवरी"]
[null,2,"फरवरी"]
[null,3,"मार्च"]
[null,4,"अप्रैल"]
{"$rows_left_out":8}