{"text_format":"3","workbook":"xlsx","n_sheets":4,"sheets":["स्कोर ट्रैकर","आपका प्रदर्शन","सेटिंग्स","परिकलन"],"not_rendered":{"defined_names":3,"comments":1},"read":"whole","date_system":"1900"}

{"sheet":"स्कोर ट्रैकर","index":0,"n_rows":14,"n_cols":6,"rows_kept":14}
[null,"अपने स्कोर यहाँ दर्ज करें"]
[]
[null,null,"कक्षा","प्रकार","वर्णन","स्कोर"]
[null,null,"आधुनिक फ़्रेंच","गृहकार्य","WW II इतिहास",{"v":0.8,"d":"80%"}]
[null,null,"Java में उन्नत प्रोग्रामिंग","मध्यावधि",null,{"v":0.75,"d":"75%"}]
[null,null,"स्पैनिश","गृहकार्य",null,{"v":0.5,"d":"50%"}]
[null,null,"सैद्धांतिक भौतिकी","गृहकार्य",null,{"v":0.95,"d":"95%"}]
[null,null,"आधुनिक फ़्रेंच","गृहकार्य","WW I इतिहास",{"v":0.9,"d":"90%"}]
[null,null,"आधुनिक फ़्रेंच","गृहकार्य","पृष्ठ 30 - 41",{"v":0.8,"d":"80%"}]
[null,null,"संरचना","निबंध","प्रबोधन पत्र",{"v":0.95,"d":"95%"}]
[null,null,"गणित 1","गृहकार्य","पृष्ठ 21 और 26",{"v":0.8,"d":"80%"}]
[null,null,"गणित 2","गृहकार्य","पृष्ठ 15 और 18",{"v":0.85,"d":"85%"}]
[null,null,"गणित 1","गृहकार्य","पृष्ठ 34 - 36",{"v":0.8,"d":"80%"}]
[null,null,"गणित 2","क्विज़",null,{"v":0.95,"d":"95%"}]

{"sheet":"आपका प्रदर्शन","index":1,"n_rows":31,"n_cols":8,"rows_kept":31}
[null,"आपका प्रदर्शन"]
[]
[null,null,"कुल"]
[null,null,{"$f":"\"घंटे: \"&SUM(tblClasses[क्रेडिट घंटे])","v":"घंटे: 24"},{"$f":"AVERAGE(D7:D31)","v":{"v":0.8104761904761906,"d":"81%"}},{"$f":"AVERAGE(E7:E31)","v":{"v":2.7142857142857144,"d":"2.71"}},{"$f":"SUM(F7:F31)","v":{"v":2.625,"d":"2.63"}},{"$f":"IFERROR(HLOOKUP(D4,lstGPAMapping,2),\"\")","v":"B-"}]
[]
[null,null,"कक्षाएँ","%","GPA","wGPA","वर्ण","समग्री प्रदर्शन"]
[null,null,{"$f":"परिकलन!C6","v":"आधुनिक फ़्रेंच"},{"$f":"परिकलन!AL6","v":{"v":0.8333333333333334,"d":"83%"}},{"$f":"परिकलन!AM6","v":{"v":3,"d":"3.00"}},{"$f":"IFERROR(E7*सेटिंग्स!D9/SUM(tblClasses[क्रेडिट घंटे]),\"\")","v":{"v":0.375,"d":"0.38"}},{"$f":"परिकलन!AN6","v":"B"}]
[null,null,{"$f":"परिकलन!C7","v":"सैद्धांतिक भौतिकी"},{"$f":"परिकलन!AL7","v":{"v":0.95,"d":"95%"}},{"$f":"परिकलन!AM7","v":{"v":4,"d":"4.00"}},{"$f":"IFERROR(E8*सेटिंग्स!D10/SUM(tblClasses[क्रेडिट घंटे]),\"\")","v":{"v":0.5,"d":"0.50"}},{"$f":"परिकलन!AN7","v":"A"}]
[null,null,{"$f":"परिकलन!C8","v":"गणित 1"},{"$f":"परिकलन!AL8","v":{"v":0.8000000000000002,"d":"80%"}},{"$f":"परिकलन!AM8","v":2.67},{"$f":"IFERROR(E9*सेटिंग्स!D11/SUM(tblClasses[क्रेडिट घंटे]),\"\")","v":{"v":0.445,"d":"0.45"}},{"$f":"परिकलन!AN8","v":"B-"}]
[null,null,{"$f":"परिकलन!C9","v":"गणित 2"},{"$f":"परिकलन!AL9","v":{"v":0.89,"d":"89%"}},{"$f":"परिकलन!AM9","v":3.33},{"$f":"IFERROR(E10*सेटिंग्स!D12/SUM(tblClasses[क्रेडिट घंटे]),\"\")","v":{"v":0.555,"d":"0.56"}},{"$f":"परिकलन!AN9","v":"B+"}]
[null,null,{"$f":"परिकलन!C10","v":"Java में उन्नत प्रोग्रामिंग"},{"$f":"परिकलन!AL10","v":{"v":0.7500000000000001,"d":"75%"}},{"$f":"परिकलन!AM10","v":{"v":2,"d":"2.00"}},{"$f":"IFERROR(E11*सेटिंग्स!D13/SUM(tblClasses[क्रेडिट घंटे]),\"\")","v":{"v":0.4166666666666667,"d":"0.42"}},{"$f":"परिकलन!AN10","v":"C"}]
[null,null,{"$f":"परिकलन!C11","v":"स्पैनिश"},{"$f":"परिकलन!AL11","v":{"v":0.5,"d":"50%"}},{"$f":"परिकलन!AM11","v":{"v":0,"d":"0.00"}},{"$f":"IFERROR(E12*सेटिंग्स!D14/SUM(tblClasses[क्रेडिट घंटे]),\"\")","v":{"v":0,"d":"0.00"}},{"$f":"परिकलन!AN11","v":"F"}]
[null,null,{"$f":"परिकलन!C12","v":"संरचना"},{"$f":"परिकलन!AL12","v":{"v":0.95,"d":"95%"}},{"$f":"परिकलन!AM12","v":{"v":4,"d":"4.00"}},{"$f":"IFERROR(E13*सेटिंग्स!D15/SUM(tblClasses[क्रेडिट घंटे]),\"\")","v":{"v":0.3333333333333333,"d":"0.33"}},{"$f":"परिकलन!AN12","v":"A"}]
[null,null,{"$f":"परिकलन!C13","v":""},{"$f":"परिकलन!AL13","v":""},{"$f":"परिकलन!AM13","v":""},{"$f":"IFERROR(E14*सेटिंग्स!D16/SUM(tblClasses[क्रेडिट घंटे]),\"\")","v":""},{"$f":"परिकलन!AN13","v":""}]
[null,null,{"$f":"परिकलन!C14","v":""},{"$f":"परिकलन!AL14","v":""},{"$f":"परिकलन!AM14","v":""},{"$f":"IFERROR(E15*सेटिंग्स!D17/SUM(tblClasses[क्रेडिट घंटे]),\"\")","v":""},{"$f":"परिकलन!AN14","v":""}]
{"$rows_left_out":17}
{"sheet":"सेटिंग्स","index":2,"n_rows":15,"n_cols":16,"rows_kept":15,"merged":[[5,2,5,15]]}
[null,"सेटिंग्स"]
[null,null,"स्कोर और GPA मैपिंग"]
[null,null,"प्रतिशत",{"v":0,"d":"0%"},{"v":0.6,"d":"60%"},{"v":0.63,"d":"63%"},{"v":0.67,"d":"67%"},{"v":0.7,"d":"70%"},{"v":0.73,"d":"73%"},{"v":0.77,"d":"77%"},{"v":0.8,"d":"80%"},{"v":0.83,"d":"83%"},{"v":0.87,"d":"87%"},{"v":0.9,"d":"90%"},{"v":0.93,"d":"93%"},{"v":0.97,"d":"97%"}]
[null,null,"लेटर ग्रेड","F","D-","D","D+","C-","C","C+","B-","B","B+","A-","A","A+"]
[null,null,"GPA",0,0.67,1,1.33,1.67,2,2.33,2.67,3,3.33,3.67,4,4]
[]
[null,null,"25 कक्षाओं तक के लिए भारित स्कोर"]
[null,null,"आपके द्वारा ली जाने वाली कक्षाएँ","क्रेडिट घंटे","गृहकार्य","निबंध","क्विज़","प्रोजेक्ट","मध्यावधि","अंतिम परीक्षा","अन्य","% कुल"]
[null,null,"आधुनिक फ़्रेंच",{"v":3,"d":"3.0"},{"v":0.1,"d":"10%"},{"v":0.15,"d":"15%"},{"v":0.15,"d":"15%"},{"v":0.1,"d":"10%"},{"v":0.2,"d":"20%"},{"v":0.3,"d":"30%"},null,{"$f":"SUM(tblClasses[[#This Row],[गृहकार्य]:[अन्य]])","v":{"v":1,"d":"100%"}}]
[null,null,"सैद्धांतिक भौतिकी",{"v":3,"d":"3.0"},{"v":0.15,"d":"15%"},{"v":0.15,"d":"15%"},{"v":0.1,"d":"10%"},{"v":0.1,"d":"10%"},{"v":0.15,"d":"15%"},{"v":0.3,"d":"30%"},{"v":0.05,"d":"5%"},{"$f":"SUM(tblClasses[[#This Row],[गृहकार्य]:[अन्य]])","v":{"v":1,"d":"100%"}}]
[null,null,"गणित 1",{"v":4,"d":"4.0"},{"v":0.1,"d":"10%"},{"v":0.15,"d":"15%"},{"v":0.15,"d":"15%"},{"v":0.1,"d":"10%"},{"v":0.2,"d":"20%"},{"v":0.3,"d":"30%"},null,{"$f":"SUM(tblClasses[[#This Row],[गृहकार्य]:[अन्य]])","v":{"v":1,"d":"100%"}}]
[null,null,"गणित 2",{"v":4,"d":"4.0"},{"v":0.15,"d":"15%"},{"v":0.15,"d":"15%"},{"v":0.1,"d":"10%"},{"v":0.1,"d":"10%"},{"v":0.15,"d":"15%"},{"v":0.3,"d":"30%"},{"v":0.05,"d":"5%"},{"$f":"SUM(tblClasses[[#This Row],[गृहकार्य]:[अन्य]])","v":{"v":1,"d":"100%"}}]
[null,null,"Java में उन्नत प्रोग्रामिंग",{"v":5,"d":"5.0"},{"v":0.15,"d":"15%"},{"v":0.15,"d":"15%"},{"v":0.1,"d":"10%"},{"v":0.1,"d":"10%"},{"v":0.2,"d":"20%"},{"v":0.3,"d":"30%"},null,{"$f":"SUM(tblClasses[[#This Row],[गृहकार्य]:[अन्य]])","v":{"v":1,"d":"100%"}}]
[null,null,"स्पैनिश",{"v":3,"d":"3.0"},{"v":0.1,"d":"10%"},{"v":0.15,"d":"15%"},{"v":0.17,"d":"17%"},{"v":0.13,"d":"13%"},{"v":0.2,"d":"20%"},{"v":0.2,"d":"20%"},{"v":0.05,"d":"5%"},{"$f":"SUM(tblClasses[[#This Row],[गृहकार्य]:[अन्य]])","v":{"v":1,"d":"100%"}}]
[null,null,"संरचना",{"v":2,"d":"2.0"},{"v":0.15,"d":"15%"},{"v":0.15,"d":"15%"},{"v":0.12,"d":"12%"},{"v":0.15,"d":"15%"},{"v":0.15,"d":"15%"},{"v":0.25,"d":"25%"},{"v":0.03,"d":"3%"},{"$f":"SUM(tblClasses[[#This Row],[गृहकार्य]:[अन्य]])","v":{"v":1,"d":"100%"}}]
{"$rows_left_out":1}
{"sheet":"परिकलन","index":3,"n_rows":657,"n_cols":40,"rows_kept":657,"hidden":true}
[null,"परिकलन"]
[null,null,"यह कार्यपत्रक आपके ग्रेड्स और GPA का परिकलन प्रदान करता है और यह छुपा रहना चाहिए. इस पत्रक में किसी भी परिवर्तन से त्रुटियाँ आ सकती हैं."]
[]
[null,null,"वर्तमान कक्षा सूची","स्कोर (1 में से)",{"$nulls":24},"ग्रेड परिकलन"]
[null,null,"कक्षा",1,2,3,4,5,6,7,8,9,10,11,12,13,14,15,16,17,18,19,20,21,22,23,24,25,{"$f":"tblClasses[[#Headers],[गृहकार्य]]","v":"गृहकार्य"},{"$f":"tblClasses[[#Headers],[निबंध]]","v":"निबंध"},{"$f":"tblClasses[[#Headers],[क्विज़]]","v":"क्विज़"},{"$f":"tblClasses[[#Headers],[प्रोजेक्ट]]","v":"प्रोजेक्ट"},{"$f":"tblClasses[[#Headers],[मध्यावधि]]","v":"मध्यावधि"},{"$f":"tblClasses[[#Headers],[अंतिम परीक्षा]]","v":"अंतिम परीक्षा"},{"$f":"tblClasses[[#Headers],[अन्य]]","v":"अन्य"},"कुल","कुल संभव पॉइंट्स","कुल %","ग्रेड पॉइंट","लेटर ग्रेड"]
[null,null,{"$f":"IF(सेटिंग्स!C9=\"\",\"\",सेटिंग्स!C9)","v":"आधुनिक फ़्रेंच"},{"$f":"IFERROR(INDEX(tblClassScores[],MATCH($C6:$C30&D$5:AB$5,परिकलन!$C$33:$C$657,0),4),\"\")","v":{"v":0.8,"d":"80%"}},{"v":0.9,"d":"90%"},{"v":0.8,"d":"80%"},"","","","","","","","","","","","","","","","","","","","","","",{"$f":"IFERROR(AVERAGEIFS(tblClassScores[स्कोर],tblClassScores[कक्षा],परिकलन!$C6,tblClassScores[प्रकार],परिकलन!AC$5)*सेटिंग्स!E9,\"\")","v":0.08333333333333334},{"$f":"IFERROR(AVERAGEIFS(tblClassScores[स्कोर],tblClassScores[कक्षा],परिकलन!$C6,tblClassScores[प्रकार],परिकलन!AD$5)*सेटिंग्स!F9,\"\")","v":""},{"$f":"IFERROR(AVERAGEIFS(tblClassScores[स्कोर],tblClassScores[कक्षा],परिकलन!$C6,tblClassScores[प्रकार],परिकलन!AE$5)*सेटिंग्स!G9,\"\")","v":""},{"$f":"IFERROR(AVERAGEIFS(tblClassScores[स्कोर],tblClassScores[कक्षा],परिकलन!$C6,tblClassScores[प्रकार],परिकलन!AF$5)*सेटिंग्स!H9,\"\")","v":""},{"$f":"IFERROR(AVERAGEIFS(tblClassScores[स्कोर],tblClassScores[कक्षा],परिकलन!$C6,tblClassScores[प्रकार],परिकलन!AG$5)*सेटिंग्स!I9,\"\")","v":""},{"$f":"IFERROR(AVERAGEIFS(tblClassScores[स्कोर],tblClassScores[कक्षा],परिकलन!$C6,tblClassScores[प्रकार],परिकलन!AH$5)*सेटिंग्स!J9,\"\")","v":""},{"$f":"IFERROR(AVERAGEIFS(tblClassScores[स्कोर],tblClassScores[कक्षा],परिकलन!$C6,tblClassScores[प्रकार],परिकलन!AI$5)*सेटिंग्स!K9,\"\")","v":""},{"$f":"SUM(AC6:AI6)","v":0.08333333333333334},{"$f":"SUMIFS(सेटिंग्स!E9:K9,परिकलन!AC6:AI6,\">0\")","v":0.1},{"$f":"IFERROR(AJ6/AK6,\"\")","v":{"v":0.8333333333333334,"d":"83%"}},{"$f":"IFERROR(HLOOKUP(AL6,lstGPAMapping,3),\"\")","v":3},{"$f":"IFERROR(HLOOKUP(AL6,lstGPAMapping,2),\"\")","v":"B"}]
[null,null,{"$f":"IF(सेटिंग्स!C10=\"\",\"\",सेटिंग्स!C10)","v":"सैद्धांतिक भौतिकी"},{"v":0.95,"d":"95%"},"","","","","","","","","","","","","","","","","","","","","","","","",{"$f":"IFERROR(AVERAGEIFS(tblClassScores[स्कोर],tblClassScores[कक्षा],परिकलन!$C7,tblClassScores[प्रकार],परिकलन!AC$5)*सेटिंग्स!E10,\"\")","v":0.1425},{"$f":"IFERROR(AVERAGEIFS(tblClassScores[स्कोर],tblClassScores[कक्षा],परिकलन!$C7,tblClassScores[प्रकार],परिकलन!AD$5)*सेटिंग्स!F10,\"\")","v":""},{"$f":"IFERROR(AVERAGEIFS(tblClassScores[स्कोर],tblClassScores[कक्षा],परिकलन!$C7,tblClassScores[प्रकार],परिकलन!AE$5)*सेटिंग्स!G10,\"\")","v":""},{"$f":"IFERROR(AVERAGEIFS(tblClassScores[स्कोर],tblClassScores[कक्षा],परिकलन!$C7,tblClassScores[प्रकार],परिकलन!AF$5)*सेटिंग्स!H10,\"\")","v":""},{"$f":"IFERROR(AVERAGEIFS(tblClassScores[स्कोर],tblClassScores[कक्षा],परिकलन!$C7,tblClassScores[प्रकार],परिकलन!AG$5)*सेटिंग्स!I10,\"\")","v":""},{"$f":"IFERROR(AVERAGEIFS(tblClassScores[स्कोर],tblClassScores[कक्षा],परिकलन!$C7,tblClassScores[प्रकार],परिकलन!AH$5)*सेटिंग्स!J10,\"\")","v":""},{"$f":"IFERROR(AVERAGEIFS(tblClassScores[स्कोर],tblClassScores[कक्षा],परिकलन!$C7,tblClassScores[प्रकार],परिकलन!AI$5)*सेटिंग्स!K10,\"\")","v":""},{"$f":"SUM(AC7:AI7)","v":0.1425},{"$f":"SUMIFS(सेटिंग्स!E10:K10,परिकलन!AC7:AI7,\">0\")","v":0.15},{"$f":"IFERROR(AJ7/AK7,\"\")","v":{"v":0.95,"d":"95%"}},4,"A"]
[null,null,{"$f":"IF(सेटिंग्स!C11=\"\",\"\",सेटिंग्स!C11)","v":"गणित 1"},{"v":0.8,"d":"80%"},{"v":0.8,"d":"80%"},"","","","","","","","","","","","","","","","","","","","","","","",{"$f":"IFERROR(AVERAGEIFS(tblClassScores[स्कोर],tblClassScores[कक्षा],परिकलन!$C8,tblClassScores[प्रकार],परिकलन!AC$5)*सेटिंग्स!E11,\"\")","v":0.08000000000000002},{"$f":"IFERROR(AVERAGEIFS(tblClassScores[स्कोर],tblClassScores[कक्षा],परिकलन!$C8,tblClassScores[प्रकार],परिकलन!AD$5)*सेटिंग्स!F11,\"\")","v":""},{"$f":"IFERROR(AVERAGEIFS(tblClassScores[स्कोर],tblClassScores[कक्षा],परिकलन!$C8,tblClassScores[प्रकार],परिकलन!AE$5)*सेटिंग्स!G11,\"\")","v":""},{"$f":"IFERROR(AVERAGEIFS(tblClassScores[स्कोर],tblClassScores[कक्षा],परिकलन!$C8,tblClassScores[प्रकार],परिकलन!AF$5)*सेटिंग्स!H11,\"\")","v":""},{"$f":"IFERROR(AVERAGEIFS(tblClassScores[स्कोर],tblClassScores[कक्षा],परिकलन!$C8,tblClassScores[प्रकार],परिकलन!AG$5)*सेटिंग्स!I11,\"\")","v":""},{"$f":"IFERROR(AVERAGEIFS(tblClassScores[स्कोर],tblClassScores[कक्षा],परिकलन!$C8,tblClassScores[प्रकार],परिकलन!AH$5)*सेटिंग्स!J11,\"\")","v":""},{"$f":"IFERROR(AVERAGEIFS(tblClassScores[स्कोर],tblClassScores[कक्षा],परिकलन!$C8,tblClassScores[प्रकार],परिकलन!AI$5)*सेटिंग्स!K11,\"\")","v":""},0.08000000000000002,{"$f":"SUMIFS(सेटिंग्स!E11:K11,परिकलन!AC8:AI8,\">0\")","v":0.1},{"v":0.8000000000000002,"d":"80%"},2.67,"B-"]
[null,null,{"$f":"IF(सेटिंग्स!C12=\"\",\"\",सेटिंग्स!C12)","v":"गणित 2"},{"v":0.85,"d":"85%"},{"v":0.95,"d":"95%"},"","","","","","","","","","","","","","","","","","","","","","","",{"$f":"IFERROR(AVERAGEIFS(tblClassScores[स्कोर],tblClassScores[कक्षा],परिकलन!$C9,tblClassScores[प्रकार],परिकलन!AC$5)*सेटिंग्स!E12,\"\")","v":0.1275},{"$f":"IFERROR(AVERAGEIFS(tblClassScores[स्कोर],tblClassScores[कक्षा],परिकलन!$C9,tblClassScores[प्रकार],परिकलन!AD$5)*सेटिंग्स!F12,\"\")","v":""},{"$f":"IFERROR(AVERAGEIFS(tblClassScores[स्कोर],tblClassScores[कक्षा],परिकलन!$C9,tblClassScores[प्रकार],परिकलन!AE$5)*सेटिंग्स!G12,\"\")","v":0.095},{"$f":"IFERROR(AVERAGEIFS(tblClassScores[स्कोर],tblClassScores[कक्षा],परिकलन!$C9,tblClassScores[प्रकार],परिकलन!AF$5)*सेटिंग्स!H12,\"\")","v":""},{"$f":"IFERROR(AVERAGEIFS(tblClassScores[स्कोर],tblClassScores[कक्षा],परिकलन!$C9,tblClassScores[प्रकार],परिकलन!AG$5)*सेटिंग्स!I12,\"\")","v":""},{"$f":"IFERROR(AVERAGEIFS(tblClassScores[स्कोर],tblClassScores[कक्षा],परिकलन!$C9,tblClassScores[प्रकार],परिकलन!AH$5)*सेटिंग्स!J12,\"\")","v":""},{"$f":"IFERROR(AVERAGEIFS(tblClassScores[स्कोर],tblClassScores[कक्षा],परिकलन!$C9,tblClassScores[प्रकार],परिकलन!AI$5)*सेटिंग्स!K12,\"\")","v":""},0.2225,{"$f":"SUMIFS(सेटिंग्स!E12:K12,परिकलन!AC9:AI9,\">0\")","v":0.25},{"v":0.89,"d":"89%"},3.33,"B+"]
[null,null,{"$f":"IF(सेटिंग्स!C13=\"\",\"\",सेटिंग्स!C13)","v":"Java में उन्नत प्रोग्रामिंग"},{"v":0.75,"d":"75%"},"","","","","","","","","","","","","","","","","","","","","","","","",{"$f":"IFERROR(AVERAGEIFS(tblClassScores[स्कोर],tblClassScores[कक्षा],परिकलन!$C10,tblClassScores[प्रकार],परिकलन!AC$5)*सेटिंग्स!E13,\"\")","v":""},{"$f":"IFERROR(AVERAGEIFS(tblClassScores[स्कोर],tblClassScores[कक्षा],परिकलन!$C10,tblClassScores[प्रकार],परिकलन!AD$5)*सेटिंग्स!F13,\"\")","v":""},{"$f":"IFERROR(AVERAGEIFS(tblClassScores[स्कोर],tblClassScores[कक्षा],परिकलन!$C10,tblClassScores[प्रकार],परिकलन!AE$5)*सेटिंग्स!G13,\"\")","v":""},{"$f":"IFERROR(AVERAGEIFS(tblClassScores[स्कोर],tblClassScores[कक्षा],परिकलन!$C10,tblClassScores[प्रकार],परिकलन!AF$5)*सेटिंग्स!H13,\"\")","v":""},{"$f":"IFERROR(AVERAGEIFS(tblClassScores[स्कोर],tblClassScores[कक्षा],परिकलन!$C10,tblClassScores[प्रकार],परिकलन!AG$5)*सेटिंग्स!I13,\"\")","v":0.15000000000000002},{"$f":"IFERROR(AVERAGEIFS(tblClassScores[स्कोर],tblClassScores[कक्षा],परिकलन!$C10,tblClassScores[प्रकार],परिकलन!AH$5)*सेटिंग्स!J13,\"\")","v":""},{"$f":"IFERROR(AVERAGEIFS(tblClassScores[स्कोर],tblClassScores[कक्षा],परिकलन!$C10,tblClassScores[प्रकार],परिकलन!AI$5)*सेटिंग्स!K13,\"\")","v":""},0.15000000000000002,{"$f":"SUMIFS(सेटिंग्स!E13:K13,परिकलन!AC10:AI10,\">0\")","v":0.2},{"v":0.7500000000000001,"d":"75%"},2,"C"]
[null,null,{"$f":"IF(सेटिंग्स!C14=\"\",\"\",सेटिंग्स!C14)","v":"स्पैनिश"},{"v":0.5,"d":"50%"},"","","","","","","","","","","","","","","","","","","","","","","","",{"$f":"IFERROR(AVERAGEIFS(tblClassScores[स्कोर],tblClassScores[कक्षा],परिकलन!$C11,tblClassScores[प्रकार],परिकलन!AC$5)*सेटिंग्स!E14,\"\")","v":0.05},{"$f":"IFERROR(AVERAGEIFS(tblClassScores[स्कोर],tblClassScores[कक्षा],परिकलन!$C11,tblClassScores[प्रकार],परिकलन!AD$5)*सेटिंग्स!F14,\"\")","v":""},{"$f":"IFERROR(AVERAGEIFS(tblClassScores[स्कोर],tblClassScores[कक्षा],परिकलन!$C11,tblClassScores[प्रकार],परिकलन!AE$5)*सेटिंग्स!G14,\"\")","v":""},{"$f":"IFERROR(AVERAGEIFS(tblClassScores[स्कोर],tblClassScores[कक्षा],परिकलन!$C11,tblClassScores[प्रकार],परिकलन!AF$5)*सेटिंग्स!H14,\"\")","v":""},{"$f":"IFERROR(AVERAGEIFS(tblClassScores[स्कोर],tblClassScores[कक्षा],परिकलन!$C11,tblClassScores[प्रकार],परिकलन!AG$5)*सेटिंग्स!I14,\"\")","v":""},{"$f":"IFERROR(AVERAGEIFS(tblClassScores[स्कोर],tblClassScores[कक्षा],परिकलन!$C11,tblClassScores[प्रकार],परिकलन!AH$5)*सेटिंग्स!J14,\"\")","v":""},{"$f":"IFERROR(AVERAGEIFS(tblClassScores[स्कोर],tblClassScores[कक्षा],परिकलन!$C11,tblClassScores[प्रकार],परिकलन!AI$5)*सेटिंग्स!K14,\"\")","v":""},0.05,{"$f":"SUMIFS(सेटिंग्स!E14:K14,परिकलन!AC11:AI11,\">0\")","v":0.1},{"v":0.5,"d":"50%"},0,"F"]
[null,null,{"$f":"IF(सेटिंग्स!C15=\"\",\"\",सेटिंग्स!C15)","v":"संरचना"},{"v":0.95,"d":"95%"},"","","","","","","","","","","","","","","","","","","","","","","","",{"$f":"IFERROR(AVERAGEIFS(tblClassScores[स्कोर],tblClassScores[कक्षा],परिकलन!$C12,tblClassScores[प्रकार],परिकलन!AC$5)*सेटिंग्स!E15,\"\")","v":""},{"$f":"IFERROR(AVERAGEIFS(tblClassScores[स्कोर],tblClassScores[कक्षा],परिकलन!$C12,tblClassScores[प्रकार],परिकलन!AD$5)*सेटिंग्स!F15,\"\")","v":0.1425},{"$f":"IFERROR(AVERAGEIFS(tblClassScores[स्कोर],tblClassScores[कक्षा],परिकलन!$C12,tblClassScores[प्रकार],परिकलन!AE$5)*सेटिंग्स!G15,\"\")","v":""},{"$f":"IFERROR(AVERAGEIFS(tblClassScores[स्कोर],tblClassScores[कक्षा],परिकलन!$C12,tblClassScores[प्रकार],परिकलन!AF$5)*सेटिंग्स!H15,\"\")","v":""},{"$f":"IFERROR(AVERAGEIFS(tblClassScores[स्कोर],tblClassScores[कक्षा],परिकलन!$C12,tblClassScores[प्रकार],परिकलन!AG$5)*सेटिंग्स!I15,\"\")","v":""},{"$f":"IFERROR(AVERAGEIFS(tblClassScores[स्कोर],tblClassScores[कक्षा],परिकलन!$C12,tblClassScores[प्रकार],परिकलन!AH$5)*सेटिंग्स!J15,\"\")","v":""},{"$f":"IFERROR(AVERAGEIFS(tblClassScores[स्कोर],tblClassScores[कक्षा],परिकलन!$C12,tblClassScores[प्रकार],परिकलन!AI$5)*सेटिंग्स!K15,\"\")","v":""},0.1425,{"$f":"SUMIFS(सेटिंग्स!E15:K15,परिकलन!AC12:AI12,\">0\")","v":0.15},{"v":0.95,"d":"95%"},4,"A"]
[null,null,{"$f":"IF(सेटिंग्स!C16=\"\",\"\",सेटिंग्स!C16)","v":""},"","","","","","","","","","","","","","","","","","","","","","","","","",{"$f":"IFERROR(AVERAGEIFS(tblClassScores[स्कोर],tblClassScores[कक्षा],परिकलन!$C13,tblClassScores[प्रकार],परिकलन!AC$5)*सेटिंग्स!#REF!,\"\")","v":""},{"$f":"IFERROR(AVERAGEIFS(tblClassScores[स्कोर],tblClassScores[कक्षा],परिकलन!$C13,tblClassScores[प्रकार],परिकलन!AD$5)*सेटिंग्स!#REF!,\"\")","v":""},{"$f":"IFERROR(AVERAGEIFS(tblClassScores[स्कोर],tblClassScores[कक्षा],परिकलन!$C13,tblClassScores[प्रकार],परिकलन!AE$5)*सेटिंग्स!#REF!,\"\")","v":""},{"$f":"IFERROR(AVERAGEIFS(tblClassScores[स्कोर],tblClassScores[कक्षा],परिकलन!$C13,tblClassScores[प्रकार],परिकलन!AF$5)*सेटिंग्स!#REF!,\"\")","v":""},{"$f":"IFERROR(AVERAGEIFS(tblClassScores[स्कोर],tblClassScores[कक्षा],परिकलन!$C13,tblClassScores[प्रकार],परिकलन!AG$5)*सेटिंग्स!#REF!,\"\")","v":""},{"$f":"IFERROR(AVERAGEIFS(tblClassScores[स्कोर],tblClassScores[कक्षा],परिकलन!$C13,tblClassScores[प्रकार],परिकलन!AH$5)*सेटिंग्स!#REF!,\"\")","v":""},{"$f":"IFERROR(AVERAGEIFS(tblClassScores[स्कोर],tblClassScores[कक्षा],परिकलन!$C13,tblClassScores[प्रकार],परिकलन!AI$5)*सेटिंग्स!#REF!,\"\")","v":""},0,{"$f":"SUMIFS(सेटिंग्स!E16:K16,परिकलन!AC13:AI13,\">0\")","v":0},"","",""]
[null,null,{"$f":"IF(सेटिंग्स!C17=\"\",\"\",सेटिंग्स!C17)","v":""},"","","","","","","","","","","","","","","","","","","","","","","","","",{"$f":"IFERROR(AVERAGEIFS(tblClassScores[स्कोर],tblClassScores[कक्षा],परिकलन!$C14,tblClassScores[प्रकार],परिकलन!AC$5)*सेटिंग्स!#REF!,\"\")","v":""},{"$f":"IFERROR(AVERAGEIFS(tblClassScores[स्कोर],tblClassScores[कक्षा],परिकलन!$C14,tblClassScores[प्रकार],परिकलन!AD$5)*सेटिंग्स!#REF!,\"\")","v":""},{"$f":"IFERROR(AVERAGEIFS(tblClassScores[स्कोर],tblClassScores[कक्षा],परिकलन!$C14,tblClassScores[प्रकार],परिकलन!AE$5)*सेटिंग्स!#REF!,\"\")","v":""},{"$f":"IFERROR(AVERAGEIFS(tblClassScores[स्कोर],tblClassScores[कक्षा],परिकलन!$C14,tblClassScores[प्रकार],परिकलन!AF$5)*सेटिंग्स!#REF!,\"\")","v":""},{"$f":"IFERROR(AVERAGEIFS(tblClassScores[स्कोर],tblClassScores[कक्षा],परिकलन!$C14,tblClassScores[प्रकार],परिकलन!AG$5)*सेटिंग्स!#REF!,\"\")","v":""},{"$f":"IFERROR(AVERAGEIFS(tblClassScores[स्कोर],tblClassScores[कक्षा],परिकलन!$C14,tblClassScores[प्रकार],परिकलन!AH$5)*सेटिंग्स!#REF!,\"\")","v":""},{"$f":"IFERROR(AVERAGEIFS(tblClassScores[स्कोर],tblClassScores[कक्षा],परिकलन!$C14,tblClassScores[प्रकार],परिकलन!AI$5)*सेटिंग्स!#REF!,\"\")","v":""},0,{"$f":"SUMIFS(सेटिंग्स!E17:K17,परिकलन!AC14:AI14,\">0\")","v":0},"","",""]
[null,null,{"$f":"IF(सेटिंग्स!C18=\"\",\"\",सेटिंग्स!C18)","v":""},"","","","","","","","","","","","","","","","","","","","","","","","","",{"$f":"IFERROR(AVERAGEIFS(tblClassScores[स्कोर],tblClassScores[कक्षा],परिकलन!$C15,tblClassScores[प्रकार],परिकलन!AC$5)*सेटिंग्स!#REF!,\"\")","v":""},{"$f":"IFERROR(AVERAGEIFS(tblClassScores[स्कोर],tblClassScores[कक्षा],परिकलन!$C15,tblClassScores[प्रकार],परिकलन!AD$5)*सेटिंग्स!#REF!,\"\")","v":""},{"$f":"IFERROR(AVERAGEIFS(tblClassScores[स्कोर],tblClassScores[कक्षा],परिकलन!$C15,tblClassScores[प्रकार],परिकलन!AE$5)*सेटिंग्स!#REF!,\"\")","v":""},{"$f":"IFERROR(AVERAGEIFS(tblClassScores[स्कोर],tblClassScores[कक्षा],परिकलन!$C15,tblClassScores[प्रकार],परिकलन!AF$5)*सेटिंग्स!#REF!,\"\")","v":""},{"$f":"IFERROR(AVERAGEIFS(tblClassScores[स्कोर],tblClassScores[कक्षा],परिकलन!$C15,tblClassScores[प्रकार],परिकलन!AG$5)*सेटिंग्स!#REF!,\"\")","v":""},{"$f":"IFERROR(AVERAGEIFS(tblClassScores[स्कोर],tblClassScores[कक्षा],परिकलन!$C15,tblClassScores[प्रकार],परिकलन!AH$5)*सेटिंग्स!#REF!,\"\")","v":""},{"$f":"IFERROR(AVERAGEIFS(tblClassScores[स्कोर],tblClassScores[कक्षा],परिकलन!$C15,tblClassScores[प्रकार],परिकलन!AI$5)*सेटिंग्स!#REF!,\"\")","v":""},0,{"$f":"SUMIFS(सेटिंग्स!E18:K18,परिकलन!AC15:AI15,\">0\")","v":0},"","",""]
{"$rows_left_out":642}