{"text_format":"3","workbook":"xlsx","n_sheets":3,"sheets":["छात्र सूची","कक्षा नामावली","छात्र का विवरण"],"not_rendered":{"images":2,"defined_names":3},"read":"whole","date_system":"1900"}

{"sheet":"छात्र सूची","index":0,"n_rows":7,"n_cols":12,"rows_kept":7,"merged":[[7,1,7,11]]}
[]
[]
[null," ","छात्र का नाम","ईमेल","घर का फ़ोन","सेल फ़ोन","जन्मतिथि","आपातकालीन संपर्क","आपातकालीन फ़ोन","चिकित्सक","चिकित्सक का फ़ोन","  "]
[null,{"$f":"छात्र[[#This Row],[छात्र का नाम]]","v":"अलेक्जेंडर, डेविड"},"अलेक्जेंडर, डेविड","david@example.com",1235550121,1235550126,"1993-01-01","मिशेल अलेक्जेंडर",1235550130,"शु इतो",1235550134]
[null,{"$f":"छात्र[[#This Row],[छात्र का नाम]]","v":"किम, शेन"},"किम, शेन","shane@example.com",1235550122,1235550127,"1992-01-01","जिम किम",1235550131,"डैनियल रोथ",1235550135]
[null,{"$f":"छात्र[[#This Row],[छात्र का नाम]]","v":"मीरचंदानी, भरत"},"मीरचंदानी, भरत","bharat@example.com",1235550124,1235550128,"1991-01-01","नितिन एस. मीरचंदानी",1235550132,"जॉन केन",1235550136]
[null,{"$f":"छात्र[[#This Row],[छात्र का नाम]]","v":"टर्नर, रिचर्ड"},"टर्नर, रिचर्ड","richard@example.com",1235550125,1235550129,"1992-01-01","ओलिंडा टर्नर",1235550133,"टेरी अर्ल्स",1235550137]

{"sheet":"कक्षा नामावली","index":1,"n_rows":12,"n_cols":7,"rows_kept":12,"merged":[[12,1,12,6]]}
["."]
[{"$nulls":3},"ग्राफ़िक डिज़ाइन संस्थान"]
[null,null,"पाठ्यक्रम","ग्राफ़िक आर्ट्स 101","प्रारंभ दिनांक","6 जून, 11"]
[null,null,"प्रशिक्षक","हैंसन, मार्क","समाप्ति दिनांक","26 अगस्त, 11"]
[null,null,"नामांकित छात्र",{"$f":"COUNTA(छात्रनामावली[छात्र का नाम])","v":5}]
[]
[null," ","छात्र का नाम","ईमेल","घर का फ़ोन","सेल फ़ोन","  "]
[null,null,"अलेक्जेंडर, डेविड",{"$f":"IFERROR(VLOOKUP(छात्रनामावली[[#This Row],[छात्र का नाम]],छात्र[],3),\"\")","v":"david@example.com"},{"$f":"IFERROR(VLOOKUP(छात्रनामावली[[#This Row],[छात्र का नाम]],छात्र[],4),\"\")","v":1235550121},{"$f":"IFERROR(VLOOKUP(छात्रनामावली[[#This Row],[छात्र का नाम]],छात्र[],5),\"\")","v":1235550126}]
[null,null,"किम, शेन",{"$f":"IFERROR(VLOOKUP(छात्रनामावली[[#This Row],[छात्र का नाम]],छात्र[],3),\"\")","v":"shane@example.com"},{"$f":"IFERROR(VLOOKUP(छात्रनामावली[[#This Row],[छात्र का नाम]],छात्र[],4),\"\")","v":1235550122},{"$f":"IFERROR(VLOOKUP(छात्रनामावली[[#This Row],[छात्र का नाम]],छात्र[],5),\"\")","v":1235550127}]
[null,null,"मीरचंदानी, भरत",{"$f":"IFERROR(VLOOKUP(छात्रनामावली[[#This Row],[छात्र का नाम]],छात्र[],3),\"\")","v":"bharat@example.com"},{"$f":"IFERROR(VLOOKUP(छात्रनामावली[[#This Row],[छात्र का नाम]],छात्र[],4),\"\")","v":1235550124},{"$f":"IFERROR(VLOOKUP(छात्रनामावली[[#This Row],[छात्र का नाम]],छात्र[],5),\"\")","v":1235550128}]
[null,null,"टर्नर, रिचर्ड",{"$f":"IFERROR(VLOOKUP(छात्रनामावली[[#This Row],[छात्र का नाम]],छात्र[],3),\"\")","v":"shane@example.com"},{"$f":"IFERROR(VLOOKUP(छात्रनामावली[[#This Row],[छात्र का नाम]],छात्र[],4),\"\")","v":1235550122},{"$f":"IFERROR(VLOOKUP(छात्रनामावली[[#This Row],[छात्र का नाम]],छात्र[],5),\"\")","v":1235550127}]
[null,null,"किम, शेन",{"$f":"IFERROR(VLOOKUP(छात्रनामावली[[#This Row],[छात्र का नाम]],छात्र[],3),\"\")","v":"shane@example.com"},{"$f":"IFERROR(VLOOKUP(छात्रनामावली[[#This Row],[छात्र का नाम]],छात्र[],4),\"\")","v":1235550122},{"$f":"IFERROR(VLOOKUP(छात्रनामावली[[#This Row],[छात्र का नाम]],छात्र[],5),\"\")","v":1235550127}]

{"sheet":"छात्र का विवरण","index":2,"n_rows":12,"n_cols":4,"rows_kept":12}
[]
[]
[]
[null,null,"छात्र का नाम","अलेक्जेंडर, डेविड"]
[null,null,"ईमेल",{"$f":"IFERROR(VLOOKUP(छात्रकानाम,छात्र[],3,FALSE),\"\")","v":"david@example.com"}]
[null,null,"घर का फ़ोन",{"$f":"IFERROR(VLOOKUP(छात्रकानाम,छात्र[],4,FALSE),\"\")","v":1235550121}]
[null,null,"सेल फ़ोन",{"$f":"IFERROR(VLOOKUP(छात्रकानाम,छात्र[],5,FALSE),\"\")","v":1235550126}]
[null,null,"जन्मतिथि",{"$f":"IFERROR(VLOOKUP(छात्रकानाम,छात्र[],6,FALSE),\"\")","v":"1993-01-01"}]
[null,null,"आपातकालीन संपर्क",{"$f":"IFERROR(VLOOKUP(छात्रकानाम,छात्र[],7,FALSE),\"\")","v":"मिशेल अलेक्जेंडर"}]
[null,null,"आपातकालीन फ़ोन",{"$f":"IFERROR(VLOOKUP(छात्रकानाम,छात्र[],8,FALSE),\"\")","v":1235550130}]
[null,null,"चिकित्सक",{"$f":"IFERROR(VLOOKUP(छात्रकानाम,छात्र[],9,FALSE),\"\")","v":"शु इतो"}]
[null,null,"चिकित्सक का फ़ोन",{"$f":"IFERROR(VLOOKUP(छात्रकानाम,छात्र[],10,FALSE),\"\")","v":1235550134}]