{"text_format":"3","workbook":"xlsx","n_sheets":4,"sheets":["אירועים","לוח שנה‏","גירסה להדפסה","ניהול"],"not_rendered":{"defined_names":18},"read":"whole","date_system":"1900"}

{"sheet":"אירועים","index":0,"n_rows":38,"n_cols":5,"rows_kept":38}
[]
[null,"לוח תכנון של אירועים"]
[null,"קהילתיים חודשיים"]
[]
[]
[]
[]
[null,"תאריך","יום","חודש","שם אירוע"]
[null,"2016-07-01",{"$f":"IF(ISBLANK(tblEvents[[#This Row],[תאריך]]),\"\",UPPER(TEXT(tblEvents[[#This Row],[תאריך]],\"ddd\")))","v":"יום ו"},{"$f":"IF(ISBLANK(tblEvents[[#This Row],[תאריך]]),\"\",UPPER(TEXT(tblEvents[[#This Row],[תאריך]],\"mmm\")))","v":"יול"},"גינה קהילתית"]
[null,"2016-07-01",{"$f":"IF(ISBLANK(tblEvents[[#This Row],[תאריך]]),\"\",UPPER(TEXT(tblEvents[[#This Row],[תאריך]],\"ddd\")))","v":"יום ו"},{"$f":"IF(ISBLANK(tblEvents[[#This Row],[תאריך]]),\"\",UPPER(TEXT(tblEvents[[#This Row],[תאריך]],\"mmm\")))","v":"יול"},"מועצת העיר"]
[null,"2016-07-02",{"$f":"IF(ISBLANK(tblEvents[[#This Row],[תאריך]]),\"\",UPPER(TEXT(tblEvents[[#This Row],[תאריך]],\"ddd\")))","v":"שבת"},{"$f":"IF(ISBLANK(tblEvents[[#This Row],[תאריך]]),\"\",UPPER(TEXT(tblEvents[[#This Row],[תאריך]],\"mmm\")))","v":"יול"},"גינה קהילתית"]
[null,"2016-07-03",{"$f":"IF(ISBLANK(tblEvents[[#This Row],[תאריך]]),\"\",UPPER(TEXT(tblEvents[[#This Row],[תאריך]],\"ddd\")))","v":"יום א"},{"$f":"IF(ISBLANK(tblEvents[[#This Row],[תאריך]]),\"\",UPPER(TEXT(tblEvents[[#This Row],[תאריך]],\"mmm\")))","v":"יול"},"ערב סרטים בפארק"]
[null,"2016-07-08",{"$f":"IF(ISBLANK(tblEvents[[#This Row],[תאריך]]),\"\",UPPER(TEXT(tblEvents[[#This Row],[תאריך]],\"ddd\")))","v":"יום ו"},{"$f":"IF(ISBLANK(tblEvents[[#This Row],[תאריך]]),\"\",UPPER(TEXT(tblEvents[[#This Row],[תאריך]],\"mmm\")))","v":"יול"},"מועצת העיר"]
[null,"2016-07-11",{"$f":"IF(ISBLANK(tblEvents[[#This Row],[תאריך]]),\"\",UPPER(TEXT(tblEvents[[#This Row],[תאריך]],\"ddd\")))","v":"יום ב"},{"$f":"IF(ISBLANK(tblEvents[[#This Row],[תאריך]]),\"\",UPPER(TEXT(tblEvents[[#This Row],[תאריך]],\"mmm\")))","v":"יול"},"לשכת המסחר ארוחת צהריים"]
[null,"2016-07-12",{"$f":"IF(ISBLANK(tblEvents[[#This Row],[תאריך]]),\"\",UPPER(TEXT(tblEvents[[#This Row],[תאריך]],\"ddd\")))","v":"יום ג"},{"$f":"IF(ISBLANK(tblEvents[[#This Row],[תאריך]]),\"\",UPPER(TEXT(tblEvents[[#This Row],[תאריך]],\"mmm\")))","v":"יול"},"יריד עתיקות"]
[null,"2016-07-14",{"$f":"IF(ISBLANK(tblEvents[[#This Row],[תאריך]]),\"\",UPPER(TEXT(tblEvents[[#This Row],[תאריך]],\"ddd\")))","v":"יום ה"},{"$f":"IF(ISBLANK(tblEvents[[#This Row],[תאריך]]),\"\",UPPER(TEXT(tblEvents[[#This Row],[תאריך]],\"mmm\")))","v":"יול"},"סדנה קהילתית"]
[null,"2016-07-15",{"$f":"IF(ISBLANK(tblEvents[[#This Row],[תאריך]]),\"\",UPPER(TEXT(tblEvents[[#This Row],[תאריך]],\"ddd\")))","v":"יום ו"},{"$f":"IF(ISBLANK(tblEvents[[#This Row],[תאריך]]),\"\",UPPER(TEXT(tblEvents[[#This Row],[תאריך]],\"mmm\")))","v":"יול"},"מועצת העיר"]
[null,"2016-07-19",{"$f":"IF(ISBLANK(tblEvents[[#This Row],[תאריך]]),\"\",UPPER(TEXT(tblEvents[[#This Row],[תאריך]],\"ddd\")))","v":"יום ג"},{"$f":"IF(ISBLANK(tblEvents[[#This Row],[תאריך]]),\"\",UPPER(TEXT(tblEvents[[#This Row],[תאריך]],\"mmm\")))","v":"יול"},"סדנת תכנון אסטרטגי"]
[null,"2016-07-20",{"$f":"IF(ISBLANK(tblEvents[[#This Row],[תאריך]]),\"\",UPPER(TEXT(tblEvents[[#This Row],[תאריך]],\"ddd\")))","v":"יום ד"},{"$f":"IF(ISBLANK(tblEvents[[#This Row],[תאריך]]),\"\",UPPER(TEXT(tblEvents[[#This Row],[תאריך]],\"mmm\")))","v":"יול"},"ניקוי הפארק"]
[null,"2016-07-22",{"$f":"IF(ISBLANK(tblEvents[[#This Row],[תאריך]]),\"\",UPPER(TEXT(tblEvents[[#This Row],[תאריך]],\"ddd\")))","v":"יום ו"},{"$f":"IF(ISBLANK(tblEvents[[#This Row],[תאריך]]),\"\",UPPER(TEXT(tblEvents[[#This Row],[תאריך]],\"mmm\")))","v":"יול"},"מועצת העיר"]
{"$rows_left_out":19}
{"sheet":"לוח שנה‏","index":1,"n_rows":35,"n_cols":21,"rows_kept":35,"merged":[[1,5,1,11],[30,8,34,20]]}
[]
[null,null,2016,null,null,{"$f":"LOOKUP(MonthNum,tblMonths[מספר],tblMonths[חודש])","v":"יולי"}]
[null,null,7,null,null,{"$f":"DATE(ViewYear,MonthNum,1)","v":"2016-07-01"},null,null,{"$f":"WEEKDAY(StartDate)","v":6}]
[null,null,"ראשון",null,null,"שני",null,null,"שלישי",null,null,"רביעי",null,null,"חמישי",null,null,"שישי",null,null,"שבת"]
[]
[null,null,{"$f":"StartDate-(WEEKDAY(StartDate)-1)+{0;1;2;3;4;5}*7 +{1,2,3,4,5,6,7}-3+COLUMN(B1)","v":"2016-06-26"},null,null,{"$f":"StartDate-(WEEKDAY(StartDate)-1)+{0;1;2;3;4;5}*7 +{1,2,3,4,5,6,7}-3+COLUMN(C1)","v":"2016-06-27"},null,null,{"$f":"StartDate-(WEEKDAY(StartDate)-1)+{0;1;2;3;4;5}*7 +{1,2,3,4,5,6,7}-3+COLUMN(D1)","v":"2016-06-28"},null,null,{"$f":"StartDate-(WEEKDAY(StartDate)-1)+{0;1;2;3;4;5}*7 +{1,2,3,4,5,6,7}-3+COLUMN(E1)","v":"2016-06-29"},null,null,{"$f":"StartDate-(WEEKDAY(StartDate)-1)+{0;1;2;3;4;5}*7 +{1,2,3,4,5,6,7}-3+COLUMN(F1)","v":"2016-06-30"},null,null,{"$f":"StartDate-(WEEKDAY(StartDate)-1)+{0;1;2;3;4;5}*7 +{1,2,3,4,5,6,7}-3+COLUMN(G1)","v":"2016-07-01"},null,null,{"$f":"StartDate-(WEEKDAY(StartDate)-1)+{0;1;2;3;4;5}*7 +{1,2,3,4,5,6,7}-3+COLUMN(H1)","v":"2016-07-02"}]
[null,null,{"$f":"IFERROR(INDEX(tblEvents[],SMALL(IF(Dates=C$6,ROW(Dates)),ROW(1:1))-TableRowStart,4),\"\")","v":""},null,null,{"$f":"IFERROR(INDEX(tblEvents[],SMALL(IF(Dates=F$6,ROW(Dates)),ROW(1:1))-TableRowStart,4),\"\")","v":""},null,null,{"$f":"IFERROR(INDEX(tblEvents[],SMALL(IF(Dates=I$6,ROW(Dates)),ROW(1:1))-TableRowStart,4),\"\")","v":""},null,null,{"$f":"IFERROR(INDEX(tblEvents[],SMALL(IF(Dates=L$6,ROW(Dates)),ROW(1:1))-TableRowStart,4),\"\")","v":""},null,null,{"$f":"IFERROR(INDEX(tblEvents[],SMALL(IF(Dates=O$6,ROW(Dates)),ROW(1:1))-TableRowStart,4),\"\")","v":""},null,null,{"$f":"IFERROR(INDEX(tblEvents[],SMALL(IF(Dates=R$6,ROW(Dates)),ROW(1:1))-TableRowStart,4),\"\")","v":"גינה קהילתית"},null,null,{"$f":"IFERROR(INDEX(tblEvents[],SMALL(IF(Dates=U$6,ROW(Dates)),ROW(1:1))-TableRowStart,4),\"\")","v":"גינה קהילתית"}]
[null,null,{"$f":"IFERROR(INDEX(tblEvents[],SMALL(IF(Dates=C$6,ROW(Dates)),ROW(2:2))-TableRowStart,4),\"\")","v":""},null,null,{"$f":"IFERROR(INDEX(tblEvents[],SMALL(IF(Dates=F$6,ROW(Dates)),ROW(2:2))-TableRowStart,4),\"\")","v":""},null,null,{"$f":"IFERROR(INDEX(tblEvents[],SMALL(IF(Dates=I$6,ROW(Dates)),ROW(2:2))-TableRowStart,4),\"\")","v":""},null,null,{"$f":"IFERROR(INDEX(tblEvents[],SMALL(IF(Dates=L$6,ROW(Dates)),ROW(2:2))-TableRowStart,4),\"\")","v":""},null,null,{"$f":"IFERROR(INDEX(tblEvents[],SMALL(IF(Dates=O$6,ROW(Dates)),ROW(2:2))-TableRowStart,4),\"\")","v":""},null,null,{"$f":"IFERROR(INDEX(tblEvents[],SMALL(IF(Dates=R$6,ROW(Dates)),ROW(2:2))-TableRowStart,4),\"\")","v":"מועצת העיר"},null,null,{"$f":"IFERROR(INDEX(tblEvents[],SMALL(IF(Dates=U$6,ROW(Dates)),ROW(2:2))-TableRowStart,4),\"\")","v":""}]
[null,null,{"$f":"IFERROR(INDEX(tblEvents[],SMALL(IF(Dates=C$6,ROW(Dates)),ROW(3:3))-TableRowStart,4),\"\")","v":""},null,null,{"$f":"IFERROR(INDEX(tblEvents[],SMALL(IF(Dates=F$6,ROW(Dates)),ROW(3:3))-TableRowStart,4),\"\")","v":""},null,null,{"$f":"IFERROR(INDEX(tblEvents[],SMALL(IF(Dates=I$6,ROW(Dates)),ROW(3:3))-TableRowStart,4),\"\")","v":""},null,null,{"$f":"IFERROR(INDEX(tblEvents[],SMALL(IF(Dates=L$6,ROW(Dates)),ROW(3:3))-TableRowStart,4),\"\")","v":""},null,null,{"$f":"IFERROR(INDEX(tblEvents[],SMALL(IF(Dates=O$6,ROW(Dates)),ROW(3:3))-TableRowStart,4),\"\")","v":""},null,null,{"$f":"IFERROR(INDEX(tblEvents[],SMALL(IF(Dates=R$6,ROW(Dates)),ROW(3:3))-TableRowStart,4),\"\")","v":""},null,null,{"$f":"IFERROR(INDEX(tblEvents[],SMALL(IF(Dates=U$6,ROW(Dates)),ROW(3:3))-TableRowStart,4),\"\")","v":""}]
[null,null,{"$f":"IFERROR(INDEX(tblEvents[],SMALL(IF(Dates=C$6,ROW(Dates)),ROW(#REF!))-TableRowStart,4),\"\")","v":""},null,null,{"$f":"IFERROR(INDEX(tblEvents[],SMALL(IF(Dates=F$6,ROW(Dates)),ROW(#REF!))-TableRowStart,4),\"\")","v":""},null,null,{"$f":"IFERROR(INDEX(tblEvents[],SMALL(IF(Dates=I$6,ROW(Dates)),ROW(#REF!))-TableRowStart,4),\"\")","v":""},null,null,{"$f":"IFERROR(INDEX(tblEvents[],SMALL(IF(Dates=L$6,ROW(Dates)),ROW(#REF!))-TableRowStart,4),\"\")","v":""},null,null,{"$f":"IFERROR(INDEX(tblEvents[],SMALL(IF(Dates=O$6,ROW(Dates)),ROW(#REF!))-TableRowStart,4),\"\")","v":""},null,null,{"$f":"IFERROR(INDEX(tblEvents[],SMALL(IF(Dates=R$6,ROW(Dates)),ROW(#REF!))-TableRowStart,4),\"\")","v":""},null,null,{"$f":"IFERROR(INDEX(tblEvents[],SMALL(IF(Dates=U$6,ROW(Dates)),ROW(#REF!))-TableRowStart,4),\"\")","v":""}]
[null,null,{"$f":"U6+1","v":"2016-07-03"},null,null,{"$f":"C11+1","v":"2016-07-04"},null,null,{"$f":"F11+1","v":"2016-07-05"},null,null,{"$f":"I11+1","v":"2016-07-06"},null,null,{"$f":"L11+1","v":"2016-07-07"},null,null,{"$f":"O11+1","v":"2016-07-08"},null,null,{"$f":"R11+1","v":"2016-07-09"}]
[null,null,{"$f":"IFERROR(INDEX(tblEvents[],SMALL(IF(Dates=C$11,ROW(Dates)),ROW(1:1))-TableRowStart,4),\"\")","v":"ערב סרטים בפארק"},null,null,{"$f":"IFERROR(INDEX(tblEvents[],SMALL(IF(Dates=F$11,ROW(Dates)),ROW(1:1))-TableRowStart,4),\"\")","v":""},null,null,{"$f":"IFERROR(INDEX(tblEvents[],SMALL(IF(Dates=I$11,ROW(Dates)),ROW(1:1))-TableRowStart,4),\"\")","v":""},null,null,{"$f":"IFERROR(INDEX(tblEvents[],SMALL(IF(Dates=L$11,ROW(Dates)),ROW(1:1))-TableRowStart,4),\"\")","v":""},null,null,{"$f":"IFERROR(INDEX(tblEvents[],SMALL(IF(Dates=O$11,ROW(Dates)),ROW(1:1))-TableRowStart,4),\"\")","v":""},null,null,{"$f":"IFERROR(INDEX(tblEvents[],SMALL(IF(Dates=R$11,ROW(Dates)),ROW(1:1))-TableRowStart,4),\"\")","v":"מועצת העיר"},null,null,{"$f":"IFERROR(INDEX(tblEvents[],SMALL(IF(Dates=U$11,ROW(Dates)),ROW(1:1))-TableRowStart,4),\"\")","v":""}]
[null,null,{"$f":"IFERROR(INDEX(tblEvents[],SMALL(IF(Dates=C$11,ROW(Dates)),ROW(2:2))-TableRowStart,4),\"\")","v":""},null,null,{"$f":"IFERROR(INDEX(tblEvents[],SMALL(IF(Dates=F$11,ROW(Dates)),ROW(2:2))-TableRowStart,4),\"\")","v":""},null,null,{"$f":"IFERROR(INDEX(tblEvents[],SMALL(IF(Dates=I$11,ROW(Dates)),ROW(2:2))-TableRowStart,4),\"\")","v":""},null,null,{"$f":"IFERROR(INDEX(tblEvents[],SMALL(IF(Dates=L$11,ROW(Dates)),ROW(2:2))-TableRowStart,4),\"\")","v":""},null,null,{"$f":"IFERROR(INDEX(tblEvents[],SMALL(IF(Dates=O$11,ROW(Dates)),ROW(2:2))-TableRowStart,4),\"\")","v":""},null,null,{"$f":"IFERROR(INDEX(tblEvents[],SMALL(IF(Dates=R$11,ROW(Dates)),ROW(2:2))-TableRowStart,4),\"\")","v":""},null,null,{"$f":"IFERROR(INDEX(tblEvents[],SMALL(IF(Dates=U$11,ROW(Dates)),ROW(2:2))-TableRowStart,4),\"\")","v":""}]
[null,null,{"$f":"IFERROR(INDEX(tblEvents[],SMALL(IF(Dates=C$11,ROW(Dates)),ROW(3:3))-TableRowStart,4),\"\")","v":""},null,null,{"$f":"IFERROR(INDEX(tblEvents[],SMALL(IF(Dates=F$11,ROW(Dates)),ROW(3:3))-TableRowStart,4),\"\")","v":""},null,null,{"$f":"IFERROR(INDEX(tblEvents[],SMALL(IF(Dates=I$11,ROW(Dates)),ROW(3:3))-TableRowStart,4),\"\")","v":""},null,null,{"$f":"IFERROR(INDEX(tblEvents[],SMALL(IF(Dates=L$11,ROW(Dates)),ROW(3:3))-TableRowStart,4),\"\")","v":""},null,null,{"$f":"IFERROR(INDEX(tblEvents[],SMALL(IF(Dates=O$11,ROW(Dates)),ROW(3:3))-TableRowStart,4),\"\")","v":""},null,null,{"$f":"IFERROR(INDEX(tblEvents[],SMALL(IF(Dates=R$11,ROW(Dates)),ROW(3:3))-TableRowStart,4),\"\")","v":""},null,null,{"$f":"IFERROR(INDEX(tblEvents[],SMALL(IF(Dates=U$11,ROW(Dates)),ROW(3:3))-TableRowStart,4),\"\")","v":""}]
[null,null,{"$f":"IFERROR(INDEX(tblEvents[],SMALL(IF(Dates=C$11,ROW(Dates)),ROW(#REF!))-TableRowStart,4),\"\")","v":""},null,null,{"$f":"IFERROR(INDEX(tblEvents[],SMALL(IF(Dates=F$11,ROW(Dates)),ROW(#REF!))-TableRowStart,4),\"\")","v":""},null,null,{"$f":"IFERROR(INDEX(tblEvents[],SMALL(IF(Dates=I$11,ROW(Dates)),ROW(#REF!))-TableRowStart,4),\"\")","v":""},null,null,{"$f":"IFERROR(INDEX(tblEvents[],SMALL(IF(Dates=L$11,ROW(Dates)),ROW(#REF!))-TableRowStart,4),\"\")","v":""},null,null,{"$f":"IFERROR(INDEX(tblEvents[],SMALL(IF(Dates=O$11,ROW(Dates)),ROW(#REF!))-TableRowStart,4),\"\")","v":""},null,null,{"$f":"IFERROR(INDEX(tblEvents[],SMALL(IF(Dates=R$11,ROW(Dates)),ROW(#REF!))-TableRowStart,4),\"\")","v":""},null,null,{"$f":"IFERROR(INDEX(tblEvents[],SMALL(IF(Dates=U$11,ROW(Dates)),ROW(#REF!))-TableRowStart,4),\"\")","v":""}]
[null,null,{"$f":"U11+1","v":"2016-07-10"},null,null,{"$f":"C16+1","v":"2016-07-11"},null,null,{"$f":"F16+1","v":"2016-07-12"},null,null,{"$f":"I16+1","v":"2016-07-13"},null,null,{"$f":"L16+1","v":"2016-07-14"},null,null,{"$f":"O16+1","v":"2016-07-15"},null,null,{"$f":"R16+1","v":"2016-07-16"}]
[null,null,{"$f":"IFERROR(INDEX(tblEvents[],SMALL(IF(Dates=C$16,ROW(Dates)),ROW(1:1))-TableRowStart,4),\"\")","v":""},null,null,{"$f":"IFERROR(INDEX(tblEvents[],SMALL(IF(Dates=F$16,ROW(Dates)),ROW(1:1))-TableRowStart,4),\"\")","v":"לשכת המסחר ארוחת צהריים"},null,null,{"$f":"IFERROR(INDEX(tblEvents[],SMALL(IF(Dates=I$16,ROW(Dates)),ROW(1:1))-TableRowStart,4),\"\")","v":"יריד עתיקות"},null,null,{"$f":"IFERROR(INDEX(tblEvents[],SMALL(IF(Dates=L$16,ROW(Dates)),ROW(1:1))-TableRowStart,4),\"\")","v":""},null,null,{"$f":"IFERROR(INDEX(tblEvents[],SMALL(IF(Dates=O$16,ROW(Dates)),ROW(1:1))-TableRowStart,4),\"\")","v":"סדנה קהילתית"},null,null,{"$f":"IFERROR(INDEX(tblEvents[],SMALL(IF(Dates=R$16,ROW(Dates)),ROW(1:1))-TableRowStart,4),\"\")","v":"מועצת העיר"},null,null,{"$f":"IFERROR(INDEX(tblEvents[],SMALL(IF(Dates=U$16,ROW(Dates)),ROW(1:1))-TableRowStart,4),\"\")","v":""}]
[null,null,{"$f":"IFERROR(INDEX(tblEvents[],SMALL(IF(Dates=C$16,ROW(Dates)),ROW(2:2))-TableRowStart,4),\"\")","v":""},null,null,{"$f":"IFERROR(INDEX(tblEvents[],SMALL(IF(Dates=F$16,ROW(Dates)),ROW(2:2))-TableRowStart,4),\"\")","v":""},null,null,{"$f":"IFERROR(INDEX(tblEvents[],SMALL(IF(Dates=I$16,ROW(Dates)),ROW(2:2))-TableRowStart,4),\"\")","v":""},null,null,{"$f":"IFERROR(INDEX(tblEvents[],SMALL(IF(Dates=L$16,ROW(Dates)),ROW(2:2))-TableRowStart,4),\"\")","v":""},null,null,{"$f":"IFERROR(INDEX(tblEvents[],SMALL(IF(Dates=O$16,ROW(Dates)),ROW(2:2))-TableRowStart,4),\"\")","v":""},null,null,{"$f":"IFERROR(INDEX(tblEvents[],SMALL(IF(Dates=R$16,ROW(Dates)),ROW(2:2))-TableRowStart,4),\"\")","v":""},null,null,{"$f":"IFERROR(INDEX(tblEvents[],SMALL(IF(Dates=U$16,ROW(Dates)),ROW(2:2))-TableRowStart,4),\"\")","v":""}]
[null,null,{"$f":"IFERROR(INDEX(tblEvents[],SMALL(IF(Dates=C$16,ROW(Dates)),ROW(3:3))-TableRowStart,4),\"\")","v":""},null,null,{"$f":"IFERROR(INDEX(tblEvents[],SMALL(IF(Dates=F$16,ROW(Dates)),ROW(3:3))-TableRowStart,4),\"\")","v":""},null,null,{"$f":"IFERROR(INDEX(tblEvents[],SMALL(IF(Dates=I$16,ROW(Dates)),ROW(3:3))-TableRowStart,4),\"\")","v":""},null,null,{"$f":"IFERROR(INDEX(tblEvents[],SMALL(IF(Dates=L$16,ROW(Dates)),ROW(3:3))-TableRowStart,4),\"\")","v":""},null,null,{"$f":"IFERROR(INDEX(tblEvents[],SMALL(IF(Dates=O$16,ROW(Dates)),ROW(3:3))-TableRowStart,4),\"\")","v":""},null,null,{"$f":"IFERROR(INDEX(tblEvents[],SMALL(IF(Dates=R$16,ROW(Dates)),ROW(3:3))-TableRowStart,4),\"\")","v":""},null,null,{"$f":"IFERROR(INDEX(tblEvents[],SMALL(IF(Dates=U$16,ROW(Dates)),ROW(3:3))-TableRowStart,4),\"\")","v":""}]
[null,null,{"$f":"IFERROR(INDEX(tblEvents[],SMALL(IF(Dates=C$16,ROW(Dates)),ROW(#REF!))-TableRowStart,4),\"\")","v":""},null,null,{"$f":"IFERROR(INDEX(tblEvents[],SMALL(IF(Dates=F$16,ROW(Dates)),ROW(#REF!))-TableRowStart,4),\"\")","v":""},null,null,{"$f":"IFERROR(INDEX(tblEvents[],SMALL(IF(Dates=I$16,ROW(Dates)),ROW(#REF!))-TableRowStart,4),\"\")","v":""},null,null,{"$f":"IFERROR(INDEX(tblEvents[],SMALL(IF(Dates=L$16,ROW(Dates)),ROW(#REF!))-TableRowStart,4),\"\")","v":""},null,null,{"$f":"IFERROR(INDEX(tblEvents[],SMALL(IF(Dates=O$16,ROW(Dates)),ROW(#REF!))-TableRowStart,4),\"\")","v":""},null,null,{"$f":"IFERROR(INDEX(tblEvents[],SMALL(IF(Dates=R$16,ROW(Dates)),ROW(#REF!))-TableRowStart,4),\"\")","v":""},null,null,{"$f":"IFERROR(INDEX(tblEvents[],SMALL(IF(Dates=U$16,ROW(Dates)),ROW(#REF!))-TableRowStart,4),\"\")","v":""}]
{"$rows_left_out":16}
{"sheet":"גירסה להדפסה","index":2,"n_rows":35,"n_cols":21,"rows_kept":35,"merged":[[1,5,1,11],[30,8,34,20]]}
[]
[null,null,{"$f":"ViewYear","v":2016},null,null,{"$f":"ViewMonth","v":"יולי"},{"$f":"'לוח שנה‏'!G2","v":0},{"$f":"'לוח שנה‏'!H2","v":0},{"$f":"'לוח שנה‏'!I2","v":0},{"$f":"'לוח שנה‏'!J2","v":0},{"$f":"'לוח שנה‏'!K2","v":0},{"$f":"'לוח שנה‏'!L2","v":0}]
[]
[null,null,"ראשון",null,null,"שני",null,null,"שלישי",null,null,"רביעי",null,null,"חמישי",null,null,"שישי",null,null,"שבת"]
[]
[null,null,{"$f":"'לוח שנה‏'!C6","v":"2016-06-26"},{"$f":"'לוח שנה‏'!D6","v":0},{"$f":"'לוח שנה‏'!E6","v":0},{"$f":"'לוח שנה‏'!F6","v":"2016-06-27"},{"$f":"'לוח שנה‏'!G6","v":0},{"$f":"'לוח שנה‏'!H6","v":0},{"$f":"'לוח שנה‏'!I6","v":"2016-06-28"},{"$f":"'לוח שנה‏'!J6","v":0},{"$f":"'לוח שנה‏'!K6","v":0},{"$f":"'לוח שנה‏'!L6","v":"2016-06-29"},{"$f":"'לוח שנה‏'!M6","v":0},{"$f":"'לוח שנה‏'!N6","v":0},{"$f":"'לוח שנה‏'!O6","v":"2016-06-30"},{"$f":"'לוח שנה‏'!P6","v":0},{"$f":"'לוח שנה‏'!Q6","v":0},{"$f":"'לוח שנה‏'!R6","v":"2016-07-01"},{"$f":"'לוח שנה‏'!S6","v":0},{"$f":"'לוח שנה‏'!T6","v":0},{"$f":"'לוח שנה‏'!U6","v":"2016-07-02"}]
[null,null,{"$f":"'לוח שנה‏'!C7","v":""},{"$f":"'לוח שנה‏'!D7","v":0},{"$f":"'לוח שנה‏'!E7","v":0},{"$f":"'לוח שנה‏'!F7","v":""},{"$f":"'לוח שנה‏'!G7","v":0},{"$f":"'לוח שנה‏'!H7","v":0},{"$f":"'לוח שנה‏'!I7","v":""},{"$f":"'לוח שנה‏'!J7","v":0},{"$f":"'לוח שנה‏'!K7","v":0},{"$f":"'לוח שנה‏'!L7","v":""},{"$f":"'לוח שנה‏'!M7","v":0},{"$f":"'לוח שנה‏'!N7","v":0},{"$f":"'לוח שנה‏'!O7","v":""},{"$f":"'לוח שנה‏'!P7","v":0},{"$f":"'לוח שנה‏'!Q7","v":0},{"$f":"'לוח שנה‏'!R7","v":"גינה קהילתית"},{"$f":"'לוח שנה‏'!S7","v":0},{"$f":"'לוח שנה‏'!T7","v":0},{"$f":"'לוח שנה‏'!U7","v":"גינה קהילתית"}]
[null,null,{"$f":"'לוח שנה‏'!C8","v":""},{"$f":"'לוח שנה‏'!D8","v":"00:00:00"},{"$f":"'לוח שנה‏'!E8","v":"00:00:00"},{"$f":"'לוח שנה‏'!F8","v":""},{"$f":"'לוח שנה‏'!G8","v":"00:00:00"},{"$f":"'לוח שנה‏'!H8","v":"00:00:00"},{"$f":"'לוח שנה‏'!I8","v":""},{"$f":"'לוח שנה‏'!J8","v":"00:00:00"},{"$f":"'לוח שנה‏'!K8","v":"00:00:00"},{"$f":"'לוח שנה‏'!L8","v":""},{"$f":"'לוח שנה‏'!M8","v":"00:00:00"},{"$f":"'לוח שנה‏'!N8","v":"00:00:00"},{"$f":"'לוח שנה‏'!O8","v":""},{"$f":"'לוח שנה‏'!P8","v":"00:00:00"},{"$f":"'לוח שנה‏'!Q8","v":"00:00:00"},{"$f":"'לוח שנה‏'!R8","v":"מועצת העיר"},{"$f":"'לוח שנה‏'!S8","v":"00:00:00"},{"$f":"'לוח שנה‏'!T8","v":"00:00:00"},{"$f":"'לוח שנה‏'!U8","v":""}]
[null,null,{"$f":"'לוח שנה‏'!C9","v":""},{"$f":"'לוח שנה‏'!D9","v":0},{"$f":"'לוח שנה‏'!E9","v":0},{"$f":"'לוח שנה‏'!F9","v":""},{"$f":"'לוח שנה‏'!G9","v":0},{"$f":"'לוח שנה‏'!H9","v":0},{"$f":"'לוח שנה‏'!I9","v":""},{"$f":"'לוח שנה‏'!J9","v":0},{"$f":"'לוח שנה‏'!K9","v":0},{"$f":"'לוח שנה‏'!L9","v":""},{"$f":"'לוח שנה‏'!M9","v":0},{"$f":"'לוח שנה‏'!N9","v":0},{"$f":"'לוח שנה‏'!O9","v":""},{"$f":"'לוח שנה‏'!P9","v":0},{"$f":"'לוח שנה‏'!Q9","v":0},{"$f":"'לוח שנה‏'!R9","v":""},{"$f":"'לוח שנה‏'!S9","v":0},{"$f":"'לוח שנה‏'!T9","v":0},{"$f":"'לוח שנה‏'!U9","v":""}]
[null,null,{"$f":"'לוח שנה‏'!C10","v":""},{"$f":"'לוח שנה‏'!D10","v":0},{"$f":"'לוח שנה‏'!E10","v":0},{"$f":"'לוח שנה‏'!F10","v":""},{"$f":"'לוח שנה‏'!G10","v":0},{"$f":"'לוח שנה‏'!H10","v":0},{"$f":"'לוח שנה‏'!I10","v":""},{"$f":"'לוח שנה‏'!J10","v":0},{"$f":"'לוח שנה‏'!K10","v":0},{"$f":"'לוח שנה‏'!L10","v":""},{"$f":"'לוח שנה‏'!M10","v":0},{"$f":"'לוח שנה‏'!N10","v":0},{"$f":"'לוח שנה‏'!O10","v":""},{"$f":"'לוח שנה‏'!P10","v":0},{"$f":"'לוח שנה‏'!Q10","v":0},{"$f":"'לוח שנה‏'!R10","v":""},{"$f":"'לוח שנה‏'!S10","v":0},{"$f":"'לוח שנה‏'!T10","v":0},{"$f":"'לוח שנה‏'!U10","v":""}]
[null,null,{"$f":"'לוח שנה‏'!C11","v":"2016-07-03"},{"$f":"'לוח שנה‏'!D11","v":0},{"$f":"'לוח שנה‏'!E11","v":0},{"$f":"'לוח שנה‏'!F11","v":"2016-07-04"},{"$f":"'לוח שנה‏'!G11","v":0},{"$f":"'לוח שנה‏'!H11","v":0},{"$f":"'לוח שנה‏'!I11","v":"2016-07-05"},{"$f":"'לוח שנה‏'!J11","v":0},{"$f":"'לוח שנה‏'!K11","v":0},{"$f":"'לוח שנה‏'!L11","v":"2016-07-06"},{"$f":"'לוח שנה‏'!M11","v":0},{"$f":"'לוח שנה‏'!N11","v":0},{"$f":"'לוח שנה‏'!O11","v":"2016-07-07"},{"$f":"'לוח שנה‏'!P11","v":0},{"$f":"'לוח שנה‏'!Q11","v":0},{"$f":"'לוח שנה‏'!R11","v":"2016-07-08"},{"$f":"'לוח שנה‏'!S11","v":0},{"$f":"'לוח שנה‏'!T11","v":0},{"$f":"'לוח שנה‏'!U11","v":"2016-07-09"}]
[null,null,{"$f":"'לוח שנה‏'!C12","v":"ערב סרטים בפארק"},{"$f":"'לוח שנה‏'!D12","v":0},{"$f":"'לוח שנה‏'!E12","v":0},{"$f":"'לוח שנה‏'!F12","v":""},{"$f":"'לוח שנה‏'!G12","v":0},{"$f":"'לוח שנה‏'!H12","v":0},{"$f":"'לוח שנה‏'!I12","v":""},{"$f":"'לוח שנה‏'!J12","v":0},{"$f":"'לוח שנה‏'!K12","v":0},{"$f":"'לוח שנה‏'!L12","v":""},{"$f":"'לוח שנה‏'!M12","v":0},{"$f":"'לוח שנה‏'!N12","v":0},{"$f":"'לוח שנה‏'!O12","v":""},{"$f":"'לוח שנה‏'!P12","v":0},{"$f":"'לוח שנה‏'!Q12","v":0},{"$f":"'לוח שנה‏'!R12","v":"מועצת העיר"},{"$f":"'לוח שנה‏'!S12","v":0},{"$f":"'לוח שנה‏'!T12","v":0},{"$f":"'לוח שנה‏'!U12","v":""}]
[null,null,{"$f":"'לוח שנה‏'!C13","v":""},{"$f":"'לוח שנה‏'!D13","v":0},{"$f":"'לוח שנה‏'!E13","v":0},{"$f":"'לוח שנה‏'!F13","v":""},{"$f":"'לוח שנה‏'!G13","v":0},{"$f":"'לוח שנה‏'!H13","v":0},{"$f":"'לוח שנה‏'!I13","v":""},{"$f":"'לוח שנה‏'!J13","v":0},{"$f":"'לוח שנה‏'!K13","v":0},{"$f":"'לוח שנה‏'!L13","v":""},{"$f":"'לוח שנה‏'!M13","v":0},{"$f":"'לוח שנה‏'!N13","v":0},{"$f":"'לוח שנה‏'!O13","v":""},{"$f":"'לוח שנה‏'!P13","v":0},{"$f":"'לוח שנה‏'!Q13","v":0},{"$f":"'לוח שנה‏'!R13","v":""},{"$f":"'לוח שנה‏'!S13","v":0},{"$f":"'לוח שנה‏'!T13","v":0},{"$f":"'לוח שנה‏'!U13","v":""}]
[null,null,{"$f":"'לוח שנה‏'!C14","v":""},{"$f":"'לוח שנה‏'!D14","v":0},{"$f":"'לוח שנה‏'!E14","v":0},{"$f":"'לוח שנה‏'!F14","v":""},{"$f":"'לוח שנה‏'!G14","v":0},{"$f":"'לוח שנה‏'!H14","v":0},{"$f":"'לוח שנה‏'!I14","v":""},{"$f":"'לוח שנה‏'!J14","v":0},{"$f":"'לוח שנה‏'!K14","v":0},{"$f":"'לוח שנה‏'!L14","v":""},{"$f":"'לוח שנה‏'!M14","v":0},{"$f":"'לוח שנה‏'!N14","v":0},{"$f":"'לוח שנה‏'!O14","v":""},{"$f":"'לוח שנה‏'!P14","v":0},{"$f":"'לוח שנה‏'!Q14","v":0},{"$f":"'לוח שנה‏'!R14","v":""},{"$f":"'לוח שנה‏'!S14","v":0},{"$f":"'לוח שנה‏'!T14","v":0},{"$f":"'לוח שנה‏'!U14","v":""}]
[null,null,{"$f":"'לוח שנה‏'!C15","v":""},{"$f":"'לוח שנה‏'!D15","v":0},{"$f":"'לוח שנה‏'!E15","v":0},{"$f":"'לוח שנה‏'!F15","v":""},{"$f":"'לוח שנה‏'!G15","v":0},{"$f":"'לוח שנה‏'!H15","v":0},{"$f":"'לוח שנה‏'!I15","v":""},{"$f":"'לוח שנה‏'!J15","v":0},{"$f":"'לוח שנה‏'!K15","v":0},{"$f":"'לוח שנה‏'!L15","v":""},{"$f":"'לוח שנה‏'!M15","v":0},{"$f":"'לוח שנה‏'!N15","v":0},{"$f":"'לוח שנה‏'!O15","v":""},{"$f":"'לוח שנה‏'!P15","v":0},{"$f":"'לוח שנה‏'!Q15","v":0},{"$f":"'לוח שנה‏'!R15","v":""},{"$f":"'לוח שנה‏'!S15","v":0},{"$f":"'לוח שנה‏'!T15","v":0},{"$f":"'לוח שנה‏'!U15","v":""}]
[null,null,{"$f":"'לוח שנה‏'!C16","v":"2016-07-10"},{"$f":"'לוח שנה‏'!D16","v":0},{"$f":"'לוח שנה‏'!E16","v":0},{"$f":"'לוח שנה‏'!F16","v":"2016-07-11"},{"$f":"'לוח שנה‏'!G16","v":0},{"$f":"'לוח שנה‏'!H16","v":0},{"$f":"'לוח שנה‏'!I16","v":"2016-07-12"},{"$f":"'לוח שנה‏'!J16","v":0},{"$f":"'לוח שנה‏'!K16","v":0},{"$f":"'לוח שנה‏'!L16","v":"2016-07-13"},{"$f":"'לוח שנה‏'!M16","v":0},{"$f":"'לוח שנה‏'!N16","v":0},{"$f":"'לוח שנה‏'!O16","v":"2016-07-14"},{"$f":"'לוח שנה‏'!P16","v":0},{"$f":"'לוח שנה‏'!Q16","v":0},{"$f":"'לוח שנה‏'!R16","v":"2016-07-15"},{"$f":"'לוח שנה‏'!S16","v":0},{"$f":"'לוח שנה‏'!T16","v":0},{"$f":"'לוח שנה‏'!U16","v":"2016-07-16"}]
[null,null,{"$f":"'לוח שנה‏'!C17","v":""},{"$f":"'לוח שנה‏'!D17","v":0},{"$f":"'לוח שנה‏'!E17","v":0},{"$f":"'לוח שנה‏'!F17","v":"לשכת המסחר ארוחת צהריים"},{"$f":"'לוח שנה‏'!G17","v":0},{"$f":"'לוח שנה‏'!H17","v":0},{"$f":"'לוח שנה‏'!I17","v":"יריד עתיקות"},{"$f":"'לוח שנה‏'!J17","v":0},{"$f":"'לוח שנה‏'!K17","v":0},{"$f":"'לוח שנה‏'!L17","v":""},{"$f":"'לוח שנה‏'!M17","v":0},{"$f":"'לוח שנה‏'!N17","v":0},{"$f":"'לוח שנה‏'!O17","v":"סדנה קהילתית"},{"$f":"'לוח שנה‏'!P17","v":0},{"$f":"'לוח שנה‏'!Q17","v":0},{"$f":"'לוח שנה‏'!R17","v":"מועצת העיר"},{"$f":"'לוח שנה‏'!S17","v":0},{"$f":"'לוח שנה‏'!T17","v":0},{"$f":"'לוח שנה‏'!U17","v":""}]
[null,null,{"$f":"'לוח שנה‏'!C18","v":""},{"$f":"'לוח שנה‏'!D18","v":0},{"$f":"'לוח שנה‏'!E18","v":0},{"$f":"'לוח שנה‏'!F18","v":""},{"$f":"'לוח שנה‏'!G18","v":0},{"$f":"'לוח שנה‏'!H18","v":0},{"$f":"'לוח שנה‏'!I18","v":""},{"$f":"'לוח שנה‏'!J18","v":0},{"$f":"'לוח שנה‏'!K18","v":0},{"$f":"'לוח שנה‏'!L18","v":""},{"$f":"'לוח שנה‏'!M18","v":0},{"$f":"'לוח שנה‏'!N18","v":0},{"$f":"'לוח שנה‏'!O18","v":""},{"$f":"'לוח שנה‏'!P18","v":0},{"$f":"'לוח שנה‏'!Q18","v":0},{"$f":"'לוח שנה‏'!R18","v":""},{"$f":"'לוח שנה‏'!S18","v":0},{"$f":"'לוח שנה‏'!T18","v":0},{"$f":"'לוח שנה‏'!U18","v":""}]
[null,null,{"$f":"'לוח שנה‏'!C19","v":""},{"$f":"'לוח שנה‏'!D19","v":0},{"$f":"'לוח שנה‏'!E19","v":0},{"$f":"'לוח שנה‏'!F19","v":""},{"$f":"'לוח שנה‏'!G19","v":0},{"$f":"'לוח שנה‏'!H19","v":0},{"$f":"'לוח שנה‏'!I19","v":""},{"$f":"'לוח שנה‏'!J19","v":0},{"$f":"'לוח שנה‏'!K19","v":0},{"$f":"'לוח שנה‏'!L19","v":""},{"$f":"'לוח שנה‏'!M19","v":0},{"$f":"'לוח שנה‏'!N19","v":0},{"$f":"'לוח שנה‏'!O19","v":""},{"$f":"'לוח שנה‏'!P19","v":0},{"$f":"'לוח שנה‏'!Q19","v":0},{"$f":"'לוח שנה‏'!R19","v":""},{"$f":"'לוח שנה‏'!S19","v":0},{"$f":"'לוח שנה‏'!T19","v":0},{"$f":"'לוח שנה‏'!U19","v":""}]
[null,null,{"$f":"'לוח שנה‏'!C20","v":""},{"$f":"'לוח שנה‏'!D20","v":0},{"$f":"'לוח שנה‏'!E20","v":0},{"$f":"'לוח שנה‏'!F20","v":""},{"$f":"'לוח שנה‏'!G20","v":0},{"$f":"'לוח שנה‏'!H20","v":0},{"$f":"'לוח שנה‏'!I20","v":""},{"$f":"'לוח שנה‏'!J20","v":0},{"$f":"'לוח שנה‏'!K20","v":0},{"$f":"'לוח שנה‏'!L20","v":""},{"$f":"'לוח שנה‏'!M20","v":0},{"$f":"'לוח שנה‏'!N20","v":0},{"$f":"'לוח שנה‏'!O20","v":""},{"$f":"'לוח שנה‏'!P20","v":0},{"$f":"'לוח שנה‏'!Q20","v":0},{"$f":"'לוח שנה‏'!R20","v":""},{"$f":"'לוח שנה‏'!S20","v":0},{"$f":"'לוח שנה‏'!T20","v":0},{"$f":"'לוח שנה‏'!U20","v":""}]
{"$rows_left_out":16}
{"sheet":"ניהול","index":3,"n_rows":14,"n_cols":3,"rows_kept":14,"hidden":true}
[]
[null,"חודש","מספר"]
[null,"ינואר",1]
[null,"פברואר",2]
[null,"מרץ",3]
[null,"אפריל",4]
[null,"מאי",5]
[null,"יוני",6]
[null,"יולי",7]
[null,"אוגוסט",8]
[null,"ספטמבר",9]
[null,"אוקטובר",10]
[null,"נובמבר",11]
[null,"דצמבר",12]