{"text_format":"1","workbook":"xlsx","n_sheets":7,"sheets":["Accueil","Mes pronostics","Les résultats","BDD","Paramètres","Statistiques générales","Comparatif"],"not_rendered":{"charts":5,"images":32,"macros":1,"external_links":0,"defined_names":15,"comments":0,"pivot_tables":0},"unopened":[],"bounds":{"document_bytes":16777216,"sheet_cells":100000,"rows_first":2000,"rows_last":500,"rows_between":2000,"halvings":0,"cell_chars":16384,"cell_head_chars":4096},"cells_cut":0,"cells_raw":0,"read":"whole","date_system":"1900"}

{"sheet":"Accueil","index":0,"n_rows":12,"n_cols":13,"rows_kept":12,"cut":false,"hidden":false,"merged":[[3,12,5,12],[2,0,4,2]]}
[]
[null,null,null,null,null,"Pour que le fichier fonctionne correctement, n'oubliez d'activer les macros !",null,null,null,null,null,null,"Menu utilisateur"]
["o   Vous n’avez pas Excel 2016 ? Avec Office 365, profitez de la toute dernière version d’Excel mais aussi de Word, PowerPoint ou encore Outlook ainsi que de 1To de stockage en ligne pour partager vos pronostics avec tous vos proches.",null,null,null,null,"1er Etape"]
[null,null,null,null,null,"Enregistrez vous, vous et vos amis en cliquant sur le bouton juste ici",null,null,null,null,null,null,"NB: Vous pouvez accéder au menu en appuyant simultanément sur Ctrl + D"]
[]
[]
[null,"Acheter Office 365 !",null,null,null,"2ème Etape"]
[null,null,null,null,null,"Rentrez vos pronostics et ceux de vos amis via l'onglet \"Mes pronostics\""]
[]
[]
[null,"Essayer Office 365 !",null,null,null,"3ème Etape"]
[null,null,null,null,null,"Comparer vos pronostics avec ceux de vos amis, via l'onglet \"Comparatif\" !"]

{"sheet":"Mes pronostics","index":1,"n_rows":58,"n_cols":34,"rows_kept":58,"cut":false,"hidden":true,"merged":[[3,11,3,12],[3,13,3,17]]}
[]
[null,null,null,null,null,null,"Phase de poule"]
[null,null,null,null,null,null,"Phase finale"]
[null,null,null,null,null,null,null,null,null,null,null,"Me trouver:",null,null,null,null,null,null,null,null,null,null,"Enregistrer"]
[]
[]
[]
[null,null,null,{"$f":" \"PHASE DE POULE - PRONOSTICS \" & \" - \" &  N4","v":"PHASE DE POULE - PRONOSTICS  - "}]
[]
[null,null,null,null,"Date","Heure","Equipe 1",null,"Score Equipe 1","Score Equipe 2",null,"Equipe 2"]
[null,null,null,null,"Groupe A",null,null,null,null,null,null,null,null,"Groupe A","Pts","BP","BC","+/-",null,null,"Groupe B",null,null,null,null,null,null,null,null,"Groupe B","Pts","BP","BC","+/-"]
[null,null,null,"M-1","2016-06-10","21:00:00","France",null,0,0,null,"Roumanie",null,"Suisse",3,0,0,0,null,"M-3","2016-06-11","18:00:00","Galles",null,0,0,null,"Slovaquie",null,"Galles",3,0,0,0]
[null,null,null,"M-2","2016-06-11","15:00:00","Albanie",null,0,0,null,"Suisse",null,"Albanie",3,0,0,0,null,"M-4","2016-06-11","21:00:00","Angleterre",null,0,0,null,"Russie",null,"Russie",3,0,0,0]
[null,null,null,"M-14","2016-06-15","18:00:00","Roumanie",null,0,0,null,"Suisse",null,"France",3,0,0,0,null,"M-13","2016-06-15","15:00:00","Russie",null,0,0,null,"Slovaquie",null,"Angleterre",3,0,0,0]
[null,null,null,"M-15","2016-06-15","21:00:00","France",null,0,0,null,"Albanie",null,"Roumanie",3,0,0,0,null,"M-16","2016-06-16","15:00:00","Angleterre",null,0,0,null,"Galles",null,"Slovaquie",3,0,0,0]
[null,null,null,"M-25","2016-06-19","21:00:00","Roumanie",null,0,0,null,"Albanie",null,null,null,null,null,null,null,"M-27","2016-06-20","21:00:00","Russie",null,0,0,null,"Galles"]
[null,null,null,"M-26","2016-06-19","21:00:00","Suisse",null,0,0,null,"France",null,null,null,null,null,null,null,"M-28","2016-06-20","21:00:00","Slovaquie",null,0,0,null,"Angleterre"]
[]
[]
[null,null,null,null,"Groupe C",null,null,null,null,null,null,null,null,"Groupe C","Pts","BP","BC","+/-",null,null,"Groupe D",null,null,null,null,null,null,null,null,"Groupe D","Pts","BP","BC","+/-"]
{"$rows_left_out":39}
{"sheet":"Les résultats","index":2,"n_rows":61,"n_cols":34,"rows_kept":61,"cut":false,"hidden":true,"merged":[]}
[]
[null,null,null,null,null,null,"Phase de poule"]
[null,null,null,null,null,null,"Phase finale"]
[null,null,null,null,null,null,null,null,null,null,null,null,null,null,null,null,null,null,null,null,null,null,"Enregistrer"]
[]
[]
[]
[null,null,null,{"$f":" \"PHASE DE POULE - RESULTATS \"","v":"PHASE DE POULE - RESULTATS "}]
[]
[null,null,null,null,"Date","Heure","Equipe 1",null,"Score Equipe 1","Score Equipe 2",null,"Equipe 2"]
[null,null,null,null,"Groupe A",null,null,null,null,null,null,null,null,"Groupe A","Pts","BP","BC","+/-",null,null,"Groupe B",null,null,null,null,null,null,null,null,"Groupe B","Pts","BP","BC","+/-"]
[null,null,null,"M-1","2016-06-10","21:00:00","France",null,null,null,null,"Roumanie",null,"Suisse",3,0,0,0,null,"M-3","2016-06-11","18:00:00","Galles",null,null,null,null,"Slovaquie",null,"Galles",3,0,0,0]
[null,null,null,"M-2","2016-06-11","15:00:00","Albanie",null,null,null,null,"Suisse",null,"Albanie",3,0,0,0,null,"M-4","2016-06-11","21:00:00","Angleterre",null,null,null,null,"Russie",null,"Russie",3,0,0,0]
[null,null,null,"M-14","2016-06-15","18:00:00","Roumanie",null,null,null,null,"Suisse",null,"France",3,0,0,0,null,"M-13","2016-06-15","15:00:00","Russie",null,null,null,null,"Slovaquie",null,"Angleterre",3,0,0,0]
[null,null,null,"M-15","2016-06-15","21:00:00","France",null,null,null,null,"Albanie",null,"Roumanie",3,0,0,0,null,"M-16","2016-06-16","15:00:00","Angleterre",null,null,null,null,"Galles",null,"Slovaquie",3,0,0,0]
[null,null,null,"M-25","2016-06-19","21:00:00","Roumanie",null,null,null,null,"Albanie",null,null,null,null,null,null,null,"M-27","2016-06-20","21:00:00","Russie",null,null,null,null,"Galles"]
[null,null,null,"M-26","2016-06-19","21:00:00","Suisse",null,null,null,null,"France",null,null,null,null,null,null,null,"M-28","2016-06-20","21:00:00","Slovaquie",null,null,null,null,"Angleterre"]
[]
[]
[null,null,null,null,"Groupe C",null,null,null,null,null,null,null,null,"Groupe C","Pts","BP","BC","+/-",null,null,"Groupe D",null,null,null,null,null,null,null,null,"Groupe D","Pts","BP","BC","+/-"]
{"$rows_left_out":42}
{"sheet":"BDD","index":3,"n_rows":2,"n_cols":54,"rows_kept":2,"cut":false,"hidden":true,"merged":[]}
[null,null,null,"Groupe A    France - Roumanie\n   10/06/16","Groupe A    Albanie - Suisse\n   11/06/16","Groupe B    Galles - Slovaquie\n   11/06/16","Groupe B    Angleterre - Russie\n   11/06/16","Groupe D    Turquie - Croatie\n   12/06/16","Groupe C    Pologne - Irlande du Nord\n   12/06/16","Groupe C    Allemagne - Ukraine\n   12/06/16","Groupe D    Espagne - Rep. Tchèque\n   13/06/16","Groupe E    Irlande - Suède\n   13/06/16","Groupe E    Belgique - Italie\n   13/06/16","Groupe F    Autriche - Hongrie\n   14/06/16","Groupe F    Portugal - Islande\n   14/06/16","Groupe B    Russie - Slovaquie\n   15/06/16","Groupe A    Roumanie - Suisse\n   15/06/16","Groupe A    France - Albanie\n   15/06/16","Groupe B    Angleterre - Galles\n   16/06/16","Groupe C    Ukraine - Irlande du Nord\n   16/06/16","Groupe C    Allemagne - Pologne\n   16/06/16","Groupe E    Italie - Suède\n   17/06/16","Groupe D    Rep. Tchèque - Croatie\n   17/06/16","Groupe D    Espagne - Turquie\n   17/06/16","Groupe E    Belgique - Irlande\n   18/06/16","Groupe F    Islande - Hongrie\n   18/06/16","Groupe F    Portugal - Autriche\n   18/06/16","Groupe A    Roumanie - Albanie\n   19/06/16","Groupe A    Suisse - France\n   19/06/16","Groupe B    Russie - Galles\n   20/06/16","Groupe B    Slovaquie - Angleterre\n   20/06/16","Groupe C    Ukraine - Pologne\n   21/06/16","Groupe C    Irlande du Nord - Allemagne\n   21/06/16","Groupe D    Rep. Tchèque - Turquie\n   21/06/16","Groupe D    Croatie - Espagne\n   21/06/16","Groupe F    Islande - Autriche\n   22/06/16","Groupe F    Hongrie - Portugal\n   22/06/16","Groupe E    Italie - Irlande\n   22/06/16","Groupe E    Suède - Belgique\n   22/06/16","Phase Finale - 8ème     - \n   25/06/16","Phase Finale - 8ème     - \n   25/06/16","Phase Finale - 8ème     - \n   25/06/16","Phase Finale - 8ème     - \n   26/06/16","Phase Finale - 8ème     - \n   26/06/16","Phase Finale - 8ème     - \n   26/06/16","Phase Finale - 8ème     - \n   27/06/16","Phase Finale - 8ème     - \n   27/06/16","Phase Finale - Quart     - \n   30/06/16","Phase Finale - Quart     - \n   01/07/16","Phase Finale - Quart     - \n   02/07/16","Phase Finale - Quart     - \n   03/07/16","Phase Finale - Demi-finales     - \n   06/07/16","Phase Finale - Demi-finales     - \n   07/07/16","Phase Finale - Finale     - \n   10/07/16"]
["IdPerson","Nom utilisateur","Clé","M-1","M-2","M-3","M-4","M-5","M-6","M-7","M-8","M-9","M-10","M-11","M-12","M-13","M-14","M-15","M-16","M-17","M-18","M-19","M-20","M-21","M-22","M-23","M-24","M-25","M-26","M-27","M-28","M-29","M-30","M-31","M-32","M-33","M-34","M-35","M-36","M-37","M-38","M-39","M-40","M-41","M-42","M-43","M-44","M-45","M-46","M-47","M-48","M-49","M-50","M-51"]

{"sheet":"Paramètres","index":4,"n_rows":52,"n_cols":29,"rows_kept":52,"cut":false,"hidden":true,"merged":[]}
["Groupe A","Groupe B","Groupe C","Groupe D","Groupe E","Groupe F",null,null,"IdMatch","Tag","Date","Heure","Equipe 1","Equipe 2","Score Equipe 1","Score Equipe 2","Penalty Equipe 1","Penalty Equipe 2","Tag",null,null,"IdPays","Pays","Photo"]
["Suisse","Galles","Allemagne","Turquie","Italie","Islande",null,null,"M-1","Groupe A","2016-06-10","21:00:00","France","Roumanie",null,null,null,null,"Groupe A    France - Roumanie\n   10/06/16",{"$f":"ABS(O2-P2)","v":0},null,"P-1","Suisse",null,{"$f":"SUMPRODUCT($O$2:$O$51*($M$2:$M$51=W2))+SUMPRODUCT($P$2:$P$51*($N$2:$N$51=W2))","v":0},{"$f":"3*SUMPRODUCT(1*($M$2:$M$52=W2)*($O$2:$O$52>$P$2:$P$52))+3*SUMPRODUCT(1*($N$2:$N$52=W2)*($P$2:$P$52>$O$2:$O$52))","v":0},{"$f":"SUMPRODUCT($O$2:$O$52*($M$2:$M$52=W2))-SUMPRODUCT($P$2:$P$52*($M$2:$M$52=W2))+SUMPRODUCT($P$2:$P$52*($N$2:$N$52=W2))-SUMPRODUCT($O$2:$O$52*($N$2:$N$52=W2))","v":0},{"$f":"IF(O52>P52,M52,N52)","v":0},{"$f":"IFERROR(MATCH(AB2,$W$1:$W$25,0),1)","v":1}]
["Albanie","Russie","Irlande du Nord","Espagne","Suède","Autriche",null,null,"M-2","Groupe A","2016-06-11","15:00:00","Albanie","Suisse",null,null,null,null,"Groupe A    Albanie - Suisse\n   11/06/16",{"$f":"ABS(O3-P3)","v":0},null,"P-2","Albanie",null,{"$f":"SUMPRODUCT($O$2:$O$51*($M$2:$M$51=W3))+SUMPRODUCT($P$2:$P$51*($N$2:$N$51=W3))","v":0},{"$f":"3*SUMPRODUCT(1*($M$2:$M$52=W3)*($O$2:$O$52>$P$2:$P$52))+3*SUMPRODUCT(1*($N$2:$N$52=W3)*($P$2:$P$52>$O$2:$O$52))","v":0},{"$f":"SUMPRODUCT($O$2:$O$52*($M$2:$M$52=W3))-SUMPRODUCT($P$2:$P$52*($M$2:$M$52=W3))+SUMPRODUCT($P$2:$P$52*($N$2:$N$52=W3))-SUMPRODUCT($O$2:$O$52*($N$2:$N$52=W3))","v":0},{"$f":"IF(O52>P52,N52,M52)","v":0},{"$f":"IFERROR(MATCH(AB3,$W$1:$W$25,0),1)","v":1}]
["France","Angleterre","Ukraine","Croatie","Irlande","Portugal",null,null,"M-3","Groupe B","2016-06-11","18:00:00","Galles","Slovaquie",null,null,null,null,"Groupe B    Galles - Slovaquie\n   11/06/16",0,null,"P-3","France",null,0,0,0,{"$f":"IF(O51>P51,N51,M51)","v":0},1]
["Roumanie","Slovaquie","Pologne","Rep. Tchèque","Belgique","Hongrie",null,null,"M-4","Groupe B","2016-06-11","21:00:00","Angleterre","Russie",null,null,null,null,"Groupe B    Angleterre - Russie\n   11/06/16",0,null,"P-4","Roumanie",null,0,0,0,{"$f":"IF(O50>P50,N50,M50)","v":0},1]
[null,null,null,null,null,null,null,null,"M-5","Groupe D","2016-06-12","15:00:00","Turquie","Croatie",null,null,null,null,"Groupe D    Turquie - Croatie\n   12/06/16",0,null,"P-5","Galles",null,0,0,0]
[null,null,null,null,null,null,null,null,"M-6","Groupe C","2016-06-12","18:00:00","Pologne","Irlande du Nord",null,null,null,null,"Groupe C    Pologne - Irlande du Nord\n   12/06/16",0,null,"P-6","Russie",null,0,0,0]
[null,null,null,null,null,null,null,null,"M-7","Groupe C","2016-06-12","21:00:00","Allemagne","Ukraine",null,null,null,null,"Groupe C    Allemagne - Ukraine\n   12/06/16",0,null,"P-7","Angleterre",null,0,0,0]
[null,null,null,null,null,null,null,null,"M-8","Groupe D","2016-06-13","15:00:00","Espagne","Rep. Tchèque",null,null,null,null,"Groupe D    Espagne - Rep. Tchèque\n   13/06/16",0,null,"P-8","Slovaquie",null,0,0,0]
[null,null,null,null,null,null,null,null,"M-9","Groupe E","2016-06-13","18:00:00","Irlande","Suède",null,null,null,null,"Groupe E    Irlande - Suède\n   13/06/16",0,null,"P-9","Allemagne",null,0,0,0]
[null,null,null,null,null,null,null,null,"M-10","Groupe E","2016-06-13","21:00:00","Belgique","Italie",null,null,null,null,"Groupe E    Belgique - Italie\n   13/06/16",0,null,"P-10","Irlande du Nord",null,0,0,0]
[null,null,null,null,null,null,null,null,"M-11","Groupe F","2016-06-14","18:00:00","Autriche","Hongrie",null,null,null,null,"Groupe F    Autriche - Hongrie\n   14/06/16",0,null,"P-11","Ukraine",null,0,0,0]
[null,null,null,null,null,null,null,null,"M-12","Groupe F","2016-06-14","21:00:00","Portugal","Islande",null,null,null,null,"Groupe F    Portugal - Islande\n   14/06/16",0,null,"P-12","Pologne",null,0,0,0]
[null,null,null,null,null,null,null,null,"M-13","Groupe B","2016-06-15","15:00:00","Russie","Slovaquie",null,null,null,null,"Groupe B    Russie - Slovaquie\n   15/06/16",0,null,"P-13","Turquie",null,0,0,0]
[null,null,null,null,null,null,null,null,"M-14","Groupe A","2016-06-15","18:00:00","Roumanie","Suisse",null,null,null,null,"Groupe A    Roumanie - Suisse\n   15/06/16",0,null,"P-14","Espagne",null,0,0,0]
[null,null,null,null,null,null,null,null,"M-15","Groupe A","2016-06-15","21:00:00","France","Albanie",null,null,null,null,"Groupe A    France - Albanie\n   15/06/16",0,null,"P-15","Croatie",null,0,0,0]
[null,null,null,null,null,null,null,null,"M-16","Groupe B","2016-06-16","15:00:00","Angleterre","Galles",null,null,null,null,"Groupe B    Angleterre - Galles\n   16/06/16",0,null,"P-16","Rep. Tchèque",null,0,0,0]
[null,null,null,null,null,null,null,null,"M-17","Groupe C","2016-06-16","18:00:00","Ukraine","Irlande du Nord",null,null,null,null,"Groupe C    Ukraine - Irlande du Nord\n   16/06/16",0,null,"P-17","Italie",null,0,0,0]
[null,null,null,null,null,null,null,null,"M-18","Groupe C","2016-06-16","21:00:00","Allemagne","Pologne",null,null,null,null,"Groupe C    Allemagne - Pologne\n   16/06/16",0,null,"P-18","Suède",null,0,0,0]
[null,null,null,null,null,null,null,null,"M-19","Groupe E","2016-06-17","15:00:00","Italie","Suède",null,null,null,null,"Groupe E    Italie - Suède\n   17/06/16",0,null,"P-19","Irlande",null,0,0,0]
{"$rows_left_out":33}
{"sheet":"Statistiques générales","index":5,"n_rows":64,"n_cols":6,"rows_kept":64,"cut":false,"hidden":true,"merged":[[1,2,1,11],[7,2,7,3],[55,3,55,4],[63,2,63,5]]}
[]
[null,null,"STATISTIQUES DU CHAMPIONNAT"]
[]
[]
[]
[]
[]
[null,null,"Top 10 Pays par Buts"]
[null,null,{"$f":"INDEX(Paramètres!$W$2:$W$25,MATCH(LARGE(Paramètres!$Y$2:$Y$25-ROW(Paramètres!$W$2:$W$25)/10^10,\nROW(A1)),Paramètres!$Y$2:$Y$25-ROW(Paramètres!$Y$2:$Y$25)/10^10,0))","v":"Suisse"},{"$f":"INDEX(Paramètres!$W$2:$Y$25,MATCH(LARGE(Paramètres!$Y$2:$Y$25-ROW(Paramètres!$W$2:$W$25)/10^10,\nROW(B1)),Paramètres!$Y$2:$Y$25-ROW(Paramètres!$Y$2:$Y$25)/10^10,0),3)","v":0}]
[null,null,{"$f":"INDEX(Paramètres!$W$2:$W$25,MATCH(LARGE(Paramètres!$Y$2:$Y$25-ROW(Paramètres!$W$2:$W$25)/10^10,\nROW(A2)),Paramètres!$Y$2:$Y$25-ROW(Paramètres!$Y$2:$Y$25)/10^10,0))","v":"Albanie"},{"$f":"INDEX(Paramètres!$W$2:$Y$25,MATCH(LARGE(Paramètres!$Y$2:$Y$25-ROW(Paramètres!$W$2:$W$25)/10^10,\nROW(B2)),Paramètres!$Y$2:$Y$25-ROW(Paramètres!$Y$2:$Y$25)/10^10,0),3)","v":0}]
[null,null,{"$f":"INDEX(Paramètres!$W$2:$W$25,MATCH(LARGE(Paramètres!$Y$2:$Y$25-ROW(Paramètres!$W$2:$W$25)/10^10,\nROW(A3)),Paramètres!$Y$2:$Y$25-ROW(Paramètres!$Y$2:$Y$25)/10^10,0))","v":"France"},{"$f":"INDEX(Paramètres!$W$2:$Y$25,MATCH(LARGE(Paramètres!$Y$2:$Y$25-ROW(Paramètres!$W$2:$W$25)/10^10,\nROW(B3)),Paramètres!$Y$2:$Y$25-ROW(Paramètres!$Y$2:$Y$25)/10^10,0),3)","v":0}]
[null,null,{"$f":"INDEX(Paramètres!$W$2:$W$25,MATCH(LARGE(Paramètres!$Y$2:$Y$25-ROW(Paramètres!$W$2:$W$25)/10^10,\nROW(A4)),Paramètres!$Y$2:$Y$25-ROW(Paramètres!$Y$2:$Y$25)/10^10,0))","v":"Roumanie"},{"$f":"INDEX(Paramètres!$W$2:$Y$25,MATCH(LARGE(Paramètres!$Y$2:$Y$25-ROW(Paramètres!$W$2:$W$25)/10^10,\nROW(B4)),Paramètres!$Y$2:$Y$25-ROW(Paramètres!$Y$2:$Y$25)/10^10,0),3)","v":0}]
[null,null,{"$f":"INDEX(Paramètres!$W$2:$W$25,MATCH(LARGE(Paramètres!$Y$2:$Y$25-ROW(Paramètres!$W$2:$W$25)/10^10,\nROW(A5)),Paramètres!$Y$2:$Y$25-ROW(Paramètres!$Y$2:$Y$25)/10^10,0))","v":"Galles"},{"$f":"INDEX(Paramètres!$W$2:$Y$25,MATCH(LARGE(Paramètres!$Y$2:$Y$25-ROW(Paramètres!$W$2:$W$25)/10^10,\nROW(B5)),Paramètres!$Y$2:$Y$25-ROW(Paramètres!$Y$2:$Y$25)/10^10,0),3)","v":0}]
[null,null,{"$f":"INDEX(Paramètres!$W$2:$W$25,MATCH(LARGE(Paramètres!$Y$2:$Y$25-ROW(Paramètres!$W$2:$W$25)/10^10,\nROW(A6)),Paramètres!$Y$2:$Y$25-ROW(Paramètres!$Y$2:$Y$25)/10^10,0))","v":"Russie"},{"$f":"INDEX(Paramètres!$W$2:$Y$25,MATCH(LARGE(Paramètres!$Y$2:$Y$25-ROW(Paramètres!$W$2:$W$25)/10^10,\nROW(B6)),Paramètres!$Y$2:$Y$25-ROW(Paramètres!$Y$2:$Y$25)/10^10,0),3)","v":0}]
[null,null,{"$f":"INDEX(Paramètres!$W$2:$W$25,MATCH(LARGE(Paramètres!$Y$2:$Y$25-ROW(Paramètres!$W$2:$W$25)/10^10,\nROW(A7)),Paramètres!$Y$2:$Y$25-ROW(Paramètres!$Y$2:$Y$25)/10^10,0))","v":"Angleterre"},{"$f":"INDEX(Paramètres!$W$2:$Y$25,MATCH(LARGE(Paramètres!$Y$2:$Y$25-ROW(Paramètres!$W$2:$W$25)/10^10,\nROW(B7)),Paramètres!$Y$2:$Y$25-ROW(Paramètres!$Y$2:$Y$25)/10^10,0),3)","v":0}]
[null,null,{"$f":"INDEX(Paramètres!$W$2:$W$25,MATCH(LARGE(Paramètres!$Y$2:$Y$25-ROW(Paramètres!$W$2:$W$25)/10^10,\nROW(A8)),Paramètres!$Y$2:$Y$25-ROW(Paramètres!$Y$2:$Y$25)/10^10,0))","v":"Slovaquie"},{"$f":"INDEX(Paramètres!$W$2:$Y$25,MATCH(LARGE(Paramètres!$Y$2:$Y$25-ROW(Paramètres!$W$2:$W$25)/10^10,\nROW(B8)),Paramètres!$Y$2:$Y$25-ROW(Paramètres!$Y$2:$Y$25)/10^10,0),3)","v":0}]
[null,null,{"$f":"INDEX(Paramètres!$W$2:$W$25,MATCH(LARGE(Paramètres!$Y$2:$Y$25-ROW(Paramètres!$W$2:$W$25)/10^10,\nROW(A9)),Paramètres!$Y$2:$Y$25-ROW(Paramètres!$Y$2:$Y$25)/10^10,0))","v":"Allemagne"},{"$f":"INDEX(Paramètres!$W$2:$Y$25,MATCH(LARGE(Paramètres!$Y$2:$Y$25-ROW(Paramètres!$W$2:$W$25)/10^10,\nROW(B9)),Paramètres!$Y$2:$Y$25-ROW(Paramètres!$Y$2:$Y$25)/10^10,0),3)","v":0}]
[]
[]
[]
{"$rows_left_out":45}
{"sheet":"Comparatif","index":6,"n_rows":33,"n_cols":9,"rows_kept":33,"cut":false,"hidden":true,"merged":[[8,2,8,3],[8,8,8,9]]}
[]
[]
[null,{"$f":" \"Mes pronostics au \" & TEXT(TODAY(),\"jjjj jj mmm aaaa\")","v":"Mes pronostics au jjjj jj Jun Wednesday"},null,null,null,"Me trouver:"]
[null,null,null,null,null,null,{"$f":"IFERROR(INDEX(Paramètres!$I$1:$S$52,MATCH(Comparatif!G5,Paramètres!$S$1:$S$52,0),1),\"\")","v":""}]
[null,null,null,null,null,"Voir un match:"]
[]
[]
[]
[null,"Date du match:",null,null,null,"Mon pourcentage de réussite",null,null,"Classement des meilleurs pronostics"]
[]
[null,"Equipes:",null,null,null,"Mon classement"]
[]
[null,"Mes pronostics:",null,null,null,"Détail du classement"]
[]
[null,"La cote:"]
[]
[null,"Les résultats:"]
[]
[]
[]
{"$rows_left_out":13}