{"text_format":"3","workbook":"xlsx","n_sheets":4,"sheets":["Début","PARAMÈTRES DU PROJET","DÉTAILS DU PROJET","TOTAUX DU PROJET"],"not_rendered":{"charts":2,"defined_names":3,"pivot_tables":1},"read":"whole","date_system":"1900"}

{"sheet":"Début","index":0,"n_rows":8,"n_cols":2,"rows_kept":8}
[null,"À PROPOS DE CE MODÈLE"]
[]
[null,"Utilisez ce classeur pour effectuer le suivi des paramètres, des détails et des totaux d’un projet lors de la planification de projet pour les cabinets d’avocats."]
[null,"Entrez le nom de la société dans la feuille de calcul Paramètres du projet. Les autres feuilles de calcul seront automatiquement mises à jour."]
[null,"Entrez des informations dans la feuille de calcul Paramètres du projet pour mettre à jour les histogrammes, et dans la feuille de calcul Détails du projet. Le tableau croisé dynamique de la feuille de calcul Totaux du projet est automatiquement mis à jour."]
[null,"Remarque :  "]
{"$rows_left_out":3}
{"sheet":"PARAMÈTRES DU PROJET","index":1,"n_rows":19,"n_cols":9,"rows_kept":19}
["Créez des paramètres du projet dans cette feuille de calcul. Entrez le nom de la société dans la cellule de droite. Des instructions utiles sont disponibles dans les cellules de cette colonne.","Nom de la société"]
["Le titre de cette feuille de calcul figure dans la cellule de droite.","Planification de projet pour les cabinets d’avocats"]
["Le message de confidentialité figure dans la cellule de droite.","Nom Confidentiel de la Société"]
["Un conseil figure dans la cellule de droite.","Les cellules ombrées sont calculées automatiquement. Vous n’avez pas besoin d’y entrer des valeurs."]
["Entrez les détails dans le tableau Paramètres, à partir de la cellule de droite. L’instruction suivante figure dans la cellule A12.","TYPE DE PROJET","PARTENAIRE GÉNÉRAL","AVOCAT D’AFFAIRES","AVOCAT PLAIDANT","AVOCAT SPÉCIALISTE DE LA PROPRIÉTÉ INTELLECTUELLE","AVOCAT SPÉCIALISTE DU DROIT DE LA FAILLITE","PERSONNEL ADMINISTRATIF","TOTAL"]
[null,"Fusion de société",{"v":0.1,"d":"10%"},{"v":0.4,"d":"40%"},{"v":0,"d":"0%"},{"v":0,"d":"0%"},{"v":0,"d":"0%"},{"v":0.5,"d":"50%"},{"$f":"SUM(Paramètres[[#This Row],[PARTENAIRE GÉNÉRAL]:[PERSONNEL ADMINISTRATIF]])","v":{"v":1,"d":"100%"}}]
{"$rows_left_out":14}
{"sheet":"DÉTAILS DU PROJET","index":2,"n_rows":10,"n_cols":25,"rows_kept":10,"merged":[[1,24,8,28]]}
["Créez des détails du projet dans cette feuille de calcul. Le nom de la société est automatiquement mis à jour dans la cellule de droite. Des instructions utiles sont disponibles dans les cellules de cette colonne. Appuyez sur la flèche Bas pour commencer.",{"$f":"'PARAMÈTRES DU PROJET'!B1","v":"Nom de la société"}]
["Le titre de cette feuille de calcul figure dans la cellule de droite et le conseil dans la cellule Y2.",{"$f":"'PARAMÈTRES DU PROJET'!B2","v":"Planification de projet pour les cabinets d’avocats"},{"$nulls":22},"INFORMATIONS :\nPour ajouter une ligne, cliquez dans la cellule située le plus en bas à droite dans le corps du tableau (au-dessus de la ligne de total) et appuyez sur Tab, ou appuyez sur Maj puis sur F10 là où vous voulez insérer la ligne et sélectionnez Insertion | Lignes de tableau  en haut/en dessous.\nVeillez à supprimer toutes les lignes non utilisées, sans quoi le tableau croisé dynamique TOTAUX DU PROJET, qui utilise l’ensemble des cellules des tableaux, produirait des résultats erronés."]
["Le message de confidentialité figure dans la cellule de droite.",{"$f":"'PARAMÈTRES DU PROJET'!B3","v":"Nom Confidentiel de la Société"}]
["Entrez des informations dans le tableau Détails, à partir de la cellule de droite. Les types de projets dans le tableau Détails à droite sont mis à jour automatiquement à partir du tableau Paramètres de la feuille de calcul Paramètres du projet.","NOM DU PROJET","TYPE DE PROJET","DATE DE DÉBUT ESTIMÉE","DATE DE FIN ESTIMÉE","DATE DE DÉBUT RÉELLE","DATE DE FIN RÉELLE","HEURES DE TRAVAIL (ESTIMÉES)","HEURES DE TRAVAIL (RÉELLES)","DURÉE ESTIMÉE","DURÉE RÉELLE","PARTENAIRE GÉNÉRAL","AVOCAT D’AFFAIRES","AVOCAT PLAIDANT","AVOCAT SPÉCIALISTE DE LA PROPRIÉTÉ INTELLECTUELLE","AVOCAT SPÉCIALISTE DU DROIT DE LA FAILLITE","PERSONNEL ADMINISTRATIF","PARTENAIRE GÉNÉRAL 2","AVOCAT D’AFFAIRES 2","AVOCAT PLAIDANT 2","AVOCAT SPÉCIALISTE DE LA PROPRIÉTÉ INTELLECTUELLE 2","AVOCAT SPÉCIALISTE DU DROIT DE LA FAILLITE 2","PERSONNEL ADMINISTRATIF 2"]
[null,"Projet 1","Fusion de société",{"$f":"TODAY()","v":"2019-02-15"},{"$f":"TODAY()+60","v":"2019-04-16"},{"$f":"TODAY()+10","v":"2019-02-25"},{"$f":"TODAY()+65","v":"2019-04-21"},200,220,{"$f":"DAYS360(Détails[[#This Row],[DATE DE DÉBUT ESTIMÉE]],Détails[[#This Row],[DATE DE FIN ESTIMÉE]],FALSE)","v":61},{"$f":"DAYS360(Détails[[#This Row],[DATE DE DÉBUT RÉELLE]],Détails[[#This Row],[DATE DE FIN RÉELLE]],FALSE)","v":56},{"$f":"INDEX(Paramètres[],MATCH(Détails[[#This Row],[TYPE DE PROJET]],Paramètres[TYPE DE PROJET],0),MATCH(Détails[[#Headers],[PARTENAIRE GÉNÉRAL]],Paramètres[#Headers],0))*INDEX('PARAMÈTRES DU PROJET'!$B$12:$H$12,1,MATCH(Détails[[#Headers],[PARTENAIRE GÉNÉRAL]],Paramètres[#Headers],0))*Détails[[#This Row],[HEURES DE TRAVAIL (ESTIMÉES)]]","v":{"v":7000,"d":"7,000 €"}},{"$f":"INDEX(Paramètres[],MATCH(Détails[[#This Row],[TYPE DE PROJET]],Paramètres[TYPE DE PROJET],0),MATCH(Détails[[#Headers],[AVOCAT D’AFFAIRES]],Paramètres[#Headers],0))*INDEX('PARAMÈTRES DU PROJET'!$B$12:$H$12,1,MATCH(Détails[[#Headers],[AVOCAT D’AFFAIRES]],Paramètres[#Headers],0))*Détails[[#This Row],[HEURES DE TRAVAIL (ESTIMÉES)]]","v":{"v":20000,"d":"20,000 €"}},{"$f":"INDEX(Paramètres[],MATCH(Détails[[#This Row],[TYPE DE PROJET]],Paramètres[TYPE DE PROJET],0),MATCH(Détails[[#Headers],[AVOCAT PLAIDANT]],Paramètres[#Headers],0))*INDEX('PARAMÈTRES DU PROJET'!$B$12:$H$12,1,MATCH(Détails[[#Headers],[AVOCAT PLAIDANT]],Paramètres[#Headers],0))*Détails[[#This Row],[HEURES DE TRAVAIL (ESTIMÉES)]]","v":{"v":0,"d":"0 €"}},{"$f":"INDEX(Paramètres[],MATCH(Détails[[#This Row],[TYPE DE PROJET]],Paramètres[TYPE DE PROJET],0),MATCH(Détails[[#Headers],[AVOCAT SPÉCIALISTE DE LA PROPRIÉTÉ INTELLECTUELLE]],Paramètres[#Headers],0))*INDEX('PARAMÈTRES DU PROJET'!$B$12:$H$12,1,MATCH(Détails[[#Headers],[AVOCAT SPÉCIALISTE DE LA PROPRIÉTÉ INTELLECTUELLE]],Paramètres[#Headers],0))*Détails[[#This Row],[HEURES DE TRAVAIL (ESTIMÉES)]]","v":{"v":0,"d":"0 €"}},{"$f":"INDEX(Paramètres[],MATCH(Détails[[#This Row],[TYPE DE PROJET]],Paramètres[TYPE DE PROJET],0),MATCH(Détails[[#Headers],[AVOCAT SPÉCIALISTE DU DROIT DE LA FAILLITE]],Paramètres[#Headers],0))*INDEX('PARAMÈTRES DU PROJET'!$B$12:$H$12,1,MATCH(Détails[[#Headers],[AVOCAT SPÉCIALISTE DU DROIT DE LA FAILLITE]],Paramètres[#Headers],0))*Détails[[#This Row],[HEURES DE TRAVAIL (ESTIMÉES)]]","v":{"v":0,"d":"0 €"}},{"$f":"INDEX(Paramètres[],MATCH(Détails[[#This Row],[TYPE DE PROJET]],Paramètres[TYPE DE PROJET],0),MATCH(Détails[[#Headers],[PERSONNEL ADMINISTRATIF]],Paramètres[#Headers],0))*INDEX('PARAMÈTRES DU PROJET'!$B$12:$H$12,1,MATCH(Détails[[#Headers],[PERSONNEL ADMINISTRATIF]],Paramètres[#Headers],0))*Détails[[#This Row],[HEURES DE TRAVAIL (ESTIMÉES)]]","v":{"v":12500,"d":"12,500 €"}},{"$f":"INDEX(Paramètres[],MATCH(Détails[[#This Row],[TYPE DE PROJET]],Paramètres[TYPE DE PROJET],0),MATCH(Détails[[#Headers],[PARTENAIRE GÉNÉRAL]],Paramètres[#Headers],0))*INDEX('PARAMÈTRES DU PROJET'!$B$12:$H$12,1,MATCH(Détails[[#Headers],[PARTENAIRE GÉNÉRAL]],Paramètres[#Headers],0))*Détails[[#This Row],[HEURES DE TRAVAIL (RÉELLES)]]","v":{"v":7700,"d":"7,700 €"}},{"$f":"INDEX(Paramètres[],MATCH(Détails[[#This Row],[TYPE DE PROJET]],Paramètres[TYPE DE PROJET],0),MATCH(Détails[[#Headers],[AVOCAT D’AFFAIRES]],Paramètres[#Headers],0))*INDEX('PARAMÈTRES DU PROJET'!$B$12:$H$12,1,MATCH(Détails[[#Headers],[AVOCAT D’AFFAIRES]],Paramètres[#Headers],0))*Détails[[#This Row],[HEURES DE TRAVAIL (RÉELLES)]]","v":{"v":22000,"d":"22,000 €"}},{"$f":"INDEX(Paramètres[],MATCH(Détails[[#This Row],[TYPE DE PROJET]],Paramètres[TYPE DE PROJET],0),MATCH(Détails[[#Headers],[AVOCAT PLAIDANT]],Paramètres[#Headers],0))*INDEX('PARAMÈTRES DU PROJET'!$B$12:$H$12,1,MATCH(Détails[[#Headers],[AVOCAT PLAIDANT]],Paramètres[#Headers],0))*Détails[[#This Row],[HEURES DE TRAVAIL (RÉELLES)]]","v":{"v":0,"d":"0 €"}},{"$f":"INDEX(Paramètres[],MATCH(Détails[[#This Row],[TYPE DE PROJET]],Paramètres[TYPE DE PROJET],0),MATCH(Détails[[#Headers],[AVOCAT SPÉCIALISTE DE LA PROPRIÉTÉ INTELLECTUELLE]],Paramètres[#Headers],0))*INDEX('PARAMÈTRES DU PROJET'!$B$12:$H$12,1,MATCH(Détails[[#Headers],[AVOCAT SPÉCIALISTE DE LA PROPRIÉTÉ INTELLECTUELLE]],Paramètres[#Headers],0))*Détails[[#This Row],[HEURES DE TRAVAIL (RÉELLES)]]","v":{"v":0,"d":"0 €"}},{"$f":"INDEX(Paramètres[],MATCH(Détails[[#This Row],[TYPE DE PROJET]],Paramètres[TYPE DE PROJET],0),MATCH(Détails[[#Headers],[AVOCAT SPÉCIALISTE DU DROIT DE LA FAILLITE]],Paramètres[#Headers],0))*INDEX('PARAMÈTRES DU PROJET'!$B$12:$H$12,1,MATCH(Détails[[#Headers],[AVOCAT SPÉCIALISTE DU DROIT DE LA FAILLITE]],Paramètres[#Headers],0))*Détails[[#This Row],[HEURES DE TRAVAIL (RÉELLES)]]","v":{"v":0,"d":"0 €"}},{"$f":"INDEX(Paramètres[],MATCH(Détails[[#This Row],[TYPE DE PROJET]],Paramètres[TYPE DE PROJET],0),MATCH(Détails[[#Headers],[PERSONNEL ADMINISTRATIF]],Paramètres[#Headers],0))*INDEX('PARAMÈTRES DU PROJET'!$B$12:$H$12,1,MATCH(Détails[[#Headers],[PERSONNEL ADMINISTRATIF]],Paramètres[#Headers],0))*Détails[[#This Row],[HEURES DE TRAVAIL (RÉELLES)]]","v":{"v":13750,"d":"13,750 €"}}]
[null,"Projet 2","Acquisition de société",{"$f":"TODAY()+30","v":"2019-03-17"},{"$f":"TODAY()+100","v":"2019-05-26"},{"$f":"TODAY()+40","v":"2019-03-27"},{"$f":"TODAY()+110","v":"2019-06-05"},400,390,{"$f":"DAYS360(Détails[[#This Row],[DATE DE DÉBUT ESTIMÉE]],Détails[[#This Row],[DATE DE FIN ESTIMÉE]],FALSE)","v":69},{"$f":"DAYS360(Détails[[#This Row],[DATE DE DÉBUT RÉELLE]],Détails[[#This Row],[DATE DE FIN RÉELLE]],FALSE)","v":68},{"$f":"INDEX(Paramètres[],MATCH(Détails[[#This Row],[TYPE DE PROJET]],Paramètres[TYPE DE PROJET],0),MATCH(Détails[[#Headers],[PARTENAIRE GÉNÉRAL]],Paramètres[#Headers],0))*INDEX('PARAMÈTRES DU PROJET'!$B$12:$H$12,1,MATCH(Détails[[#Headers],[PARTENAIRE GÉNÉRAL]],Paramètres[#Headers],0))*Détails[[#This Row],[HEURES DE TRAVAIL (ESTIMÉES)]]","v":{"v":14000,"d":"14,000 €"}},{"$f":"INDEX(Paramètres[],MATCH(Détails[[#This Row],[TYPE DE PROJET]],Paramètres[TYPE DE PROJET],0),MATCH(Détails[[#Headers],[AVOCAT D’AFFAIRES]],Paramètres[#Headers],0))*INDEX('PARAMÈTRES DU PROJET'!$B$12:$H$12,1,MATCH(Détails[[#Headers],[AVOCAT D’AFFAIRES]],Paramètres[#Headers],0))*Détails[[#This Row],[HEURES DE TRAVAIL (ESTIMÉES)]]","v":{"v":40000,"d":"40,000 €"}},{"$f":"INDEX(Paramètres[],MATCH(Détails[[#This Row],[TYPE DE PROJET]],Paramètres[TYPE DE PROJET],0),MATCH(Détails[[#Headers],[AVOCAT PLAIDANT]],Paramètres[#Headers],0))*INDEX('PARAMÈTRES DU PROJET'!$B$12:$H$12,1,MATCH(Détails[[#Headers],[AVOCAT PLAIDANT]],Paramètres[#Headers],0))*Détails[[#This Row],[HEURES DE TRAVAIL (ESTIMÉES)]]","v":{"v":0,"d":"0 €"}},{"$f":"INDEX(Paramètres[],MATCH(Détails[[#This Row],[TYPE DE PROJET]],Paramètres[TYPE DE PROJET],0),MATCH(Détails[[#Headers],[AVOCAT SPÉCIALISTE DE LA PROPRIÉTÉ INTELLECTUELLE]],Paramètres[#Headers],0))*INDEX('PARAMÈTRES DU PROJET'!$B$12:$H$12,1,MATCH(Détails[[#Headers],[AVOCAT SPÉCIALISTE DE LA PROPRIÉTÉ INTELLECTUELLE]],Paramètres[#Headers],0))*Détails[[#This Row],[HEURES DE TRAVAIL (ESTIMÉES)]]","v":{"v":11000,"d":"11,000 €"}},{"$f":"INDEX(Paramètres[],MATCH(Détails[[#This Row],[TYPE DE PROJET]],Paramètres[TYPE DE PROJET],0),MATCH(Détails[[#Headers],[AVOCAT SPÉCIALISTE DU DROIT DE LA FAILLITE]],Paramètres[#Headers],0))*INDEX('PARAMÈTRES DU PROJET'!$B$12:$H$12,1,MATCH(Détails[[#Headers],[AVOCAT SPÉCIALISTE DU DROIT DE LA FAILLITE]],Paramètres[#Headers],0))*Détails[[#This Row],[HEURES DE TRAVAIL (ESTIMÉES)]]","v":{"v":0,"d":"0 €"}},{"$f":"INDEX(Paramètres[],MATCH(Détails[[#This Row],[TYPE DE PROJET]],Paramètres[TYPE DE PROJET],0),MATCH(Détails[[#Headers],[PERSONNEL ADMINISTRATIF]],Paramètres[#Headers],0))*INDEX('PARAMÈTRES DU PROJET'!$B$12:$H$12,1,MATCH(Détails[[#Headers],[PERSONNEL ADMINISTRATIF]],Paramètres[#Headers],0))*Détails[[#This Row],[HEURES DE TRAVAIL (ESTIMÉES)]]","v":{"v":20000,"d":"20,000 €"}},{"$f":"INDEX(Paramètres[],MATCH(Détails[[#This Row],[TYPE DE PROJET]],Paramètres[TYPE DE PROJET],0),MATCH(Détails[[#Headers],[PARTENAIRE GÉNÉRAL]],Paramètres[#Headers],0))*INDEX('PARAMÈTRES DU PROJET'!$B$12:$H$12,1,MATCH(Détails[[#Headers],[PARTENAIRE GÉNÉRAL]],Paramètres[#Headers],0))*Détails[[#This Row],[HEURES DE TRAVAIL (RÉELLES)]]","v":{"v":13650,"d":"13,650 €"}},{"$f":"INDEX(Paramètres[],MATCH(Détails[[#This Row],[TYPE DE PROJET]],Paramètres[TYPE DE PROJET],0),MATCH(Détails[[#Headers],[AVOCAT D’AFFAIRES]],Paramètres[#Headers],0))*INDEX('PARAMÈTRES DU PROJET'!$B$12:$H$12,1,MATCH(Détails[[#Headers],[AVOCAT D’AFFAIRES]],Paramètres[#Headers],0))*Détails[[#This Row],[HEURES DE TRAVAIL (RÉELLES)]]","v":{"v":39000,"d":"39,000 €"}},{"$f":"INDEX(Paramètres[],MATCH(Détails[[#This Row],[TYPE DE PROJET]],Paramètres[TYPE DE PROJET],0),MATCH(Détails[[#Headers],[AVOCAT PLAIDANT]],Paramètres[#Headers],0))*INDEX('PARAMÈTRES DU PROJET'!$B$12:$H$12,1,MATCH(Détails[[#Headers],[AVOCAT PLAIDANT]],Paramètres[#Headers],0))*Détails[[#This Row],[HEURES DE TRAVAIL (RÉELLES)]]","v":{"v":0,"d":"0 €"}},{"$f":"INDEX(Paramètres[],MATCH(Détails[[#This Row],[TYPE DE PROJET]],Paramètres[TYPE DE PROJET],0),MATCH(Détails[[#Headers],[AVOCAT SPÉCIALISTE DE LA PROPRIÉTÉ INTELLECTUELLE]],Paramètres[#Headers],0))*INDEX('PARAMÈTRES DU PROJET'!$B$12:$H$12,1,MATCH(Détails[[#Headers],[AVOCAT SPÉCIALISTE DE LA PROPRIÉTÉ INTELLECTUELLE]],Paramètres[#Headers],0))*Détails[[#This Row],[HEURES DE TRAVAIL (RÉELLES)]]","v":{"v":10725,"d":"10,725 €"}},{"$f":"INDEX(Paramètres[],MATCH(Détails[[#This Row],[TYPE DE PROJET]],Paramètres[TYPE DE PROJET],0),MATCH(Détails[[#Headers],[AVOCAT SPÉCIALISTE DU DROIT DE LA FAILLITE]],Paramètres[#Headers],0))*INDEX('PARAMÈTRES DU PROJET'!$B$12:$H$12,1,MATCH(Détails[[#Headers],[AVOCAT SPÉCIALISTE DU DROIT DE LA FAILLITE]],Paramètres[#Headers],0))*Détails[[#This Row],[HEURES DE TRAVAIL (RÉELLES)]]","v":{"v":0,"d":"0 €"}},{"$f":"INDEX(Paramètres[],MATCH(Détails[[#This Row],[TYPE DE PROJET]],Paramètres[TYPE DE PROJET],0),MATCH(Détails[[#Headers],[PERSONNEL ADMINISTRATIF]],Paramètres[#Headers],0))*INDEX('PARAMÈTRES DU PROJET'!$B$12:$H$12,1,MATCH(Détails[[#Headers],[PERSONNEL ADMINISTRATIF]],Paramètres[#Headers],0))*Détails[[#This Row],[HEURES DE TRAVAIL (RÉELLES)]]","v":{"v":19500,"d":"19,500 €"}}]
{"$rows_left_out":5}
{"sheet":"TOTAUX DU PROJET","index":3,"n_rows":11,"n_cols":16,"rows_kept":11,"merged":[[3,2,3,7],[3,8,3,13],[3,15,14,19]]}
["Obtenez les totaux du projet dans cette feuille de calcul. Le nom de la société est automatiquement mis à jour dans la cellule de droite. Des instructions utiles sont disponibles dans les cellules de cette colonne. Appuyez sur la flèche Bas pour commencer.",{"$f":"'PARAMÈTRES DU PROJET'!B1","v":"Nom de la société"}]
["Le titre de cette feuille de calcul figure dans la cellule de droite.",{"$f":"'PARAMÈTRES DU PROJET'!B2","v":"Planification de projet pour les cabinets d’avocats"}]
["Le message de confidentialité figure dans la cellule de droite.",{"$f":"'PARAMÈTRES DU PROJET'!B3","v":"Nom Confidentiel de la Société"}]
["L’étiquette Estimé se trouve dans la cellule C4, l’étiquette Réel dans la cellule I4 et le conseil dans la cellule P4.",null,"ESTIMÉ",{"$nulls":5},"RÉEL",{"$nulls":6},"INFORMATIONS : \nCe tableau croisé dynamique n’est pas actualisé automatiquement.  Pour l’actualiser, cliquez dans l’une de ses cellules, puis dans l’onglet OUTILS DE TABLEAU CROISÉ DYNAMIQUE | ANALYSE, sélectionnez Actualiser.  Vous pouvez également cliquer dans le tableau croisé dynamique et appuyer sur Maj+F10, puis sélectionner Actualiser."]
["Le tableau croisé dynamique commençant dans la cellule de droite est automatiquement mis à jour.","NOM DU PROJET","PARTENAIRE GÉNÉRAL ","AFFAIRES ","AVOCAT PLAIDANT ","PROPRIÉTÉ INTELLECTUELLE ","FAILLITE ","PERSONNEL ADMINISTRATIF ","PARTENAIRE GÉNÉRAL  ","AFFAIRES  ","AVOCAT PLAIDANT  ","FAILLITE  ","PROPRIÉTÉ INTELLECTUELLE  ","PERSONNEL ADMINISTRATIF  "]
[null,"Projet 1",{"v":7000,"d":"7,000.00 €"},{"v":20000,"d":"20,000.00 €"},{"v":0,"d":"0.00 €"},{"v":0,"d":"0.00 €"},{"v":0,"d":"0.00 €"},{"v":12500,"d":"12,500.00 €"},{"v":7700,"d":"7,700.00 €"},{"v":22000,"d":"22,000.00 €"},{"v":0,"d":"0.00 €"},{"v":0,"d":"0.00 €"},{"v":0,"d":"0.00 €"},{"v":13750,"d":"13,750.00 €"}]
{"$rows_left_out":5}