{"text_format":"3","workbook":"xlsx","n_sheets":4,"sheets":["Suivi des notes","Vos performances","Paramètres","Calculs"],"not_rendered":{"defined_names":3,"comments":1},"read":"whole","date_system":"1900"}

{"sheet":"Suivi des notes","index":0,"n_rows":14,"n_cols":6,"rows_kept":14}
[null,"Entrez vos notes ici"]
[]
[null,null,"Cours","Type","Description","Note"]
[null,null,"Anglais","Devoirs","Histoire de la Seconde Guerre mondiale",{"v":0.8,"d":"80%"}]
[null,null,"Programmation avancée en Java","Examen partiel",null,{"v":0.75,"d":"75%"}]
[null,null,"Espagnol","Devoirs",null,{"v":0.5,"d":"50%"}]
[null,null,"Physique théorique","Devoirs",null,{"v":0.95,"d":"95%"}]
[null,null,"Anglais","Devoirs","Histoire de la Première Guerre mondiale",{"v":0.9,"d":"90%"}]
[null,null,"Anglais","Devoirs","Pages 30 à 41",{"v":0.8,"d":"80%"}]
[null,null,"Composition","Dissertation","Épreuve d’argumentation",{"v":0.95,"d":"95%"}]
[null,null,"Mathématiques 1","Devoirs","Pages 21 et 26",{"v":0.8,"d":"80%"}]
[null,null,"Mathématiques 2","Devoirs","Pages 15 et 18",{"v":0.85,"d":"85%"}]
[null,null,"Mathématiques 1","Devoirs","Pages 34 à 36",{"v":0.8,"d":"80%"}]
[null,null,"Mathématiques 2","Questionnaire",null,{"v":0.95,"d":"95%"}]

{"sheet":"Vos performances","index":1,"n_rows":31,"n_cols":8,"rows_kept":31}
[null,"Vos performances"]
[]
[null,null,"Totaux"]
[null,null,{"$f":"\"Heures : \"&SUM(tblCours[Crédit (heures)])","v":"Heures : 24"},{"$f":"AVERAGE(D7:D31)","v":{"v":0.8104761904761906,"d":"81%"}},{"$f":"AVERAGE(E7:E31)","v":{"v":2.7142857142857144,"d":"2.71"}},{"$f":"SUM(F7:F31)","v":{"v":2.625,"d":"2.63"}},{"$f":"IFERROR(HLOOKUP(D4,_1erTableauCorrespondanceMoyenne,2),\"\")","v":"B-"}]
[]
[null,null,"Cours","%","MOYENNE","Moyenne pondérée","Lettre","Performance globale"]
[null,null,{"$f":"Calculs!C6","v":"Anglais"},{"$f":"Calculs!AL6","v":{"v":0.8333333333333334,"d":"83%"}},{"$f":"Calculs!AM6","v":{"v":3,"d":"3.00"}},{"$f":"IFERROR(E7*Paramètres!D9/SUM(tblCours[Crédit (heures)]),\"\")","v":{"v":0.375,"d":"0.38"}},{"$f":"Calculs!AN6","v":"B"}]
[null,null,{"$f":"Calculs!C7","v":"Physique théorique"},{"$f":"Calculs!AL7","v":{"v":0.95,"d":"95%"}},{"$f":"Calculs!AM7","v":{"v":4,"d":"4.00"}},{"$f":"IFERROR(E8*Paramètres!D10/SUM(tblCours[Crédit (heures)]),\"\")","v":{"v":0.5,"d":"0.50"}},{"$f":"Calculs!AN7","v":"A"}]
[null,null,{"$f":"Calculs!C8","v":"Mathématiques 1"},{"$f":"Calculs!AL8","v":{"v":0.8000000000000002,"d":"80%"}},{"$f":"Calculs!AM8","v":2.67},{"$f":"IFERROR(E9*Paramètres!D11/SUM(tblCours[Crédit (heures)]),\"\")","v":{"v":0.445,"d":"0.45"}},{"$f":"Calculs!AN8","v":"B-"}]
[null,null,{"$f":"Calculs!C9","v":"Mathématiques 2"},{"$f":"Calculs!AL9","v":{"v":0.89,"d":"89%"}},{"$f":"Calculs!AM9","v":3.33},{"$f":"IFERROR(E10*Paramètres!D12/SUM(tblCours[Crédit (heures)]),\"\")","v":{"v":0.555,"d":"0.56"}},{"$f":"Calculs!AN9","v":"B+"}]
[null,null,{"$f":"Calculs!C10","v":"Programmation avancée en Java"},{"$f":"Calculs!AL10","v":{"v":0.7500000000000001,"d":"75%"}},{"$f":"Calculs!AM10","v":{"v":2,"d":"2.00"}},{"$f":"IFERROR(E11*Paramètres!D13/SUM(tblCours[Crédit (heures)]),\"\")","v":{"v":0.4166666666666667,"d":"0.42"}},{"$f":"Calculs!AN10","v":"C"}]
[null,null,{"$f":"Calculs!C11","v":"Espagnol"},{"$f":"Calculs!AL11","v":{"v":0.5,"d":"50%"}},{"$f":"Calculs!AM11","v":{"v":0,"d":"0.00"}},{"$f":"IFERROR(E12*Paramètres!D14/SUM(tblCours[Crédit (heures)]),\"\")","v":{"v":0,"d":"0.00"}},{"$f":"Calculs!AN11","v":"F"}]
[null,null,{"$f":"Calculs!C12","v":"Composition"},{"$f":"Calculs!AL12","v":{"v":0.95,"d":"95%"}},{"$f":"Calculs!AM12","v":{"v":4,"d":"4.00"}},{"$f":"IFERROR(E13*Paramètres!D15/SUM(tblCours[Crédit (heures)]),\"\")","v":{"v":0.3333333333333333,"d":"0.33"}},{"$f":"Calculs!AN12","v":"A"}]
[null,null,{"$f":"Calculs!C13","v":""},{"$f":"Calculs!AL13","v":""},{"$f":"Calculs!AM13","v":""},{"$f":"IFERROR(E14*Paramètres!D16/SUM(tblCours[Crédit (heures)]),\"\")","v":""},{"$f":"Calculs!AN13","v":""}]
[null,null,{"$f":"Calculs!C14","v":""},{"$f":"Calculs!AL14","v":""},{"$f":"Calculs!AM14","v":""},{"$f":"IFERROR(E15*Paramètres!D17/SUM(tblCours[Crédit (heures)]),\"\")","v":""},{"$f":"Calculs!AN14","v":""}]
{"$rows_left_out":17}
{"sheet":"Paramètres","index":2,"n_rows":15,"n_cols":16,"rows_kept":15,"merged":[[5,2,5,15]]}
[null,"Paramètres"]
[null,null,"Tableau de correspondance entre les notes et la moyenne"]
[null,null,"Pourcentage",{"v":0,"d":"0%"},{"v":0.6,"d":"60%"},{"v":0.63,"d":"63%"},{"v":0.67,"d":"67%"},{"v":0.7,"d":"70%"},{"v":0.73,"d":"73%"},{"v":0.77,"d":"77%"},{"v":0.8,"d":"80%"},{"v":0.83,"d":"83%"},{"v":0.87,"d":"87%"},{"v":0.9,"d":"90%"},{"v":0.93,"d":"93%"},{"v":0.97,"d":"97%"}]
[null,null,"Note (lettre)","F","D-","D","D+","C-","C","C+","B-","B","B+","A-","A","A+"]
[null,null,"MOYENNE",0,0.67,1,1.33,1.67,2,2.33,2.67,3,3.33,3.67,4,4]
[]
[null,null,"Notes pondérées pour un maximum de 25 cours"]
[null,null,"Vos cours","Crédit (heures)","Devoirs","Dissertation","Questionnaire","Projet","Examen partiel","Examen final","Autre","% total"]
[null,null,"Anglais",{"v":3,"d":"3.0"},{"v":0.1,"d":"10%"},{"v":0.15,"d":"15%"},{"v":0.15,"d":"15%"},{"v":0.1,"d":"10%"},{"v":0.2,"d":"20%"},{"v":0.3,"d":"30%"},null,{"$f":"SUM(tblCours[[#This Row],[Devoirs]:[Autre]])","v":{"v":1,"d":"100%"}}]
[null,null,"Physique théorique",{"v":3,"d":"3.0"},{"v":0.15,"d":"15%"},{"v":0.15,"d":"15%"},{"v":0.1,"d":"10%"},{"v":0.1,"d":"10%"},{"v":0.15,"d":"15%"},{"v":0.3,"d":"30%"},{"v":0.05,"d":"5%"},{"$f":"SUM(tblCours[[#This Row],[Devoirs]:[Autre]])","v":{"v":1,"d":"100%"}}]
[null,null,"Mathématiques 1",{"v":4,"d":"4.0"},{"v":0.1,"d":"10%"},{"v":0.15,"d":"15%"},{"v":0.15,"d":"15%"},{"v":0.1,"d":"10%"},{"v":0.2,"d":"20%"},{"v":0.3,"d":"30%"},null,{"$f":"SUM(tblCours[[#This Row],[Devoirs]:[Autre]])","v":{"v":1,"d":"100%"}}]
[null,null,"Mathématiques 2",{"v":4,"d":"4.0"},{"v":0.15,"d":"15%"},{"v":0.15,"d":"15%"},{"v":0.1,"d":"10%"},{"v":0.1,"d":"10%"},{"v":0.15,"d":"15%"},{"v":0.3,"d":"30%"},{"v":0.05,"d":"5%"},{"$f":"SUM(tblCours[[#This Row],[Devoirs]:[Autre]])","v":{"v":1,"d":"100%"}}]
[null,null,"Programmation avancée en Java",{"v":5,"d":"5.0"},{"v":0.15,"d":"15%"},{"v":0.15,"d":"15%"},{"v":0.1,"d":"10%"},{"v":0.1,"d":"10%"},{"v":0.2,"d":"20%"},{"v":0.3,"d":"30%"},null,{"$f":"SUM(tblCours[[#This Row],[Devoirs]:[Autre]])","v":{"v":1,"d":"100%"}}]
[null,null,"Espagnol",{"v":3,"d":"3.0"},{"v":0.1,"d":"10%"},{"v":0.15,"d":"15%"},{"v":0.17,"d":"17%"},{"v":0.13,"d":"13%"},{"v":0.2,"d":"20%"},{"v":0.2,"d":"20%"},{"v":0.05,"d":"5%"},{"$f":"SUM(tblCours[[#This Row],[Devoirs]:[Autre]])","v":{"v":1,"d":"100%"}}]
[null,null,"Composition",{"v":2,"d":"2.0"},{"v":0.15,"d":"15%"},{"v":0.15,"d":"15%"},{"v":0.12,"d":"12%"},{"v":0.15,"d":"15%"},{"v":0.15,"d":"15%"},{"v":0.25,"d":"25%"},{"v":0.03,"d":"3%"},{"$f":"SUM(tblCours[[#This Row],[Devoirs]:[Autre]])","v":{"v":1,"d":"100%"}}]
{"$rows_left_out":1}
{"sheet":"Calculs","index":3,"n_rows":657,"n_cols":40,"rows_kept":657,"hidden":true}
[null,"Calculs"]
[null,null,"Cette feuille de calcul fournit des calculs pour vos notes et moyennes et doit rester cachée. Toutes les modifications apportées à cette feuille peuvent entraîner des erreurs."]
[]
[null,null,"Liste des cours actuelle","Notes (sur 1)",{"$nulls":24},"Calcul de la moyenne"]
[null,null,"Cours",1,2,3,4,5,6,7,8,9,10,11,12,13,14,15,16,17,18,19,20,21,22,23,24,25,{"$f":"tblCours[[#Headers],[Devoirs]]","v":"Devoirs"},{"$f":"tblCours[[#Headers],[Dissertation]]","v":"Dissertation"},{"$f":"tblCours[[#Headers],[Questionnaire]]","v":"Questionnaire"},{"$f":"tblCours[[#Headers],[Projet]]","v":"Projet"},{"$f":"tblCours[[#Headers],[Examen partiel]]","v":"Examen partiel"},{"$f":"tblCours[[#Headers],[Examen final]]","v":"Examen final"},{"$f":"tblCours[[#Headers],[Autre]]","v":"Autre"},"Total","Nombre total de points possibles","Total en %","Note","Note (lettre)"]
[null,null,{"$f":"IF(Paramètres!C9=\"\",\"\",Paramètres!C9)","v":"Anglais"},{"$f":"IFERROR(INDEX(tblNotesCours[],MATCH($C6:$C30&D$5:AB$5,Calculs!$C$33:$C$657,0),4),\"\")","v":{"v":0.8,"d":"80%"}},{"v":0.9,"d":"90%"},{"v":0.8,"d":"80%"},"","","","","","","","","","","","","","","","","","","","","","",{"$f":"IFERROR(AVERAGEIFS(tblNotesCours[Note],tblNotesCours[Cours],Calculs!$C6,tblNotesCours[Type],Calculs!AC$5)*Paramètres!E9,\"\")","v":0.08333333333333334},{"$f":"IFERROR(AVERAGEIFS(tblNotesCours[Note],tblNotesCours[Cours],Calculs!$C6,tblNotesCours[Type],Calculs!AD$5)*Paramètres!F9,\"\")","v":""},{"$f":"IFERROR(AVERAGEIFS(tblNotesCours[Note],tblNotesCours[Cours],Calculs!$C6,tblNotesCours[Type],Calculs!AE$5)*Paramètres!G9,\"\")","v":""},{"$f":"IFERROR(AVERAGEIFS(tblNotesCours[Note],tblNotesCours[Cours],Calculs!$C6,tblNotesCours[Type],Calculs!AF$5)*Paramètres!H9,\"\")","v":""},{"$f":"IFERROR(AVERAGEIFS(tblNotesCours[Note],tblNotesCours[Cours],Calculs!$C6,tblNotesCours[Type],Calculs!AG$5)*Paramètres!I9,\"\")","v":""},{"$f":"IFERROR(AVERAGEIFS(tblNotesCours[Note],tblNotesCours[Cours],Calculs!$C6,tblNotesCours[Type],Calculs!AH$5)*Paramètres!J9,\"\")","v":""},{"$f":"IFERROR(AVERAGEIFS(tblNotesCours[Note],tblNotesCours[Cours],Calculs!$C6,tblNotesCours[Type],Calculs!AI$5)*Paramètres!K9,\"\")","v":""},{"$f":"SUM(AC6:AI6)","v":0.08333333333333334},{"$f":"SUMIFS(Paramètres!E9:K9,Calculs!AC6:AI6,\">0\")","v":0.1},{"$f":"IFERROR(AJ6/AK6,\"\")","v":{"v":0.8333333333333334,"d":"83%"}},{"$f":"IFERROR(HLOOKUP(AL6,_1erTableauCorrespondanceMoyenne,3),\"\")","v":3},{"$f":"IFERROR(HLOOKUP(AL6,_1erTableauCorrespondanceMoyenne,2),\"\")","v":"B"}]
[null,null,{"$f":"IF(Paramètres!C10=\"\",\"\",Paramètres!C10)","v":"Physique théorique"},{"v":0.95,"d":"95%"},"","","","","","","","","","","","","","","","","","","","","","","","",{"$f":"IFERROR(AVERAGEIFS(tblNotesCours[Note],tblNotesCours[Cours],Calculs!$C7,tblNotesCours[Type],Calculs!AC$5)*Paramètres!E10,\"\")","v":0.1425},{"$f":"IFERROR(AVERAGEIFS(tblNotesCours[Note],tblNotesCours[Cours],Calculs!$C7,tblNotesCours[Type],Calculs!AD$5)*Paramètres!F10,\"\")","v":""},{"$f":"IFERROR(AVERAGEIFS(tblNotesCours[Note],tblNotesCours[Cours],Calculs!$C7,tblNotesCours[Type],Calculs!AE$5)*Paramètres!G10,\"\")","v":""},{"$f":"IFERROR(AVERAGEIFS(tblNotesCours[Note],tblNotesCours[Cours],Calculs!$C7,tblNotesCours[Type],Calculs!AF$5)*Paramètres!H10,\"\")","v":""},{"$f":"IFERROR(AVERAGEIFS(tblNotesCours[Note],tblNotesCours[Cours],Calculs!$C7,tblNotesCours[Type],Calculs!AG$5)*Paramètres!I10,\"\")","v":""},{"$f":"IFERROR(AVERAGEIFS(tblNotesCours[Note],tblNotesCours[Cours],Calculs!$C7,tblNotesCours[Type],Calculs!AH$5)*Paramètres!J10,\"\")","v":""},{"$f":"IFERROR(AVERAGEIFS(tblNotesCours[Note],tblNotesCours[Cours],Calculs!$C7,tblNotesCours[Type],Calculs!AI$5)*Paramètres!K10,\"\")","v":""},{"$f":"SUM(AC7:AI7)","v":0.1425},{"$f":"SUMIFS(Paramètres!E10:K10,Calculs!AC7:AI7,\">0\")","v":0.15},{"$f":"IFERROR(AJ7/AK7,\"\")","v":{"v":0.95,"d":"95%"}},4,"A"]
[null,null,{"$f":"IF(Paramètres!C11=\"\",\"\",Paramètres!C11)","v":"Mathématiques 1"},{"v":0.8,"d":"80%"},{"v":0.8,"d":"80%"},"","","","","","","","","","","","","","","","","","","","","","","",{"$f":"IFERROR(AVERAGEIFS(tblNotesCours[Note],tblNotesCours[Cours],Calculs!$C8,tblNotesCours[Type],Calculs!AC$5)*Paramètres!E11,\"\")","v":0.08000000000000002},{"$f":"IFERROR(AVERAGEIFS(tblNotesCours[Note],tblNotesCours[Cours],Calculs!$C8,tblNotesCours[Type],Calculs!AD$5)*Paramètres!F11,\"\")","v":""},{"$f":"IFERROR(AVERAGEIFS(tblNotesCours[Note],tblNotesCours[Cours],Calculs!$C8,tblNotesCours[Type],Calculs!AE$5)*Paramètres!G11,\"\")","v":""},{"$f":"IFERROR(AVERAGEIFS(tblNotesCours[Note],tblNotesCours[Cours],Calculs!$C8,tblNotesCours[Type],Calculs!AF$5)*Paramètres!H11,\"\")","v":""},{"$f":"IFERROR(AVERAGEIFS(tblNotesCours[Note],tblNotesCours[Cours],Calculs!$C8,tblNotesCours[Type],Calculs!AG$5)*Paramètres!I11,\"\")","v":""},{"$f":"IFERROR(AVERAGEIFS(tblNotesCours[Note],tblNotesCours[Cours],Calculs!$C8,tblNotesCours[Type],Calculs!AH$5)*Paramètres!J11,\"\")","v":""},{"$f":"IFERROR(AVERAGEIFS(tblNotesCours[Note],tblNotesCours[Cours],Calculs!$C8,tblNotesCours[Type],Calculs!AI$5)*Paramètres!K11,\"\")","v":""},0.08000000000000002,{"$f":"SUMIFS(Paramètres!E11:K11,Calculs!AC8:AI8,\">0\")","v":0.1},{"v":0.8000000000000002,"d":"80%"},2.67,"B-"]
[null,null,{"$f":"IF(Paramètres!C12=\"\",\"\",Paramètres!C12)","v":"Mathématiques 2"},{"v":0.85,"d":"85%"},{"v":0.95,"d":"95%"},"","","","","","","","","","","","","","","","","","","","","","","",{"$f":"IFERROR(AVERAGEIFS(tblNotesCours[Note],tblNotesCours[Cours],Calculs!$C9,tblNotesCours[Type],Calculs!AC$5)*Paramètres!E12,\"\")","v":0.1275},{"$f":"IFERROR(AVERAGEIFS(tblNotesCours[Note],tblNotesCours[Cours],Calculs!$C9,tblNotesCours[Type],Calculs!AD$5)*Paramètres!F12,\"\")","v":""},{"$f":"IFERROR(AVERAGEIFS(tblNotesCours[Note],tblNotesCours[Cours],Calculs!$C9,tblNotesCours[Type],Calculs!AE$5)*Paramètres!G12,\"\")","v":0.095},{"$f":"IFERROR(AVERAGEIFS(tblNotesCours[Note],tblNotesCours[Cours],Calculs!$C9,tblNotesCours[Type],Calculs!AF$5)*Paramètres!H12,\"\")","v":""},{"$f":"IFERROR(AVERAGEIFS(tblNotesCours[Note],tblNotesCours[Cours],Calculs!$C9,tblNotesCours[Type],Calculs!AG$5)*Paramètres!I12,\"\")","v":""},{"$f":"IFERROR(AVERAGEIFS(tblNotesCours[Note],tblNotesCours[Cours],Calculs!$C9,tblNotesCours[Type],Calculs!AH$5)*Paramètres!J12,\"\")","v":""},{"$f":"IFERROR(AVERAGEIFS(tblNotesCours[Note],tblNotesCours[Cours],Calculs!$C9,tblNotesCours[Type],Calculs!AI$5)*Paramètres!K12,\"\")","v":""},0.2225,{"$f":"SUMIFS(Paramètres!E12:K12,Calculs!AC9:AI9,\">0\")","v":0.25},{"v":0.89,"d":"89%"},3.33,"B+"]
[null,null,{"$f":"IF(Paramètres!C13=\"\",\"\",Paramètres!C13)","v":"Programmation avancée en Java"},{"v":0.75,"d":"75%"},"","","","","","","","","","","","","","","","","","","","","","","","",{"$f":"IFERROR(AVERAGEIFS(tblNotesCours[Note],tblNotesCours[Cours],Calculs!$C10,tblNotesCours[Type],Calculs!AC$5)*Paramètres!E13,\"\")","v":""},{"$f":"IFERROR(AVERAGEIFS(tblNotesCours[Note],tblNotesCours[Cours],Calculs!$C10,tblNotesCours[Type],Calculs!AD$5)*Paramètres!F13,\"\")","v":""},{"$f":"IFERROR(AVERAGEIFS(tblNotesCours[Note],tblNotesCours[Cours],Calculs!$C10,tblNotesCours[Type],Calculs!AE$5)*Paramètres!G13,\"\")","v":""},{"$f":"IFERROR(AVERAGEIFS(tblNotesCours[Note],tblNotesCours[Cours],Calculs!$C10,tblNotesCours[Type],Calculs!AF$5)*Paramètres!H13,\"\")","v":""},{"$f":"IFERROR(AVERAGEIFS(tblNotesCours[Note],tblNotesCours[Cours],Calculs!$C10,tblNotesCours[Type],Calculs!AG$5)*Paramètres!I13,\"\")","v":0.15000000000000002},{"$f":"IFERROR(AVERAGEIFS(tblNotesCours[Note],tblNotesCours[Cours],Calculs!$C10,tblNotesCours[Type],Calculs!AH$5)*Paramètres!J13,\"\")","v":""},{"$f":"IFERROR(AVERAGEIFS(tblNotesCours[Note],tblNotesCours[Cours],Calculs!$C10,tblNotesCours[Type],Calculs!AI$5)*Paramètres!K13,\"\")","v":""},0.15000000000000002,{"$f":"SUMIFS(Paramètres!E13:K13,Calculs!AC10:AI10,\">0\")","v":0.2},{"v":0.7500000000000001,"d":"75%"},2,"C"]
[null,null,{"$f":"IF(Paramètres!C14=\"\",\"\",Paramètres!C14)","v":"Espagnol"},{"v":0.5,"d":"50%"},"","","","","","","","","","","","","","","","","","","","","","","","",{"$f":"IFERROR(AVERAGEIFS(tblNotesCours[Note],tblNotesCours[Cours],Calculs!$C11,tblNotesCours[Type],Calculs!AC$5)*Paramètres!E14,\"\")","v":0.05},{"$f":"IFERROR(AVERAGEIFS(tblNotesCours[Note],tblNotesCours[Cours],Calculs!$C11,tblNotesCours[Type],Calculs!AD$5)*Paramètres!F14,\"\")","v":""},{"$f":"IFERROR(AVERAGEIFS(tblNotesCours[Note],tblNotesCours[Cours],Calculs!$C11,tblNotesCours[Type],Calculs!AE$5)*Paramètres!G14,\"\")","v":""},{"$f":"IFERROR(AVERAGEIFS(tblNotesCours[Note],tblNotesCours[Cours],Calculs!$C11,tblNotesCours[Type],Calculs!AF$5)*Paramètres!H14,\"\")","v":""},{"$f":"IFERROR(AVERAGEIFS(tblNotesCours[Note],tblNotesCours[Cours],Calculs!$C11,tblNotesCours[Type],Calculs!AG$5)*Paramètres!I14,\"\")","v":""},{"$f":"IFERROR(AVERAGEIFS(tblNotesCours[Note],tblNotesCours[Cours],Calculs!$C11,tblNotesCours[Type],Calculs!AH$5)*Paramètres!J14,\"\")","v":""},{"$f":"IFERROR(AVERAGEIFS(tblNotesCours[Note],tblNotesCours[Cours],Calculs!$C11,tblNotesCours[Type],Calculs!AI$5)*Paramètres!K14,\"\")","v":""},0.05,{"$f":"SUMIFS(Paramètres!E14:K14,Calculs!AC11:AI11,\">0\")","v":0.1},{"v":0.5,"d":"50%"},0,"F"]
[null,null,{"$f":"IF(Paramètres!C15=\"\",\"\",Paramètres!C15)","v":"Composition"},{"v":0.95,"d":"95%"},"","","","","","","","","","","","","","","","","","","","","","","","",{"$f":"IFERROR(AVERAGEIFS(tblNotesCours[Note],tblNotesCours[Cours],Calculs!$C12,tblNotesCours[Type],Calculs!AC$5)*Paramètres!E15,\"\")","v":""},{"$f":"IFERROR(AVERAGEIFS(tblNotesCours[Note],tblNotesCours[Cours],Calculs!$C12,tblNotesCours[Type],Calculs!AD$5)*Paramètres!F15,\"\")","v":0.1425},{"$f":"IFERROR(AVERAGEIFS(tblNotesCours[Note],tblNotesCours[Cours],Calculs!$C12,tblNotesCours[Type],Calculs!AE$5)*Paramètres!G15,\"\")","v":""},{"$f":"IFERROR(AVERAGEIFS(tblNotesCours[Note],tblNotesCours[Cours],Calculs!$C12,tblNotesCours[Type],Calculs!AF$5)*Paramètres!H15,\"\")","v":""},{"$f":"IFERROR(AVERAGEIFS(tblNotesCours[Note],tblNotesCours[Cours],Calculs!$C12,tblNotesCours[Type],Calculs!AG$5)*Paramètres!I15,\"\")","v":""},{"$f":"IFERROR(AVERAGEIFS(tblNotesCours[Note],tblNotesCours[Cours],Calculs!$C12,tblNotesCours[Type],Calculs!AH$5)*Paramètres!J15,\"\")","v":""},{"$f":"IFERROR(AVERAGEIFS(tblNotesCours[Note],tblNotesCours[Cours],Calculs!$C12,tblNotesCours[Type],Calculs!AI$5)*Paramètres!K15,\"\")","v":""},0.1425,{"$f":"SUMIFS(Paramètres!E15:K15,Calculs!AC12:AI12,\">0\")","v":0.15},{"v":0.95,"d":"95%"},4,"A"]
[null,null,{"$f":"IF(Paramètres!C16=\"\",\"\",Paramètres!C16)","v":""},"","","","","","","","","","","","","","","","","","","","","","","","","",{"$f":"IFERROR(AVERAGEIFS(tblNotesCours[Note],tblNotesCours[Cours],Calculs!$C13,tblNotesCours[Type],Calculs!AC$5)*Paramètres!E16,\"\")","v":""},{"$f":"IFERROR(AVERAGEIFS(tblNotesCours[Note],tblNotesCours[Cours],Calculs!$C13,tblNotesCours[Type],Calculs!AD$5)*Paramètres!F16,\"\")","v":""},{"$f":"IFERROR(AVERAGEIFS(tblNotesCours[Note],tblNotesCours[Cours],Calculs!$C13,tblNotesCours[Type],Calculs!AE$5)*Paramètres!G16,\"\")","v":""},{"$f":"IFERROR(AVERAGEIFS(tblNotesCours[Note],tblNotesCours[Cours],Calculs!$C13,tblNotesCours[Type],Calculs!AF$5)*Paramètres!H16,\"\")","v":""},{"$f":"IFERROR(AVERAGEIFS(tblNotesCours[Note],tblNotesCours[Cours],Calculs!$C13,tblNotesCours[Type],Calculs!AG$5)*Paramètres!I16,\"\")","v":""},{"$f":"IFERROR(AVERAGEIFS(tblNotesCours[Note],tblNotesCours[Cours],Calculs!$C13,tblNotesCours[Type],Calculs!AH$5)*Paramètres!J16,\"\")","v":""},{"$f":"IFERROR(AVERAGEIFS(tblNotesCours[Note],tblNotesCours[Cours],Calculs!$C13,tblNotesCours[Type],Calculs!AI$5)*Paramètres!K16,\"\")","v":""},0,{"$f":"SUMIFS(Paramètres!E16:K16,Calculs!AC13:AI13,\">0\")","v":0},"","",""]
[null,null,{"$f":"IF(Paramètres!C17=\"\",\"\",Paramètres!C17)","v":""},"","","","","","","","","","","","","","","","","","","","","","","","","",{"$f":"IFERROR(AVERAGEIFS(tblNotesCours[Note],tblNotesCours[Cours],Calculs!$C14,tblNotesCours[Type],Calculs!AC$5)*Paramètres!E17,\"\")","v":""},{"$f":"IFERROR(AVERAGEIFS(tblNotesCours[Note],tblNotesCours[Cours],Calculs!$C14,tblNotesCours[Type],Calculs!AD$5)*Paramètres!F17,\"\")","v":""},{"$f":"IFERROR(AVERAGEIFS(tblNotesCours[Note],tblNotesCours[Cours],Calculs!$C14,tblNotesCours[Type],Calculs!AE$5)*Paramètres!G17,\"\")","v":""},{"$f":"IFERROR(AVERAGEIFS(tblNotesCours[Note],tblNotesCours[Cours],Calculs!$C14,tblNotesCours[Type],Calculs!AF$5)*Paramètres!H17,\"\")","v":""},{"$f":"IFERROR(AVERAGEIFS(tblNotesCours[Note],tblNotesCours[Cours],Calculs!$C14,tblNotesCours[Type],Calculs!AG$5)*Paramètres!I17,\"\")","v":""},{"$f":"IFERROR(AVERAGEIFS(tblNotesCours[Note],tblNotesCours[Cours],Calculs!$C14,tblNotesCours[Type],Calculs!AH$5)*Paramètres!J17,\"\")","v":""},{"$f":"IFERROR(AVERAGEIFS(tblNotesCours[Note],tblNotesCours[Cours],Calculs!$C14,tblNotesCours[Type],Calculs!AI$5)*Paramètres!K17,\"\")","v":""},0,{"$f":"SUMIFS(Paramètres!E17:K17,Calculs!AC14:AI14,\">0\")","v":0},"","",""]
[null,null,{"$f":"IF(Paramètres!C18=\"\",\"\",Paramètres!C18)","v":""},"","","","","","","","","","","","","","","","","","","","","","","","","",{"$f":"IFERROR(AVERAGEIFS(tblNotesCours[Note],tblNotesCours[Cours],Calculs!$C15,tblNotesCours[Type],Calculs!AC$5)*Paramètres!E18,\"\")","v":""},{"$f":"IFERROR(AVERAGEIFS(tblNotesCours[Note],tblNotesCours[Cours],Calculs!$C15,tblNotesCours[Type],Calculs!AD$5)*Paramètres!F18,\"\")","v":""},{"$f":"IFERROR(AVERAGEIFS(tblNotesCours[Note],tblNotesCours[Cours],Calculs!$C15,tblNotesCours[Type],Calculs!AE$5)*Paramètres!G18,\"\")","v":""},{"$f":"IFERROR(AVERAGEIFS(tblNotesCours[Note],tblNotesCours[Cours],Calculs!$C15,tblNotesCours[Type],Calculs!AF$5)*Paramètres!H18,\"\")","v":""},{"$f":"IFERROR(AVERAGEIFS(tblNotesCours[Note],tblNotesCours[Cours],Calculs!$C15,tblNotesCours[Type],Calculs!AG$5)*Paramètres!I18,\"\")","v":""},{"$f":"IFERROR(AVERAGEIFS(tblNotesCours[Note],tblNotesCours[Cours],Calculs!$C15,tblNotesCours[Type],Calculs!AH$5)*Paramètres!J18,\"\")","v":""},{"$f":"IFERROR(AVERAGEIFS(tblNotesCours[Note],tblNotesCours[Cours],Calculs!$C15,tblNotesCours[Type],Calculs!AI$5)*Paramètres!K18,\"\")","v":""},0,{"$f":"SUMIFS(Paramètres!E18:K18,Calculs!AC15:AI15,\">0\")","v":0},"","",""]
{"$rows_left_out":642}