{"text_format":"3","workbook":"xlsx","n_sheets":3,"sheets":["Données de vente","État des ventes","Stock"],"not_rendered":{"defined_names":10,"pivot_tables":1},"read":"whole","date_system":"1900"}

{"sheet":"Données de vente","index":0,"n_rows":13,"n_cols":11,"rows_kept":13}
[]
[null,"VENTES QUOTIDIENNES - CAISSE ENREGISTREUSE"]
[]
[]
[]
[{"$nulls":10}," "]
[{"$nulls":10}," "]
[null,"DATE","HEURE","NUMÉRO DE TRANSACTION","RÉFÉRENCE/NUMÉRO PRODUIT","DESCRIPTION","MONTANT VENTES","% T.V.A.","T.V.A. VENTES","TOTAL"]
[null,"2012-02-01","10:30:00",1001,90001,{"$f":"IFERROR(IF(ISNA(VLOOKUP(tblDonnéesdevente[[#This Row],[RÉFÉRENCE/NUMÉRO PRODUIT]],tblStock[],2,0)),\"\",VLOOKUP(tblDonnéesdevente[[#This Row],[RÉFÉRENCE/NUMÉRO PRODUIT]],tblStock[],2,0)),\"Description introuvable\")","v":"Couverture"},{"v":74.95,"d":"$74.95"},{"v":0.05,"d":"5.00 %"},{"$f":"tblDonnéesdevente[[#This Row],[MONTANT VENTES]]*tblDonnéesdevente[[#This Row],[% T.V.A.]]","v":{"v":3.7475000000000005,"d":"3.75 €"}},{"$f":"tblDonnéesdevente[[#This Row],[MONTANT VENTES]]+tblDonnéesdevente[[#This Row],[T.V.A. VENTES]]","v":{"v":78.6975,"d":"78.70 €"}}]
[null,"2012-02-01","10:33:00",1002,90023,{"$f":"IFERROR(IF(ISNA(VLOOKUP(tblDonnéesdevente[[#This Row],[RÉFÉRENCE/NUMÉRO PRODUIT]],tblStock[],2,0)),\"\",VLOOKUP(tblDonnéesdevente[[#This Row],[RÉFÉRENCE/NUMÉRO PRODUIT]],tblStock[],2,0)),\"Description introuvable\")","v":"Nappe 1,8 m, ronde"},{"v":34.99,"d":"$34.99"},{"v":0.05,"d":"5.00 %"},{"$f":"tblDonnéesdevente[[#This Row],[MONTANT VENTES]]*tblDonnéesdevente[[#This Row],[% T.V.A.]]","v":{"v":1.7495000000000003,"d":"1.75 €"}},{"$f":"tblDonnéesdevente[[#This Row],[MONTANT VENTES]]+tblDonnéesdevente[[#This Row],[T.V.A. VENTES]]","v":{"v":36.7395,"d":"36.74 €"}}]
[null,"2012-02-01","10:45:00",1003,90005,{"$f":"IFERROR(IF(ISNA(VLOOKUP(tblDonnéesdevente[[#This Row],[RÉFÉRENCE/NUMÉRO PRODUIT]],tblStock[],2,0)),\"\",VLOOKUP(tblDonnéesdevente[[#This Row],[RÉFÉRENCE/NUMÉRO PRODUIT]],tblStock[],2,0)),\"Description introuvable\")","v":"Assiette ronde"},{"v":55.95,"d":"$55.95"},{"v":0.05,"d":"5.00 %"},{"$f":"tblDonnéesdevente[[#This Row],[MONTANT VENTES]]*tblDonnéesdevente[[#This Row],[% T.V.A.]]","v":{"v":2.7975000000000003,"d":"2.80 €"}},{"$f":"tblDonnéesdevente[[#This Row],[MONTANT VENTES]]+tblDonnéesdevente[[#This Row],[T.V.A. VENTES]]","v":{"v":58.7475,"d":"58.75 €"}}]
[null,"2012-02-01","10:55:00",1004,90004,{"$f":"IFERROR(IF(ISNA(VLOOKUP(tblDonnéesdevente[[#This Row],[RÉFÉRENCE/NUMÉRO PRODUIT]],tblStock[],2,0)),\"\",VLOOKUP(tblDonnéesdevente[[#This Row],[RÉFÉRENCE/NUMÉRO PRODUIT]],tblStock[],2,0)),\"Description introuvable\")","v":"Assiette carrée"},{"v":2.95,"d":"$2.95"},{"v":0.05,"d":"5.00 %"},{"$f":"tblDonnéesdevente[[#This Row],[MONTANT VENTES]]*tblDonnéesdevente[[#This Row],[% T.V.A.]]","v":{"v":0.14750000000000002,"d":"0.15 €"}},{"$f":"tblDonnéesdevente[[#This Row],[MONTANT VENTES]]+tblDonnéesdevente[[#This Row],[T.V.A. VENTES]]","v":{"v":3.0975,"d":"3.10 €"}}]
[null,"2012-02-01","11:45:00",1005,90002,{"$f":"IFERROR(IF(ISNA(VLOOKUP(tblDonnéesdevente[[#This Row],[RÉFÉRENCE/NUMÉRO PRODUIT]],tblStock[],2,0)),\"\",VLOOKUP(tblDonnéesdevente[[#This Row],[RÉFÉRENCE/NUMÉRO PRODUIT]],tblStock[],2,0)),\"Description introuvable\")","v":"Oreiller"},{"v":14.98,"d":"$14.98"},{"v":0.05,"d":"5.00 %"},{"$f":"tblDonnéesdevente[[#This Row],[MONTANT VENTES]]*tblDonnéesdevente[[#This Row],[% T.V.A.]]","v":{"v":0.7490000000000001,"d":"0.75 €"}},{"$f":"tblDonnéesdevente[[#This Row],[MONTANT VENTES]]+tblDonnéesdevente[[#This Row],[T.V.A. VENTES]]","v":{"v":15.729000000000001,"d":"15.73 €"}}]

{"sheet":"État des ventes","index":1,"n_rows":14,"n_cols":7,"rows_kept":14}
[]
[null,"VENTES QUOTIDIENNES - CAISSE ENREGISTREUSE"]
[]
[]
[]
[]
[]
[null,"RÉFÉRENCE/NUMÉRO PRODUIT","DESCRIPTION","DATE","MONTANT VENTE","T.V.A. ventes","Total "]
[null,90001,"Couverture","2012-02-01",{"v":74.95,"d":"74.95 €"},{"v":3.7475000000000005,"d":"3.75 €"},{"v":78.6975,"d":"78.70 €"}]
[null,90002,"Oreiller","2012-02-01",{"v":14.98,"d":"14.98 €"},{"v":0.7490000000000001,"d":"0.75 €"},{"v":15.729000000000001,"d":"15.73 €"}]
[null,90004,"Assiette carrée","2012-02-01",{"v":2.95,"d":"2.95 €"},{"v":0.14750000000000002,"d":"0.15 €"},{"v":3.0975,"d":"3.10 €"}]
[null,90005,"Assiette ronde","2012-02-01",{"v":55.95,"d":"55.95 €"},{"v":2.7975000000000003,"d":"2.80 €"},{"v":58.7475,"d":"58.75 €"}]
[null,90023,"Nappe 1,8 m, ronde","2012-02-01",{"v":34.99,"d":"34.99 €"},{"v":1.7495000000000003,"d":"1.75 €"},{"v":36.7395,"d":"36.74 €"}]
[null,"Total cumulé",null,null,{"v":183.82000000000002,"d":"183.82 €"},{"v":9.191000000000003,"d":"9.19 €"},{"v":193.011,"d":"193.01 €"}]

{"sheet":"Stock","index":2,"n_rows":31,"n_cols":3,"rows_kept":31}
[]
[null,"VENTES QUOTIDIENNES - CAISSE ENREGISTREUSE"]
[]
[]
[]
[]
[]
[null,"RÉFÉRENCE/NUMÉRO PRODUIT","DESCRIPTION"]
[null,90001,"Couverture"]
[null,90002,"Oreiller"]
[null,90003,"Draps"]
[null,90004,"Assiette carrée"]
[null,90005,"Assiette ronde"]
[null,90006,"Bol, grand"]
[null,90007,"Bol, petit"]
[null,90008,"Assiette ronde, petite"]
[null,90009,"Fourchette, petite"]
[null,90010,"Fourchette, grande"]
[null,90011,"Cuillère, petite"]
[null,90012,"Cuillère, grande"]
[null,90013,"Couteau à beurre, petit"]
[null,90014,"Couteau à beurre, grand"]
[null,90015,"Nappe, 10x5"]
[null,90016,"Nappe, 8x5"]
[null,90017,"Nappe, 8x8"]
[null,90018,"Nappe, 6x6"]
[null,90019,"Nappe, 6x4"]
[null,90020,"Nappe, 4x4"]
[null,90021,"Nappe 3 m, ronde"]
[null,90022,"Nappe 2,5 m, ronde"]
[null,90023,"Nappe 1,8 m, ronde"]