{"text_format":"3","workbook":"xlsx","n_sheets":9,"sheets":["Résumé","Classe 1","Classe 2","Classe 3","Classe 4","Classe 5","Classe 6","Classe 7","Tableau des moyennes générales"],"not_rendered":{"defined_names":9},"read":"whole","date_system":"1900"}

{"sheet":"Résumé","index":0,"n_rows":12,"n_cols":7,"rows_kept":12,"merged":[[1,1,1,2]]}
[]
[null,"Nom de l'école",null,"  Votre nom :",null," Semestre/Année :"]
[]
[null,"Classes","Unités de valeur","Pourcentage actuel","Note","Moyenne générale","Moyenne générale pondérée"]
[null,"Classe 1",{"v":3,"d":"3.0"},{"$f":"'Classe 1'!D$36","v":{"v":0.8661764705882354,"d":"86.62%"}},{"$f":"IF(D5<>\"\",HLOOKUP(D5,'Tableau des moyennes générales'!$C$5:$O$7,2),\"\")","v":"B"},{"$f":"IF(D5<>\"\",HLOOKUP(D5,'Tableau des moyennes générales'!$C$5:$O$7,3),\"\")","v":{"v":3,"d":"3.00"}},{"$f":"IF(F5<>\"\",F5*C5/(SUM($C$5:$C$11)), \"\")","v":{"v":0.5625,"d":"0.56"}}]
[null,"Classe 2",{"v":4,"d":"4.0"},{"$f":"'Classe 2'!D$36","v":""},{"$f":"IF(D6<>\"\",HLOOKUP(D6,'Tableau des moyennes générales'!$C$5:$O$7,2),\"\")","v":""},{"$f":"IF(D6<>\"\",HLOOKUP(D6,'Tableau des moyennes générales'!$C$5:$O$7,3),\"\")","v":""},""]
[null,"Classe 3",{"v":2,"d":"2.0"},{"$f":"'Classe 3'!D$36","v":""},{"$f":"IF(D7<>\"\",HLOOKUP(D7,'Tableau des moyennes générales'!$C$5:$O$7,2),\"\")","v":""},{"$f":"IF(D7<>\"\",HLOOKUP(D7,'Tableau des moyennes générales'!$C$5:$O$7,3),\"\")","v":""},""]
[null,"Classe 4",{"v":4,"d":"4.0"},{"$f":"'Classe 4'!D$36","v":""},{"$f":"IF(D8<>\"\",HLOOKUP(D8,'Tableau des moyennes générales'!$C$5:$O$7,2),\"\")","v":""},{"$f":"IF(D8<>\"\",HLOOKUP(D8,'Tableau des moyennes générales'!$C$5:$O$7,3),\"\")","v":""},""]
[null,"Classe 5",{"v":1,"d":"1.0"},{"$f":"'Classe 5'!D$36","v":""},{"$f":"IF(D9<>\"\",HLOOKUP(D9,'Tableau des moyennes générales'!$C$5:$O$7,2),\"\")","v":""},{"$f":"IF(D9<>\"\",HLOOKUP(D9,'Tableau des moyennes générales'!$C$5:$O$7,3),\"\")","v":""},""]
[null,"Classe 6",{"v":1,"d":"1.0"},{"$f":"'Classe 6'!D$36","v":""},{"$f":"IF(D10<>\"\",HLOOKUP(D10,'Tableau des moyennes générales'!$C$5:$O$7,2),\"\")","v":""},{"$f":"IF(D10<>\"\",HLOOKUP(D10,'Tableau des moyennes générales'!$C$5:$O$7,3),\"\")","v":""},""]
[null,"Classe 7",{"v":1,"d":"1.0"},{"$f":"'Classe 7'!D$36","v":""},{"$f":"IF(D11<>\"\",HLOOKUP(D11,'Tableau des moyennes générales'!$C$5:$O$7,2),\"\")","v":""},{"$f":"IF(D11<>\"\",HLOOKUP(D11,'Tableau des moyennes générales'!$C$5:$O$7,3),\"\")","v":""},""]
[null,"Total",{"$f":"SUM(C5:C11)","v":16},{"$f":"AVERAGE(D5:D11)","v":{"v":0.8661764705882354,"d":"86.62%"}},{"$f":"IF(D12<>\"\",HLOOKUP(D12,'Tableau des moyennes générales'!$C$5:$O$7,2),\"\")","v":"B"},{"$f":"AVERAGE(F5:F11)","v":{"v":3,"d":"3.00"}},{"$f":"SUM(G5:G11)","v":{"v":0.5625,"d":"0.56"}}]

{"sheet":"Classe 1","index":1,"n_rows":38,"n_cols":8,"rows_kept":38,"merged":[[1,1,1,2]]}
[]
[null,{"$f":"Résumé!B5","v":"Classe 1"}]
[null,"Professeur :",null,null,"Pourcentage du total de points possibles",null,null,{"$f":"IF(SUM($C$35:$H$35) <> 0,SUM($C$34:$H$34)/SUM($C$35:$H$35),\"\")","v":{"v":0.8661764705882354,"d":"86.62%"}}]
[null,"Adresse électronique :",null,null,"Note actuelle",null,null,{"$f":"SUM($C$34:$H$34)","v":{"v":0.1732352941176471,"d":"17.32%"}}]
[]
[null,"Devoirs","Devoirs à la maison","Devoirs surveillés","Interrogations écrites","Projets","Partiel","Contrôle final"]
[null,"Pondération",{"v":0.1,"d":"10.0%"},{"v":0.1,"d":"10.0%"},{"v":0.15,"d":"15.0%"},{"v":0.15,"d":"15.0%"},{"v":0.2,"d":"20.0%"},{"v":0.3,"d":"30.0%"}]
[null,"Premier DM",{"v":0.882352941176471,"d":"0.88"}]
[null,"Dissertation sur la 2ème guerre mondiale",null,0.85]
{"$rows_empty":24}
[null,"Total des points",{"$f":"IF(COUNT(C8:C33) <> 0,AVERAGE(C8:C33) *C7, \"\")","v":{"v":0.0882352941176471,"d":"0.0882"}},{"v":0.085,"d":"0.0850"},"","","",""]
[null,"Maximum de points possibles",{"$f":"IF(COUNT(C8:C33)<>0,C7,\"\")","v":0.1},0.1,"","","",""]
[null,"Pourcentage du maximum possible",null,{"$f":"IF(SUM($C$35:$H$35) <> 0,SUM($C$34:$H$34)/SUM($C$35:$H$35),\"\")","v":{"v":0.8661764705882354,"d":"86.62%"}}]
[null,"Pour entrer les notes :","Entrez le score obtenu par rapport au maximum possible (par exemple 15/17)."]
[null,null,"Entrez le pourcentage obtenu (par exemple 85 %)."]

{"sheet":"Classe 2","index":2,"n_rows":38,"n_cols":8,"rows_kept":38,"merged":[[1,1,1,2]]}
[]
[null,{"$f":"Résumé!B6","v":"Classe 2"}]
[null,"Professeur :",null,null,"Pourcentage du maximum possible",null,null,{"$f":"IF(SUM($C$35:$H$35) <> 0,SUM($C$34:$H$34)/SUM($C$35:$H$35),\"\")","v":""}]
[null,"Adresse électronique :",null,null,"Note actuelle",null,null,{"$f":"SUM($C$34:$H$34)","v":{"v":0,"d":"0.00%"}}]
[]
[null,"Devoirs","Devoirs à la maison","Devoirs surveillés","Interrogations écrites","Projets","Partiel","Contrôle final"]
[null,"Pondération",{"v":0.1,"d":"10.0%"},{"v":0.1,"d":"10.0%"},{"v":0.15,"d":"15.0%"},{"v":0.15,"d":"15.0%"},{"v":0.2,"d":"20.0%"},{"v":0.3,"d":"30.0%"}]
{"$rows_empty":26}
[null,"Total des points",{"$f":"IF(COUNT(C8:C33) <> 0,AVERAGE(C8:C33) *C7, \"\")","v":""},"","","","",""]
[null,"Maximum de points possibles",{"$f":"IF(COUNT(C8:C33)<>0,C7,\"\")","v":""},"","","","",""]
[null,"Pourcentage du maximum possible",null,{"$f":"IF(SUM($C$35:$H$35) <> 0,SUM($C$34:$H$34)/SUM($C$35:$H$35),\"\")","v":""}]
[null,"Pour entrer les notes :","Entrez le score obtenu par rapport au maximum possible (par exemple 15/17)."]
[null,null,"Entrez le pourcentage obtenu (par exemple 85 %)."]

{"sheet":"Classe 3","index":3,"n_rows":38,"n_cols":8,"rows_kept":38,"merged":[[1,1,1,2]]}
[]
[null,{"$f":"Résumé!B7","v":"Classe 3"}]
[null,"Professeur :",null,null,"Pourcentage du maximum possible",null,null,{"$f":"IF(SUM($C$35:$H$35) <> 0,SUM($C$34:$H$34)/SUM($C$35:$H$35),\"\")","v":""}]
[null,"Adresse électronique :",null,null,"Note actuelle",null,null,{"$f":"SUM($C$34:$H$34)","v":{"v":0,"d":"0.00%"}}]
[]
[null,"Devoirs","Devoirs à la maison","Devoirs surveillés","Questionnaires","Projets","Partiel","Contrôle final"]
[null,"Pondération",{"v":0.1,"d":"10.0%"},{"v":0.1,"d":"10.0%"},{"v":0.15,"d":"15.0%"},{"v":0.15,"d":"15.0%"},{"v":0.2,"d":"20.0%"},{"v":0.3,"d":"30.0%"}]
{"$rows_empty":26}
[null,"Total des points",{"$f":"IF(COUNT(C8:C33) <> 0,AVERAGE(C8:C33) *C7, \"\")","v":""},"","","","",""]
[null,"Maximum de points possibles",{"$f":"IF(COUNT(C8:C33)<>0,C7,\"\")","v":""},"","","","",""]
[null,"Pourcentage du maximum possible",null,{"$f":"IF(SUM($C$35:$H$35) <> 0,SUM($C$34:$H$34)/SUM($C$35:$H$35),\"\")","v":""}]
[null,"Pour entrer les notes :","Entrez le score obtenu par rapport au maximum possible (par exemple 15/17)."]
[null,null,"Entrez le pourcentage obtenu (par exemple 85 %)."]

{"sheet":"Classe 4","index":4,"n_rows":38,"n_cols":8,"rows_kept":38,"merged":[[1,1,1,2]]}
[]
[null,{"$f":"Résumé!B8","v":"Classe 4"}]
[null,"Professeur :",null,null,"Pourcentage du maximum possible"]
[null,"Adresse électronique :",null,null,"Note actuelle",null,null,{"$f":"SUM($C$34:$H$34)","v":{"v":0,"d":"0.00%"}}]
[]
[null,"Devoirs","Devoirs à la maison","Devoirs surveillés","Questionnaires","Projets","Partiel","Contrôle final"]
[null,"Pondération",{"v":0.1,"d":"10.0%"},{"v":0.1,"d":"10.0%"},{"v":0.15,"d":"15.0%"},{"v":0.15,"d":"15.0%"},{"v":0.2,"d":"20.0%"},{"v":0.3,"d":"30.0%"}]
{"$rows_empty":26}
[null,"Total des points",{"$f":"IF(COUNT(C8:C33) <> 0,AVERAGE(C8:C33) *C7, \"\")","v":""},"","","","",""]
[null,"Maximum de points possibles",{"$f":"IF(COUNT(C8:C33)<>0,C7,\"\")","v":""},"","","","",""]
[null,"Pourcentage du maximum possible",null,{"$f":"IF(SUM($C$35:$H$35) <> 0,SUM($C$34:$H$34)/SUM($C$35:$H$35),\"\")","v":""}]
[null,"Pour entrer les notes :","Entrez le score obtenu par rapport au maximum possible (par exemple 15/17)."]
[null,null,"Entrez le pourcentage obtenu (par exemple 85 %)."]

{"sheet":"Classe 5","index":5,"n_rows":38,"n_cols":8,"rows_kept":38,"merged":[[1,1,1,2]]}
[]
[null,{"$f":"Résumé!B9","v":"Classe 5"}]
[null,"Professeur :",null,null,"Pourcentage du maximum possible",null,null,{"$f":"IF(SUM($C$35:$H$35) <> 0,SUM($C$34:$H$34)/SUM($C$35:$H$35),\"\")","v":""}]
[null,"Adresse électronique :",null,null,"Note actuelle",null,null,{"$f":"SUM($C$34:$H$34)","v":{"v":0,"d":"0.00%"}}]
[]
[null,"Devoirs","Devoirs à la maison","Devoirs surveillés","Questionnaires","Projets","Partiel","Contrôle final"]
[null,"Pondération",{"v":0.1,"d":"10.0%"},{"v":0.1,"d":"10.0%"},{"v":0.15,"d":"15.0%"},{"v":0.15,"d":"15.0%"},{"v":0.2,"d":"20.0%"},{"v":0.3,"d":"30.0%"}]
{"$rows_empty":26}
[null,"Total des points",{"$f":"IF(COUNT(C8:C33) <> 0,AVERAGE(C8:C33) *C7, \"\")","v":""},"","","","",""]
[null,"Maximum de points possibles",{"$f":"IF(COUNT(C8:C33)<>0,C7,\"\")","v":""},"","","","",""]
[null,"Pourcentage du maximum possible",null,{"$f":"IF(SUM($C$35:$H$35) <> 0,SUM($C$34:$H$34)/SUM($C$35:$H$35),\"\")","v":""}]
[null,"Pour entrer les notes :","Entrez le score obtenu par rapport au maximum possible (par exemple 15/17)."]
[null,null,"Entrez le pourcentage obtenu (par exemple 85 %)."]

{"sheet":"Classe 6","index":6,"n_rows":38,"n_cols":8,"rows_kept":38,"merged":[[1,1,1,2]]}
[]
[null,{"$f":"Résumé!B10","v":"Classe 6"}]
[null,"Professeur :",null,null,"Pourcentage du maximum possible",null,null,{"$f":"IF(SUM($C$35:$H$35) <> 0,SUM($C$34:$H$34)/SUM($C$35:$H$35),\"\")","v":""}]
[null,"Adresse électronique :",null,null,"Note actuelle",null,null,{"$f":"SUM($C$34:$H$34)","v":{"v":0,"d":"0.00%"}}]
[]
[null,"Devoirs","Devoirs à la maison","Devoirs surveillés","Questionnaires","Projets","Partiel","Contrôle final"]
[null,"Pondération",{"v":0.1,"d":"10.0%"},{"v":0.1,"d":"10.0%"},{"v":0.15,"d":"15.0%"},{"v":0.15,"d":"15.0%"},{"v":0.2,"d":"20.0%"},{"v":0.3,"d":"30.0%"}]
{"$rows_empty":26}
[null,"Total des points",{"$f":"IF(COUNT(C8:C33) <> 0,AVERAGE(C8:C33) *C7, \"\")","v":""},"","","","",""]
[null,"Maximum de points possibles",{"$f":"IF(COUNT(C8:C33)<>0,C7,\"\")","v":""},"","","","",""]
[null,"Pourcentage du maximum possible",null,{"$f":"IF(SUM($C$35:$H$35) <> 0,SUM($C$34:$H$34)/SUM($C$35:$H$35),\"\")","v":""},{"$f":"IF(SUM($C$35:$H$35) <> 0,SUM($C$34:$H$34)/SUM($C$35:$H$35),\"\")","v":""}]
[null,"Pour entrer les notes :","Entrez le score obtenu par rapport au maximum possible (par exemple 15/17)."]
[null,null,"Entrez le pourcentage obtenu (par exemple 85 %)."]

{"sheet":"Classe 7","index":7,"n_rows":38,"n_cols":8,"rows_kept":38,"merged":[[1,1,1,2]]}
[]
[null,{"$f":"Résumé!B11","v":"Classe 7"}]
[null,"Professeur :",null,null,"Pourcentage du maximum possible",null,null,{"$f":"IF(SUM($C$35:$H$35) <> 0,SUM($C$34:$H$34)/SUM($C$35:$H$35),\"\")","v":""}]
[null,"Adresse électronique :",null,null,"Note actuelle",null,null,{"$f":"SUM($C$34:$H$34)","v":{"v":0,"d":"0.00%"}}]
[]
[null,"Devoirs","Devoirs à la maison","Devoirs surveillés","Questionnaires","Projets","Partiel","Contrôle final"]
[null,"Pondération",{"v":0.1,"d":"10.0%"},{"v":0.1,"d":"10.0%"},{"v":0.15,"d":"15.0%"},{"v":0.15,"d":"15.0%"},{"v":0.2,"d":"20.0%"},{"v":0.3,"d":"30.0%"}]
{"$rows_empty":26}
[null,"Total des points",{"$f":"IF(COUNT(C8:C33) <> 0,AVERAGE(C8:C33) *C7, \"\")","v":""},"","","","",""]
[null,"Maximum de points possibles",{"$f":"IF(COUNT(C8:C33)<>0,C7,\"\")","v":""},"","","","",""]
[null,"Pourcentage du maximum possible",null,{"$f":"IF(SUM($C$35:$H$35) <> 0,SUM($C$34:$H$34)/SUM($C$35:$H$35),\"\")","v":""}]
[null,"Pour entrer les notes :","Entrez le score obtenu par rapport au maximum possible (par exemple 15/17)."]
[null,null,"Entrez le pourcentage obtenu (par exemple 85 %)."]

{"sheet":"Tableau des moyennes générales","index":8,"n_rows":7,"n_cols":15,"rows_kept":7}
[]
[]
[]
[null,"Tableau des notes et moyennes générales"]
[null,"Moyenne",{"v":0,"d":"0%"},{"v":0.6,"d":"60%"},{"v":0.63,"d":"63%"},{"v":0.67,"d":"67%"},{"v":0.7,"d":"70%"},{"v":0.73,"d":"73%"},{"v":0.77,"d":"77%"},{"v":0.8,"d":"80%"},{"v":0.83,"d":"83%"},{"v":0.87,"d":"87%"},{"v":0.9,"d":"90%"},{"v":0.93,"d":"93%"},{"v":0.97,"d":"97%"}]
[null,"Note","F","D-","D","D+","C-","C","C+","B-","B","B+","A-","A","A+"]
[null,"Moyenne générale",{"v":0,"d":"0.00"},0.67,{"v":1,"d":"1.00"},1.33,1.67,{"v":2,"d":"2.00"},2.33,2.67,{"v":3,"d":"3.00"},3.33,3.67,{"v":4,"d":"4.00"},{"v":4,"d":"4.00"}]