{"text_format":"3","workbook":"xlsx","n_sheets":12,"sheets":["Janvier","Février","Mars","Avril","Mai","Juin","Juillet","Août","Septembre","Octobre","Novembre","Décembre"],"not_rendered":{"defined_names":28},"read":"whole","date_system":"1900"}

{"sheet":"Janvier","index":0,"n_rows":13,"n_cols":11,"rows_kept":13,"merged":[[12,3,13,3],[12,4,13,7]]}
[null,{"$f":"\"Janvier \"&AnnéeCalendrier","v":"Janvier 2017"},{"$nulls":7},"PARAMÈTRES DU CALENDRIER"]
[null,{"$f":"DébutSemaine","v":"DIMANCHE"},{"$f":"UPPER(TEXT(C3,\"jjjj\"))","v":"LUNDI"},"MARDI","MERCREDI","JEUDI","VENDREDI","SAMEDI",null,"ANNÉE",{"$f":"YEAR(TODAY())","v":2017}]
[null,{"$f":"JoursEtSemaines+DATE(AnnéeCalendrier,1,1)-WEEKDAY(DATE(AnnéeCalendrier,1,1),(DébutSemaine=\"LUNDI\")+1)+1","v":"2017-01-01"},"2017-01-02","2017-01-03","2017-01-04","2017-01-05","2017-01-06","2017-01-07",null,"DÉBUT DE LA SEMAINE","DIMANCHE"]
[]
[null,{"$f":"JoursEtSemaines+DATE(AnnéeCalendrier,1,1)-WEEKDAY(DATE(AnnéeCalendrier,1,1),(DébutSemaine=\"LUNDI\")+1)+8","v":"2017-01-08"},"2017-01-09","2017-01-10","2017-01-11","2017-01-12","2017-01-13","2017-01-14"]
[]
[null,{"$f":"JoursEtSemaines+DATE(AnnéeCalendrier,1,1)-WEEKDAY(DATE(AnnéeCalendrier,1,1),(DébutSemaine=\"LUNDI\")+1)+15","v":"2017-01-15"},"2017-01-16","2017-01-17","2017-01-18","2017-01-19","2017-01-20","2017-01-21"]
[]
[null,{"$f":"JoursEtSemaines+DATE(AnnéeCalendrier,1,1)-WEEKDAY(DATE(AnnéeCalendrier,1,1),(DébutSemaine=\"LUNDI\")+1)+22","v":"2017-01-22"},"2017-01-23","2017-01-24","2017-01-25","2017-01-26","2017-01-27","2017-01-28"]
[]
[null,{"$f":"JoursEtSemaines+DATE(AnnéeCalendrier,1,1)-WEEKDAY(DATE(AnnéeCalendrier,1,1),(DébutSemaine=\"LUNDI\")+1)+29","v":"2017-01-29"},"2017-01-30","2017-01-31","2017-02-01","2017-02-02","2017-02-03","2017-02-04"]
[]
[null,{"$f":"JoursEtSemaines+DATE(AnnéeCalendrier,1,1)-WEEKDAY(DATE(AnnéeCalendrier,1,1),(DébutSemaine=\"LUNDI\")+1)+36","v":"2017-02-05"},"2017-02-06","NOTES"]

{"sheet":"Février","index":1,"n_rows":13,"n_cols":8,"rows_kept":13,"merged":[[12,3,13,3],[12,4,13,7]]}
[null,{"$f":"\"Février \"&AnnéeCalendrier","v":"Février 2017"}]
[null,{"$f":"IF(DébutSemaine=\"DIMANCHE\", \"DIMANCHE\",\"LUNDI\")","v":"DIMANCHE"},{"$f":"UPPER(TEXT(C3,\"jjjj\"))","v":"LUNDI"},"MARDI","MERCREDI","JEUDI","VENDREDI","SAMEDI"]
[null,{"$f":"JoursEtSemaines+DATE(AnnéeCalendrier,2,1)-WEEKDAY(DATE(AnnéeCalendrier,2,1),(DébutSemaine=\"LUNDI\")+1)+1","v":"2017-01-29"},"2017-01-30","2017-01-31","2017-02-01","2017-02-02","2017-02-03","2017-02-04"]
[]
[null,{"$f":"JoursEtSemaines+DATE(AnnéeCalendrier,2,1)-WEEKDAY(DATE(AnnéeCalendrier,2,1),(DébutSemaine=\"LUNDI\")+1)+8","v":"2017-02-05"},"2017-02-06","2017-02-07","2017-02-08","2017-02-09","2017-02-10","2017-02-11"]
[]
[null,{"$f":"JoursEtSemaines+DATE(AnnéeCalendrier,2,1)-WEEKDAY(DATE(AnnéeCalendrier,2,1),(DébutSemaine=\"LUNDI\")+1)+15","v":"2017-02-12"},"2017-02-13","2017-02-14","2017-02-15","2017-02-16","2017-02-17","2017-02-18"]
[]
[null,{"$f":"JoursEtSemaines+DATE(AnnéeCalendrier,2,1)-WEEKDAY(DATE(AnnéeCalendrier,2,1),(DébutSemaine=\"LUNDI\")+1)+22","v":"2017-02-19"},"2017-02-20","2017-02-21","2017-02-22","2017-02-23","2017-02-24","2017-02-25"]
[]
[null,{"$f":"JoursEtSemaines+DATE(AnnéeCalendrier,2,1)-WEEKDAY(DATE(AnnéeCalendrier,2,1),(DébutSemaine=\"LUNDI\")+1)+29","v":"2017-02-26"},"2017-02-27","2017-02-28","2017-03-01","2017-03-02","2017-03-03","2017-03-04"]
[]
[null,{"$f":"JoursEtSemaines+DATE(AnnéeCalendrier,2,1)-WEEKDAY(DATE(AnnéeCalendrier,2,1),(DébutSemaine=\"LUNDI\")+1)+36","v":"2017-03-05"},"2017-03-06","NOTES"]

{"sheet":"Mars","index":2,"n_rows":13,"n_cols":8,"rows_kept":13,"merged":[[12,3,13,3],[12,4,13,7]]}
[null,{"$f":"\"Mars \"&AnnéeCalendrier","v":"Mars 2017"}]
[null,{"$f":"IF( DébutSemaine=\"DIMANCHE\", \"DIMANCHE\",\"LUNDI\")","v":"DIMANCHE"},{"$f":"UPPER(TEXT(C3,\"jjjj\"))","v":"LUNDI"},"MARDI","MERCREDI","JEUDI","VENDREDI","SAMEDI"]
[null,{"$f":"JoursEtSemaines+DATE(AnnéeCalendrier,3,1)-WEEKDAY(DATE(AnnéeCalendrier,3,1),( DébutSemaine=\"LUNDI\")+1)+1","v":"2017-02-26"},"2017-02-27","2017-02-28","2017-03-01","2017-03-02","2017-03-03","2017-03-04"]
[]
[null,{"$f":"JoursEtSemaines+DATE(AnnéeCalendrier,3,1)-WEEKDAY(DATE(AnnéeCalendrier,3,1),( DébutSemaine=\"LUNDI\")+1)+8","v":"2017-03-05"},"2017-03-06","2017-03-07","2017-03-08","2017-03-09","2017-03-10","2017-03-11"]
[]
[null,{"$f":"JoursEtSemaines+DATE(AnnéeCalendrier,3,1)-WEEKDAY(DATE(AnnéeCalendrier,3,1),( DébutSemaine=\"LUNDI\")+1)+15","v":"2017-03-12"},"2017-03-13","2017-03-14","2017-03-15","2017-03-16","2017-03-17","2017-03-18"]
[]
[null,{"$f":"JoursEtSemaines+DATE(AnnéeCalendrier,3,1)-WEEKDAY(DATE(AnnéeCalendrier,3,1),( DébutSemaine=\"LUNDI\")+1)+22","v":"2017-03-19"},"2017-03-20","2017-03-21","2017-03-22","2017-03-23","2017-03-24","2017-03-25"]
[]
[null,{"$f":"JoursEtSemaines+DATE(AnnéeCalendrier,3,1)-WEEKDAY(DATE(AnnéeCalendrier,3,1),( DébutSemaine=\"LUNDI\")+1)+29","v":"2017-03-26"},"2017-03-27","2017-03-28","2017-03-29","2017-03-30","2017-03-31","2017-04-01"]
[]
[null,{"$f":"JoursEtSemaines+DATE(AnnéeCalendrier,3,1)-WEEKDAY(DATE(AnnéeCalendrier,3,1),( DébutSemaine=\"LUNDI\")+1)+36","v":"2017-04-02"},"2017-04-03","NOTES"]

{"sheet":"Avril","index":3,"n_rows":13,"n_cols":8,"rows_kept":13,"merged":[[12,3,13,3],[12,4,13,7]]}
[null,{"$f":"\"Avril \"& AnnéeCalendrier","v":"Avril 2017"}]
[null,{"$f":"IF( DébutSemaine=\"DIMANCHE\", \"DIMANCHE\",\"LUNDI\")","v":"DIMANCHE"},{"$f":"UPPER(TEXT(C3,\"jjjj\"))","v":"LUNDI"},"MARDI","MERCREDI","JEUDI","VENDREDI","SAMEDI"]
[null,{"$f":" JoursEtSemaines+DATE( AnnéeCalendrier,4,1)-WEEKDAY(DATE( AnnéeCalendrier,4,1),( DébutSemaine=\"LUNDI\")+1)+1","v":"2017-03-26"},"2017-03-27","2017-03-28","2017-03-29","2017-03-30","2017-03-31","2017-04-01"]
[]
[null,{"$f":" JoursEtSemaines+DATE( AnnéeCalendrier,4,1)-WEEKDAY(DATE( AnnéeCalendrier,4,1),( DébutSemaine=\"LUNDI\")+1)+8","v":"2017-04-02"},"2017-04-03","2017-04-04","2017-04-05","2017-04-06","2017-04-07","2017-04-08"]
[]
[null,{"$f":" JoursEtSemaines+DATE( AnnéeCalendrier,4,1)-WEEKDAY(DATE( AnnéeCalendrier,4,1),( DébutSemaine=\"LUNDI\")+1)+15","v":"2017-04-09"},"2017-04-10","2017-04-11","2017-04-12","2017-04-13","2017-04-14","2017-04-15"]
[]
[null,{"$f":" JoursEtSemaines+DATE( AnnéeCalendrier,4,1)-WEEKDAY(DATE( AnnéeCalendrier,4,1),( DébutSemaine=\"LUNDI\")+1)+22","v":"2017-04-16"},"2017-04-17","2017-04-18","2017-04-19","2017-04-20","2017-04-21","2017-04-22"]
[]
[null,{"$f":" JoursEtSemaines+DATE( AnnéeCalendrier,4,1)-WEEKDAY(DATE( AnnéeCalendrier,4,1),( DébutSemaine=\"LUNDI\")+1)+29","v":"2017-04-23"},"2017-04-24","2017-04-25","2017-04-26","2017-04-27","2017-04-28","2017-04-29"]
[]
[null,{"$f":" JoursEtSemaines+DATE( AnnéeCalendrier,4,1)-WEEKDAY(DATE( AnnéeCalendrier,4,1),( DébutSemaine=\"LUNDI\")+1)+36","v":"2017-04-30"},"2017-05-01","NOTES"]

{"sheet":"Mai","index":4,"n_rows":13,"n_cols":8,"rows_kept":13,"merged":[[12,3,13,3],[12,4,13,7]]}
[null,{"$f":"\"Mai \"&AnnéeCalendrier","v":"Mai 2017"}]
[null,{"$f":"IF( DébutSemaine=\"DIMANCHE\", \"DIMANCHE\",\"LUNDI\")","v":"DIMANCHE"},{"$f":"UPPER(TEXT(C3,\"jjjj\"))","v":"LUNDI"},"MARDI","MERCREDI","JEUDI","VENDREDI","SAMEDI"]
[null,{"$f":" JoursEtSemaines+DATE(AnnéeCalendrier,5,1)-WEEKDAY(DATE(AnnéeCalendrier,5,1),( DébutSemaine=\"LUNDI\")+1)+1","v":"2017-04-30"},"2017-05-01","2017-05-02","2017-05-03","2017-05-04","2017-05-05","2017-05-06"]
[]
[null,{"$f":" JoursEtSemaines+DATE(AnnéeCalendrier,5,1)-WEEKDAY(DATE(AnnéeCalendrier,5,1),( DébutSemaine=\"LUNDI\")+1)+8","v":"2017-05-07"},"2017-05-08","2017-05-09","2017-05-10","2017-05-11","2017-05-12","2017-05-13"]
[]
[null,{"$f":" JoursEtSemaines+DATE(AnnéeCalendrier,5,1)-WEEKDAY(DATE(AnnéeCalendrier,5,1),( DébutSemaine=\"LUNDI\")+1)+15","v":"2017-05-14"},"2017-05-15","2017-05-16","2017-05-17","2017-05-18","2017-05-19","2017-05-20"]
[]
[null,{"$f":" JoursEtSemaines+DATE(AnnéeCalendrier,5,1)-WEEKDAY(DATE(AnnéeCalendrier,5,1),( DébutSemaine=\"LUNDI\")+1)+22","v":"2017-05-21"},"2017-05-22","2017-05-23","2017-05-24","2017-05-25","2017-05-26","2017-05-27"]
[]
[null,{"$f":" JoursEtSemaines+DATE(AnnéeCalendrier,5,1)-WEEKDAY(DATE(AnnéeCalendrier,5,1),( DébutSemaine=\"LUNDI\")+1)+29","v":"2017-05-28"},"2017-05-29","2017-05-30","2017-05-31","2017-06-01","2017-06-02","2017-06-03"]
[]
[null,{"$f":" JoursEtSemaines+DATE(AnnéeCalendrier,5,1)-WEEKDAY(DATE(AnnéeCalendrier,5,1),( DébutSemaine=\"LUNDI\")+1)+36","v":"2017-06-04"},"2017-06-05","NOTES"]

{"sheet":"Juin","index":5,"n_rows":13,"n_cols":8,"rows_kept":13,"merged":[[12,3,13,3],[12,4,13,7]]}
[null,{"$f":"\"Juin \"&AnnéeCalendrier","v":"Juin 2017"}]
[null,{"$f":"IF(DébutSemaine=\"DIMANCHE\", \"DIMANCHE\",\"LUNDI\")","v":"DIMANCHE"},{"$f":"UPPER(TEXT(C3,\"jjjj\"))","v":"LUNDI"},"MARDI","MERCREDI","JEUDI","VENDREDI","SAMEDI"]
[null,{"$f":"JoursEtSemaines+DATE(AnnéeCalendrier,6,1)-WEEKDAY(DATE(AnnéeCalendrier,6,1),(DébutSemaine=\"LUNDI\")+1)+1","v":"2017-05-28"},"2017-05-29","2017-05-30","2017-05-31","2017-06-01","2017-06-02","2017-06-03"]
[]
[null,{"$f":"JoursEtSemaines+DATE(AnnéeCalendrier,6,1)-WEEKDAY(DATE(AnnéeCalendrier,6,1),(DébutSemaine=\"LUNDI\")+1)+8","v":"2017-06-04"},"2017-06-05","2017-06-06","2017-06-07","2017-06-08","2017-06-09","2017-06-10"]
[]
[null,{"$f":"JoursEtSemaines+DATE(AnnéeCalendrier,6,1)-WEEKDAY(DATE(AnnéeCalendrier,6,1),(DébutSemaine=\"LUNDI\")+1)+15","v":"2017-06-11"},"2017-06-12","2017-06-13","2017-06-14","2017-06-15","2017-06-16","2017-06-17"]
[]
[null,{"$f":"JoursEtSemaines+DATE(AnnéeCalendrier,6,1)-WEEKDAY(DATE(AnnéeCalendrier,6,1),(DébutSemaine=\"LUNDI\")+1)+22","v":"2017-06-18"},"2017-06-19","2017-06-20","2017-06-21","2017-06-22","2017-06-23","2017-06-24"]
[]
[null,{"$f":"JoursEtSemaines+DATE(AnnéeCalendrier,6,1)-WEEKDAY(DATE(AnnéeCalendrier,6,1),(DébutSemaine=\"LUNDI\")+1)+29","v":"2017-06-25"},"2017-06-26","2017-06-27","2017-06-28","2017-06-29","2017-06-30","2017-07-01"]
[]
[null,{"$f":"JoursEtSemaines+DATE(AnnéeCalendrier,6,1)-WEEKDAY(DATE(AnnéeCalendrier,6,1),(DébutSemaine=\"LUNDI\")+1)+36","v":"2017-07-02"},"2017-07-03","NOTES"]

{"sheet":"Juillet","index":6,"n_rows":13,"n_cols":8,"rows_kept":13,"merged":[[12,3,13,3],[12,4,13,7]]}
[null,{"$f":"\"Juillet \"&AnnéeCalendrier","v":"Juillet 2017"}]
[null,{"$f":"IF(DébutSemaine=\"DIMANCHE\", \"DIMANCHE\",\"LUNDI\")","v":"DIMANCHE"},{"$f":"UPPER(TEXT(C3,\"jjjj\"))","v":"LUNDI"},"MARDI","MERCREDI","JEUDI","VENDREDI","SAMEDI"]
[null,{"$f":"JoursEtSemaines+DATE(AnnéeCalendrier,7,1)-WEEKDAY(DATE(AnnéeCalendrier,7,1),(DébutSemaine=\"LUNDI\")+1)+1","v":"2017-06-25"},"2017-06-26","2017-06-27","2017-06-28","2017-06-29","2017-06-30","2017-07-01"]
[]
[null,{"$f":"JoursEtSemaines+DATE(AnnéeCalendrier,7,1)-WEEKDAY(DATE(AnnéeCalendrier,7,1),(DébutSemaine=\"LUNDI\")+1)+8","v":"2017-07-02"},"2017-07-03","2017-07-04","2017-07-05","2017-07-06","2017-07-07","2017-07-08"]
[]
[null,{"$f":"JoursEtSemaines+DATE(AnnéeCalendrier,7,1)-WEEKDAY(DATE(AnnéeCalendrier,7,1),(DébutSemaine=\"LUNDI\")+1)+15","v":"2017-07-09"},"2017-07-10","2017-07-11","2017-07-12","2017-07-13","2017-07-14","2017-07-15"]
[]
[null,{"$f":"JoursEtSemaines+DATE(AnnéeCalendrier,7,1)-WEEKDAY(DATE(AnnéeCalendrier,7,1),(DébutSemaine=\"LUNDI\")+1)+22","v":"2017-07-16"},"2017-07-17","2017-07-18","2017-07-19","2017-07-20","2017-07-21","2017-07-22"]
[]
[null,{"$f":"JoursEtSemaines+DATE(AnnéeCalendrier,7,1)-WEEKDAY(DATE(AnnéeCalendrier,7,1),(DébutSemaine=\"LUNDI\")+1)+29","v":"2017-07-23"},"2017-07-24","2017-07-25","2017-07-26","2017-07-27","2017-07-28","2017-07-29"]
[]
[null,{"$f":"JoursEtSemaines+DATE(AnnéeCalendrier,7,1)-WEEKDAY(DATE(AnnéeCalendrier,7,1),(DébutSemaine=\"LUNDI\")+1)+36","v":"2017-07-30"},"2017-07-31","NOTES"]

{"sheet":"Août","index":7,"n_rows":13,"n_cols":8,"rows_kept":13,"merged":[[12,3,13,3],[12,4,13,7]]}
[null,{"$f":"\"Août \"&AnnéeCalendrier","v":"Août 2017"}]
[null,{"$f":"IF(DébutSemaine=\"DIMANCHE\", \"DIMANCHE\",\"LUNDI\")","v":"DIMANCHE"},{"$f":"UPPER(TEXT(C3,\"jjjj\"))","v":"LUNDI"},"MARDI","MERCREDI","JEUDI","VENDREDI","SAMEDI"]
[null,{"$f":"JoursEtSemaines+DATE(AnnéeCalendrier,8,1)-WEEKDAY(DATE(AnnéeCalendrier,8,1),(DébutSemaine=\"LUNDI\")+1)+1","v":"2017-07-30"},"2017-07-31","2017-08-01","2017-08-02","2017-08-03","2017-08-04","2017-08-05"]
[]
[null,{"$f":"JoursEtSemaines+DATE(AnnéeCalendrier,8,1)-WEEKDAY(DATE(AnnéeCalendrier,8,1),(DébutSemaine=\"LUNDI\")+1)+8","v":"2017-08-06"},"2017-08-07","2017-08-08","2017-08-09","2017-08-10","2017-08-11","2017-08-12"]
[]
[null,{"$f":"JoursEtSemaines+DATE(AnnéeCalendrier,8,1)-WEEKDAY(DATE(AnnéeCalendrier,8,1),(DébutSemaine=\"LUNDI\")+1)+15","v":"2017-08-13"},"2017-08-14","2017-08-15","2017-08-16","2017-08-17","2017-08-18","2017-08-19"]
[]
[null,{"$f":"JoursEtSemaines+DATE(AnnéeCalendrier,8,1)-WEEKDAY(DATE(AnnéeCalendrier,8,1),(DébutSemaine=\"LUNDI\")+1)+22","v":"2017-08-20"},"2017-08-21","2017-08-22","2017-08-23","2017-08-24","2017-08-25","2017-08-26"]
[]
[null,{"$f":"JoursEtSemaines+DATE(AnnéeCalendrier,8,1)-WEEKDAY(DATE(AnnéeCalendrier,8,1),(DébutSemaine=\"LUNDI\")+1)+29","v":"2017-08-27"},"2017-08-28","2017-08-29","2017-08-30","2017-08-31","2017-09-01","2017-09-02"]
[]
[null,{"$f":"JoursEtSemaines+DATE(AnnéeCalendrier,8,1)-WEEKDAY(DATE(AnnéeCalendrier,8,1),(DébutSemaine=\"LUNDI\")+1)+36","v":"2017-09-03"},"2017-09-04","NOTES"]

{"sheet":"Septembre","index":8,"n_rows":13,"n_cols":8,"rows_kept":13,"merged":[[12,3,13,3],[12,4,13,7]]}
[null,{"$f":"\"Septembre \"&AnnéeCalendrier","v":"Septembre 2017"}]
[null,{"$f":"IF(DébutSemaine=\"DIMANCHE\", \"DIMANCHE\",\"LUNDI\")","v":"DIMANCHE"},{"$f":"UPPER(TEXT(C3,\"jjjj\"))","v":"LUNDI"},"MARDI","MERCREDI","JEUDI","VENDREDI","SAMEDI"]
[null,{"$f":"JoursEtSemaines+DATE(AnnéeCalendrier,9,1)-WEEKDAY(DATE(AnnéeCalendrier,9,1),(DébutSemaine=\"LUNDI\")+1)+1","v":"2017-08-27"},"2017-08-28","2017-08-29","2017-08-30","2017-08-31","2017-09-01","2017-09-02"]
[]
[null,{"$f":"JoursEtSemaines+DATE(AnnéeCalendrier,9,1)-WEEKDAY(DATE(AnnéeCalendrier,9,1),(DébutSemaine=\"LUNDI\")+1)+8","v":"2017-09-03"},"2017-09-04","2017-09-05","2017-09-06","2017-09-07","2017-09-08","2017-09-09"]
[]
[null,{"$f":"JoursEtSemaines+DATE(AnnéeCalendrier,9,1)-WEEKDAY(DATE(AnnéeCalendrier,9,1),(DébutSemaine=\"LUNDI\")+1)+15","v":"2017-09-10"},"2017-09-11","2017-09-12","2017-09-13","2017-09-14","2017-09-15","2017-09-16"]
[]
[null,{"$f":"JoursEtSemaines+DATE(AnnéeCalendrier,9,1)-WEEKDAY(DATE(AnnéeCalendrier,9,1),(DébutSemaine=\"LUNDI\")+1)+22","v":"2017-09-17"},"2017-09-18","2017-09-19","2017-09-20","2017-09-21","2017-09-22","2017-09-23"]
[]
[null,{"$f":"JoursEtSemaines+DATE(AnnéeCalendrier,9,1)-WEEKDAY(DATE(AnnéeCalendrier,9,1),(DébutSemaine=\"LUNDI\")+1)+29","v":"2017-09-24"},"2017-09-25","2017-09-26","2017-09-27","2017-09-28","2017-09-29","2017-09-30"]
[]
[null,{"$f":"JoursEtSemaines+DATE(AnnéeCalendrier,9,1)-WEEKDAY(DATE(AnnéeCalendrier,9,1),(DébutSemaine=\"LUNDI\")+1)+36","v":"2017-10-01"},"2017-10-02","NOTES"]

{"sheet":"Octobre","index":9,"n_rows":13,"n_cols":8,"rows_kept":13,"merged":[[12,3,13,3],[12,4,13,7]]}
[null,{"$f":"\"Octobre \"&AnnéeCalendrier","v":"Octobre 2017"}]
[null,{"$f":"IF(DébutSemaine=\"DIMANCHE\", \"DIMANCHE\",\"LUNDI\")","v":"DIMANCHE"},{"$f":"UPPER(TEXT(C3,\"jjjj\"))","v":"LUNDI"},{"$f":"UPPER(TEXT(D3,\"jjjj\"))","v":"MARDI"},"MERCREDI","JEUDI","VENDREDI","SAMEDI"]
[null,{"$f":"JoursEtSemaines+DATE(AnnéeCalendrier,10,1)-WEEKDAY(DATE(AnnéeCalendrier,10,1),(DébutSemaine=\"LUNDI\")+1)+1","v":"2017-10-01"},"2017-10-02","2017-10-03","2017-10-04","2017-10-05","2017-10-06","2017-10-07"]
[]
[null,{"$f":"JoursEtSemaines+DATE(AnnéeCalendrier,10,1)-WEEKDAY(DATE(AnnéeCalendrier,10,1),(DébutSemaine=\"LUNDI\")+1)+8","v":"2017-10-08"},"2017-10-09","2017-10-10","2017-10-11","2017-10-12","2017-10-13","2017-10-14"]
[]
[null,{"$f":"JoursEtSemaines+DATE(AnnéeCalendrier,10,1)-WEEKDAY(DATE(AnnéeCalendrier,10,1),(DébutSemaine=\"LUNDI\")+1)+15","v":"2017-10-15"},"2017-10-16","2017-10-17","2017-10-18","2017-10-19","2017-10-20","2017-10-21"]
[]
[null,{"$f":"JoursEtSemaines+DATE(AnnéeCalendrier,10,1)-WEEKDAY(DATE(AnnéeCalendrier,10,1),(DébutSemaine=\"LUNDI\")+1)+22","v":"2017-10-22"},"2017-10-23","2017-10-24","2017-10-25","2017-10-26","2017-10-27","2017-10-28"]
[]
[null,{"$f":"JoursEtSemaines+DATE(AnnéeCalendrier,10,1)-WEEKDAY(DATE(AnnéeCalendrier,10,1),(DébutSemaine=\"LUNDI\")+1)+29","v":"2017-10-29"},"2017-10-30","2017-10-31","2017-11-01","2017-11-02","2017-11-03","2017-11-04"]
[]
[null,{"$f":"JoursEtSemaines+DATE(AnnéeCalendrier,10,1)-WEEKDAY(DATE(AnnéeCalendrier,10,1),(DébutSemaine=\"LUNDI\")+1)+36","v":"2017-11-05"},"2017-11-06","NOTES"]

{"sheet":"Novembre","index":10,"n_rows":13,"n_cols":8,"rows_kept":13,"merged":[[12,3,13,3],[12,4,13,7]]}
[null,{"$f":"\"Novembre \"&AnnéeCalendrier","v":"Novembre 2017"}]
[null,{"$f":"IF(DébutSemaine=\"DIMANCHE\", \"DIMANCHE\",\"LUNDI\")","v":"DIMANCHE"},{"$f":"UPPER(TEXT(C3,\"jjjj\"))","v":"LUNDI"},"MARDI","MERCREDI","JEUDI","VENDREDI","SAMEDI"]
[null,{"$f":"JoursEtSemaines+DATE(AnnéeCalendrier,11,1)-WEEKDAY(DATE(AnnéeCalendrier,11,1),(DébutSemaine=\"LUNDI\")+1)+1","v":"2017-10-29"},"2017-10-30","2017-10-31","2017-11-01","2017-11-02","2017-11-03","2017-11-04"]
[]
[null,{"$f":"JoursEtSemaines+DATE(AnnéeCalendrier,11,1)-WEEKDAY(DATE(AnnéeCalendrier,11,1),(DébutSemaine=\"LUNDI\")+1)+8","v":"2017-11-05"},"2017-11-06","2017-11-07","2017-11-08","2017-11-09","2017-11-10","2017-11-11"]
[]
[null,{"$f":"JoursEtSemaines+DATE(AnnéeCalendrier,11,1)-WEEKDAY(DATE(AnnéeCalendrier,11,1),(DébutSemaine=\"LUNDI\")+1)+15","v":"2017-11-12"},"2017-11-13","2017-11-14","2017-11-15","2017-11-16","2017-11-17","2017-11-18"]
[]
[null,{"$f":"JoursEtSemaines+DATE(AnnéeCalendrier,11,1)-WEEKDAY(DATE(AnnéeCalendrier,11,1),(DébutSemaine=\"LUNDI\")+1)+22","v":"2017-11-19"},"2017-11-20","2017-11-21","2017-11-22","2017-11-23","2017-11-24","2017-11-25"]
[]
[null,{"$f":"JoursEtSemaines+DATE(AnnéeCalendrier,11,1)-WEEKDAY(DATE(AnnéeCalendrier,11,1),(DébutSemaine=\"LUNDI\")+1)+29","v":"2017-11-26"},"2017-11-27","2017-11-28","2017-11-29","2017-11-30","2017-12-01","2017-12-02"]
[]
[null,{"$f":"JoursEtSemaines+DATE(AnnéeCalendrier,11,1)-WEEKDAY(DATE(AnnéeCalendrier,11,1),(DébutSemaine=\"LUNDI\")+1)+36","v":"2017-12-03"},"2017-12-04","NOTES"]

{"sheet":"Décembre","index":11,"n_rows":13,"n_cols":8,"rows_kept":13,"merged":[[12,3,13,3],[12,4,13,7]]}
[null,{"$f":"\"Décembre \"&AnnéeCalendrier","v":"Décembre 2017"}]
[null,{"$f":"IF(DébutSemaine=\"DIMANCHE\", \"DIMANCHE\",\"LUNDI\")","v":"DIMANCHE"},{"$f":"UPPER(TEXT(C3,\"jjjj\"))","v":"LUNDI"},"MARDI","MERCREDI","JEUDI","VENDREDI","SAMEDI"]
[null,{"$f":"JoursEtSemaines+DATE(AnnéeCalendrier,12,1)-WEEKDAY(DATE(AnnéeCalendrier,12,1),(DébutSemaine=\"LUNDI\")+1)+1","v":"2017-11-26"},"2017-11-27","2017-11-28","2017-11-29","2017-11-30","2017-12-01","2017-12-02"]
[]
[null,{"$f":"JoursEtSemaines+DATE(AnnéeCalendrier,12,1)-WEEKDAY(DATE(AnnéeCalendrier,12,1),(DébutSemaine=\"LUNDI\")+1)+8","v":"2017-12-03"},"2017-12-04","2017-12-05","2017-12-06","2017-12-07","2017-12-08","2017-12-09"]
[]
[null,{"$f":"JoursEtSemaines+DATE(AnnéeCalendrier,12,1)-WEEKDAY(DATE(AnnéeCalendrier,12,1),(DébutSemaine=\"LUNDI\")+1)+15","v":"2017-12-10"},"2017-12-11","2017-12-12","2017-12-13","2017-12-14","2017-12-15","2017-12-16"]
[]
[null,{"$f":"JoursEtSemaines+DATE(AnnéeCalendrier,12,1)-WEEKDAY(DATE(AnnéeCalendrier,12,1),(DébutSemaine=\"LUNDI\")+1)+22","v":"2017-12-17"},"2017-12-18","2017-12-19","2017-12-20","2017-12-21","2017-12-22","2017-12-23"]
[]
[null,{"$f":"JoursEtSemaines+DATE(AnnéeCalendrier,12,1)-WEEKDAY(DATE(AnnéeCalendrier,12,1),(DébutSemaine=\"LUNDI\")+1)+29","v":"2017-12-24"},"2017-12-25","2017-12-26","2017-12-27","2017-12-28","2017-12-29","2017-12-30"]
[]
[null,{"$f":"JoursEtSemaines+DATE(AnnéeCalendrier,12,1)-WEEKDAY(DATE(AnnéeCalendrier,12,1),(DébutSemaine=\"LUNDI\")+1)+36","v":"2017-12-31"},"2018-01-01","NOTES"]