{"text_format":"3","workbook":"xlsx","n_sheets":3,"sheets":["Début","Budget étudiant mensuel","chart_calcs"],"not_rendered":{"charts":4,"defined_names":19},"read":"whole","date_system":"1900"}

{"sheet":"Début","index":0,"n_rows":7,"n_cols":2,"rows_kept":7}
[null,"À PROPOS DE CE MODÈLE"]
[null,"La feuille de calcul de Budget mensuel universitaire permet d’effectuer le suivi des revenus et des dépenses du flux de trésorerie."]
[null,"Entrez les Revenus mensuels et les Dépenses pour calculer le Total des revenus et dépenses."]
[null,"Le flux de trésorerie est automatiquement calculé et le Diagramme de flux de trésorerie est mis à jour pour vous."]
[null,"Sélectionnez le curseur pour obtenir des diagrammes de revenus, de dépenses et de flux de trésorerie pour un mois et une année."]
[null,"Remarque : "]
[null,"Des instructions supplémentaires sont disponibles dans la colonne A de la feuille de calcul. Ce texte a été intentionnellement masqué. Pour supprimer le texte, sélectionnez la colonne A et choisissez SUPPRIMER. Pour afficher le texte, sélectionnez la colonne A et changez la couleur de la police."]

{"sheet":"Budget étudiant mensuel","index":1,"n_rows":72,"n_cols":16,"rows_kept":72,"merged":[[5,1,14,3],[5,4,14,11],[5,12,13,15],[15,1,19,15],[20,1,21,15]]}
["Créez un Budget mensuel universitaire dans cette feuille de calcul. Le titre de cette feuille de calcul se trouve dans la cellule de droite et la cellule B1. Des instructions utiles sur l’utilisation de cette feuille de calcul sont disponibles dans les cellules de cette colonne. L’instruction suivante figure dans la cellule A4.","Budget étudiant mensuel"]
[]
[]
["L’étiquette Revenu figure dans la cellule de droite, l’étiquette Dépenses dans la cellule E4, et l’étiquette Liquidités dans la cellule M4.",{"$f":"chart_calcs!$D$6","v":"revenus de Année:"},null,null,{"$f":"chart_calcs!$D$7","v":"dépenses de Année:"},{"$nulls":7},{"$f":"chart_calcs!$D$8","v":"trésorerie de Année:"}]
["Les Revenus sont automatiquement mis à jour dans la cellule située à droite, Dépenses dans la cellule E5 et Flux de trésorerie dans M5.",{"$f":"\" \"&chart_calcs!$F$6","v":{"$error":"#VALUE!"}},null,null,{"$f":"\" \"&chart_calcs!$F$7","v":{"$error":"#VALUE!"}},{"$nulls":7},{"$f":"\" \"&chart_calcs!$F$8","v":" 169$"}]
["Le graphique en anneau présentant la synthèse de revenu dans la cellule située à droite, la synthèse de dépenses dans la cellule E6 et le graphique à barres montrant les valeurs positives et négatives du flux de trésorerie dans la cellule M6 sont mis à jour automatiquement. L’instruction suivante figure dans la cellule A17.","Graphique en anneau affichant un résumé des revenus pour le mois ou année de cette cellule.",null,null,"Graphique en anneau affichant un résumé des dépenses pour le mois ou année de cette cellule.",{"$nulls":7},"Graphique en barres affichant un résumé des revenus pour le mois ou année de cette cellule."]
{"$rows_empty":9}
[null,"Graphique en courbes affichant un résumé des revenus pour le mois ou année de cette cellule."]
["Un graphique en ligne des dépenses figure dans la cellule à droite. L’instruction suivante figure dans la cellule A21."]
[]
[]
[]
["Sélectionnez le curseur sur la droite pour obtenir des données et graphiques mensuels ou annuels de Revenus, Dépenses et Flux de trésorerie. L’instruction suivante figure dans la cellule A25."]
[]
[]
[]
["Sélectionnez Mois dans la cellule à droite. Appuyez sur ALT+FLÈCHE BAS pour accéder aux options, puis sur FLÈCHE BAS et ENTRÉE pour opérer une sélection.","JANV"]
["La période sélectionnée est mise à jour automatiquement dans la cellule P26.",{"$nulls":14},{"$f":"PériodeSélectionnée","v":{"$error":"#VALUE!"}}]
["Les étiquettes sont dans cette ligne, l’étiquette de Trésorerie après dépenses mensuelles dans la cellule située à droite, les mois dans les cellules C27 à N27, Année en O27 et augmentation pourcentage en P27.","Trésorerie mensuelle après dépenses",{"$f":"PremierMois","v":{"$error":"#VALUE!"}},{"$f":"MoisSuivant","v":{"$error":"#VALUE!"}},{"$f":"MoisSuivant","v":{"$error":"#VALUE!"}},{"$f":"MoisSuivant","v":{"$error":"#VALUE!"}},{"$f":"MoisSuivant","v":{"$error":"#VALUE!"}},{"$f":"MoisSuivant","v":{"$error":"#VALUE!"}},{"$f":"MoisSuivant","v":{"$error":"#VALUE!"}},{"$f":"MoisSuivant","v":{"$error":"#VALUE!"}},{"$f":"MoisSuivant","v":{"$error":"#VALUE!"}},{"$f":"MoisSuivant","v":{"$error":"#VALUE!"}},{"$f":"MoisSuivant","v":{"$error":"#VALUE!"}},{"$f":"MoisSuivant","v":{"$error":"#VALUE!"}},"ANNÉE  ","% INC "]
["L’étiquette Flux de trésorerie se trouve dans la cellule de droite. Le flux de trésorerie pour chaque mois est automatiquement calculé dans les cellules C28 à N28, Montant annuel dans O28, et Augmentation pourcentage dans P28. Sparkline est mis à jour dans la cellule Q28.","Flux de trésorerie",{"$f":"C37-C72","v":169},69,192,199,204,{"v":-771,"d":"-771 "},124,154,{"v":-721,"d":"-721 "},109,34,{"v":-61,"d":"-61 "},{"$f":"SUM(C28:N28)","v":{"v":-299,"d":"-299 "}},{"$f":"INDEX($C28:$O28,,_xlfn.SINGLE(ColonnePériodeSélectionnée))/_xlfn.SINGLE(INDEX($C$37:$O$37,,_xlfn.SINGLE(ColonnePériodeSélectionnée)))","v":{"$error":"#NAME?"}}]
["L’étiquette Flux de trésorerie cumulatif se trouve dans la cellule de droite. Le flux de trésorerie cumulatif pour chaque mois est automatiquement calculé dans les cellules C29 à N29, Montant annuel dans O29, et Augmentation pourcentage dans P29. Sparkline est mis à jour dans la cellule Q29. L’instruction suivante figure dans la cellule A31.","Flux de trésorerie cumulé",{"$f":"SUM($C$28:C$28)","v":169},{"$f":"SUM($C$28:D$28)","v":238},{"$f":"SUM($C$28:E$28)","v":430},{"$f":"SUM($C$28:F$28)","v":629},{"$f":"SUM($C$28:G$28)","v":833},{"$f":"SUM($C$28:H$28)","v":62},{"$f":"SUM($C$28:I$28)","v":186},{"$f":"SUM($C$28:J$28)","v":340},{"$f":"SUM($C$28:K$28)","v":{"v":-381,"d":"-381 "}},{"$f":"SUM($C$28:L$28)","v":{"v":-272,"d":"-272 "}},{"$f":"SUM($C$28:M$28)","v":{"v":-238,"d":"-238 "}},{"$f":"SUM($C$28:N$28)","v":{"v":-299,"d":"-299 "}}]
[]
["L’étiquette Revenu mensuel est dans la cellule à droite, mois dans les cellules C31 à N31, année en O31, et pourcentage augmentation dans P31. Entrez les éléments Revenu mensuel dans les cellules B32 à B36 et Montants mensuels dans les cellules C32 à N36. Revenu annuel est calculé dans les cellules O32 à O36, augmentation du pourcentage dans les cellules P32 à P36. L’instruction suivante figure dans la cellule A37.","REVENUS MENSUELS",{"$f":"PremierMois","v":{"$error":"#VALUE!"}},{"$f":"MoisSuivant","v":{"$error":"#VALUE!"}},{"$f":"MoisSuivant","v":{"$error":"#VALUE!"}},{"$f":"MoisSuivant","v":{"$error":"#VALUE!"}},{"$f":"MoisSuivant","v":{"$error":"#VALUE!"}},{"$f":"MoisSuivant","v":{"$error":"#VALUE!"}},{"$f":"MoisSuivant","v":{"$error":"#VALUE!"}},{"$f":"MoisSuivant","v":{"$error":"#VALUE!"}},{"$f":"MoisSuivant","v":{"$error":"#VALUE!"}},{"$f":"MoisSuivant","v":{"$error":"#VALUE!"}},{"$f":"MoisSuivant","v":{"$error":"#VALUE!"}},{"$f":"MoisSuivant","v":{"$error":"#VALUE!"}},"ANNÉE  ","% INC "]
[null,"Aide financière (subventions, bourses, emprunts) payée pour vous",0,0,750,750,750,750,750,750,750,750,750,750,{"$f":"SUM(C32:N32)","v":{"v":7500,"d":"7,500"}},{"$f":"INDEX($C32:$O32,,_xlfn.SINGLE(ColonnePériodeSélectionnée))/_xlfn.SINGLE(INDEX($C$37:$O$37,,_xlfn.SINGLE(ColonnePériodeSélectionnée)))","v":{"$error":"#NAME?"}}]
[null,"Salaires après impôts à partir d’un travail",450,450,450,450,450,450,450,450,550,350,350,350,{"v":5200,"d":"5,200"},{"$f":"INDEX($C33:$O33,,_xlfn.SINGLE(ColonnePériodeSélectionnée))/_xlfn.SINGLE(INDEX($C$37:$O$37,,_xlfn.SINGLE(ColonnePériodeSélectionnée)))","v":{"$error":"#NAME?"}}]
[null,"Aide financière de famille",200,200,{"v":1000,"d":"1,000"},350,350,350,350,350,350,350,350,350,{"v":4550,"d":"4,550"},{"$f":"INDEX($C34:$O34,,_xlfn.SINGLE(ColonnePériodeSélectionnée))/_xlfn.SINGLE(INDEX($C$37:$O$37,,_xlfn.SINGLE(ColonnePériodeSélectionnée)))","v":{"$error":"#NAME?"}}]
[null,"Retraits d’épargne",500,350,150,0,0,0,0,0,0,0,0,0,{"v":1000,"d":"1,000"},{"$f":"INDEX($C35:$O35,,_xlfn.SINGLE(ColonnePériodeSélectionnée))/_xlfn.SINGLE(INDEX($C$37:$O$37,,_xlfn.SINGLE(ColonnePériodeSélectionnée)))","v":{"$error":"#NAME?"}}]
[null,"Autres (prise en charge des enfants, assistance public, cadeaux, etc.)",75,75,75,75,75,75,75,75,75,75,75,75,900,{"$f":"INDEX($C36:$O36,,_xlfn.SINGLE(ColonnePériodeSélectionnée))/_xlfn.SINGLE(INDEX($C$37:$O$37,,_xlfn.SINGLE(ColonnePériodeSélectionnée)))","v":{"$error":"#NAME?"}}]
["L’étiquette Total des revenus se trouve dans la cellule de droite. Le Total des revenus pour chaque mois est automatiquement calculé dans les cellules C37 à N37, Montant annuel dans O37, et Augmentation pourcentage dans P37. Sparkline est mis à jour dans la cellule Q37. L’instruction suivante figure dans la cellule A39.","TOTAL DES REVENUS",{"$f":"SUM(C32:C36)","v":{"v":1225,"d":"1,225"}},{"v":1075,"d":"1,075"},{"v":2425,"d":"2,425"},{"v":1625,"d":"1,625"},{"v":1625,"d":"1,625"},{"v":1625,"d":"1,625"},{"v":1625,"d":"1,625"},{"v":1625,"d":"1,625"},{"v":1725,"d":"1,725"},{"v":1525,"d":"1,525"},{"v":1525,"d":"1,525"},{"v":1525,"d":"1,525"},{"v":19150,"d":"19,150"},{"$f":"INDEX($C37:$O37,,_xlfn.SINGLE(ColonnePériodeSélectionnée))/_xlfn.SINGLE(INDEX($C$37:$O$37,,_xlfn.SINGLE(ColonnePériodeSélectionnée)))","v":{"$error":"#NAME?"}}]
[]
["L’étiquette de dépenses mensuelles est dans la cellule à droite, mois dans les cellules C39 à N39, année en O39, et augmentation du pourcentage dans P39.","DÉPENSES MENSUELLES",{"$f":"PremierMois","v":{"$error":"#VALUE!"}},{"$f":"MoisSuivant","v":{"$error":"#VALUE!"}},{"$f":"MoisSuivant","v":{"$error":"#VALUE!"}},{"$f":"MoisSuivant","v":{"$error":"#VALUE!"}},{"$f":"MoisSuivant","v":{"$error":"#VALUE!"}},{"$f":"MoisSuivant","v":{"$error":"#VALUE!"}},{"$f":"MoisSuivant","v":{"$error":"#VALUE!"}},{"$f":"MoisSuivant","v":{"$error":"#VALUE!"}},{"$f":"MoisSuivant","v":{"$error":"#VALUE!"}},{"$f":"MoisSuivant","v":{"$error":"#VALUE!"}},{"$f":"MoisSuivant","v":{"$error":"#VALUE!"}},{"$f":"MoisSuivant","v":{"$error":"#VALUE!"}},"ANNÉE  ","% INC "]
["Entrez ou modifiez l’élément de dépenses dans la cellule située à droite, puis montants mensuels dans les cellules C40 à N43. Le revenu annuel est calculé dans les cellules O40 à O43, augmentation du pourcentage dans les cellules P40 à P43. Sparkline est mis à jour dans la cellule Q40. L’instruction suivante figure dans la cellule A45.","Logement et couvert",{"$f":"SUM(C41:C43)","v":565},565,565,565,565,565,565,565,565,565,565,565,{"$f":"SUM(C40:N40)","v":{"v":6780,"d":"6,780"}},{"$f":"INDEX($C40:$O40,,_xlfn.SINGLE(ColonnePériodeSélectionnée))/_xlfn.SINGLE(INDEX($C$72:$O$72,,_xlfn.SINGLE(ColonnePériodeSélectionnée)))","v":{"$error":"#NAME?"}}]
[null,null,315,315,315,315,315,315,315,315,315,315,315,315,{"$f":"SUM(C41:N41)","v":{"v":3780,"d":"3,780"}},{"$f":"INDEX($C41:$O41,,_xlfn.SINGLE(ColonnePériodeSélectionnée))/_xlfn.SINGLE(INDEX($C$72:$O$72,,_xlfn.SINGLE(ColonnePériodeSélectionnée)))","v":{"$error":"#NAME?"}}]
[null,null,200,200,200,200,200,200,200,200,200,200,200,200,{"$f":"SUM(C42:N42)","v":{"v":2400,"d":"2,400"}},{"$f":"INDEX($C42:$O42,,_xlfn.SINGLE(ColonnePériodeSélectionnée))/_xlfn.SINGLE(INDEX($C$72:$O$72,,_xlfn.SINGLE(ColonnePériodeSélectionnée)))","v":{"$error":"#NAME?"}}]
[null,null,50,50,50,50,50,50,50,50,50,50,50,50,{"$f":"SUM(C43:N43)","v":600},{"$f":"INDEX($C43:$O43,,_xlfn.SINGLE(ColonnePériodeSélectionnée))/_xlfn.SINGLE(INDEX($C$72:$O$72,,_xlfn.SINGLE(ColonnePériodeSélectionnée)))","v":{"$error":"#NAME?"}}]
[]
["Entrez ou modifiez l’élément de dépenses dans la cellule située à droite, puis montants mensuels dans les cellules C45 à N47. Le revenu annuel est calculé dans les cellules O45 à O47, augmentation du pourcentage dans les cellules P45 à P47. Sparkline est mis à jour dans la cellule Q45. L’instruction suivante figure dans la cellule A49.","Frais de scolarité",{"$f":"SUM(C46:C47)","v":0},0,750,0,0,650,0,0,650,0,0,0,{"$f":"SUM(C45:N45)","v":{"v":2050,"d":"2,050"}},{"$f":"INDEX($C45:$O45,,_xlfn.SINGLE(ColonnePériodeSélectionnée))/_xlfn.SINGLE(INDEX($C$72:$O$72,,_xlfn.SINGLE(ColonnePériodeSélectionnée)))","v":{"$error":"#NAME?"}}]
[null,null,0,0,500,0,0,500,0,0,500,0,0,0,{"$f":"SUM(C46:N46)","v":{"v":1500,"d":"1,500"}},{"$f":"INDEX($C46:$O46,,_xlfn.SINGLE(ColonnePériodeSélectionnée))/_xlfn.SINGLE(INDEX($C$72:$O$72,,_xlfn.SINGLE(ColonnePériodeSélectionnée)))","v":{"$error":"#NAME?"}}]
[null,null,0,0,250,0,0,150,0,0,150,0,0,0,{"$f":"SUM(C47:N47)","v":550},{"$f":"INDEX($C47:$O47,,_xlfn.SINGLE(ColonnePériodeSélectionnée))/_xlfn.SINGLE(INDEX($C$72:$O$72,,_xlfn.SINGLE(ColonnePériodeSélectionnée)))","v":{"$error":"#NAME?"}}]
[]
["Entrez ou modifiez l’élément de dépenses dans la cellule située à droite, puis montants mensuels dans les cellules C49 à N51. Le revenu annuel est calculé dans les cellules O49 à O51, augmentation du pourcentage dans les cellules P49 à P51. Sparkline est mis à jour dans la cellule Q49. L’instruction suivante figure dans la cellule A53.","Livres et fournitures",{"$f":"SUM(C50:C51)","v":0},0,325,20,20,325,10,10,400,15,15,15,{"$f":"SUM(C49:N49)","v":{"v":1155,"d":"1,155"}},{"$f":"INDEX($C49:$O49,,_xlfn.SINGLE(ColonnePériodeSélectionnée))/_xlfn.SINGLE(INDEX($C$72:$O$72,,_xlfn.SINGLE(ColonnePériodeSélectionnée)))","v":{"$error":"#NAME?"}}]
[null,null,0,0,225,0,0,275,0,0,325,0,0,0,{"$f":"SUM(C50:N50)","v":825},{"$f":"INDEX($C50:$O50,,_xlfn.SINGLE(ColonnePériodeSélectionnée))/_xlfn.SINGLE(INDEX($C$72:$O$72,,_xlfn.SINGLE(ColonnePériodeSélectionnée)))","v":{"$error":"#NAME?"}}]
[null,null,0,0,100,20,20,50,10,10,75,15,15,15,{"$f":"SUM(C51:N51)","v":330},{"$f":"INDEX($C51:$O51,,_xlfn.SINGLE(ColonnePériodeSélectionnée))/_xlfn.SINGLE(INDEX($C$72:$O$72,,_xlfn.SINGLE(ColonnePériodeSélectionnée)))","v":{"$error":"#NAME?"}}]
[]
["Entrez ou modifiez l’élément de dépenses dans la cellule située à droite, puis montants mensuels dans les cellules C53 à N57. Le revenu annuel est calculé dans les cellules O53 à O57, augmentation du pourcentage dans les cellules P53 à P57. Sparkline est mis à jour dans la cellule Q53. L’instruction suivante figure dans la cellule A59.","Transport",{"$f":"SUM(C54:C57)","v":224},174,174,219,174,174,274,219,174,174,224,269,{"$f":"SUM(C53:N53)","v":{"v":2473,"d":"2,473"}},{"$f":"INDEX($C53:$O53,,_xlfn.SINGLE(ColonnePériodeSélectionnée))/_xlfn.SINGLE(INDEX($C$72:$O$72,,_xlfn.SINGLE(ColonnePériodeSélectionnée)))","v":{"$error":"#NAME?"}}]
[null,null,30,30,30,75,30,30,30,75,30,30,30,75,{"$f":"SUM(C54:N54)","v":495},{"$f":"INDEX($C54:$O54,,_xlfn.SINGLE(ColonnePériodeSélectionnée))/_xlfn.SINGLE(INDEX($C$72:$O$72,,_xlfn.SINGLE(ColonnePériodeSélectionnée)))","v":{"$error":"#NAME?"}}]
[null,null,129,129,129,129,129,129,129,129,129,129,129,129,{"$f":"SUM(C55:N55)","v":{"v":1548,"d":"1,548"}},{"$f":"INDEX($C55:$O55,,_xlfn.SINGLE(ColonnePériodeSélectionnée))/_xlfn.SINGLE(INDEX($C$72:$O$72,,_xlfn.SINGLE(ColonnePériodeSélectionnée)))","v":{"$error":"#NAME?"}}]
[null,null,15,15,15,15,15,15,15,15,15,15,15,15,{"$f":"SUM(C56:N56)","v":180},{"$f":"INDEX($C56:$O56,,_xlfn.SINGLE(ColonnePériodeSélectionnée))/_xlfn.SINGLE(INDEX($C$72:$O$72,,_xlfn.SINGLE(ColonnePériodeSélectionnée)))","v":{"$error":"#NAME?"}}]
[null,null,50,0,0,0,0,0,100,0,0,0,50,50,{"$f":"SUM(C57:N57)","v":250},{"$f":"INDEX($C57:$O57,,_xlfn.SINGLE(ColonnePériodeSélectionnée))/_xlfn.SINGLE(INDEX($C$72:$O$72,,_xlfn.SINGLE(ColonnePériodeSélectionnée)))","v":{"$error":"#NAME?"}}]
[]
["Entrez ou modifiez l’élément de dépenses dans la cellule située à droite, puis montants mensuels dans les cellules C59 à N65. Le revenu annuel est calculé dans les cellules O59 à O65, augmentation du pourcentage dans les cellules P59 à P65. Sparkline est mis à jour dans la cellule Q59. L’instruction suivante figure dans la cellule A67.","Privé",{"$f":"SUM(C60:C65)","v":69},69,169,369,419,444,419,419,394,394,419,469,{"$f":"SUM(C59:N59)","v":{"v":4053,"d":"4,053"}},{"$f":"INDEX($C59:$O59,,_xlfn.SINGLE(ColonnePériodeSélectionnée))/_xlfn.SINGLE(INDEX($C$72:$O$72,,_xlfn.SINGLE(ColonnePériodeSélectionnée)))","v":{"$error":"#NAME?"}}]
[null,null,0,0,0,50,100,100,100,100,75,75,100,100,800,{"$f":"INDEX($C60:$O60,,_xlfn.SINGLE(ColonnePériodeSélectionnée))/_xlfn.SINGLE(INDEX($C$72:$O$72,,_xlfn.SINGLE(ColonnePériodeSélectionnée)))","v":{"$error":"#NAME?"}}]
[null,null,69,69,69,69,69,69,69,69,69,69,69,69,828,{"$f":"INDEX($C61:$O61,,_xlfn.SINGLE(ColonnePériodeSélectionnée))/_xlfn.SINGLE(INDEX($C$72:$O$72,,_xlfn.SINGLE(ColonnePériodeSélectionnée)))","v":{"$error":"#NAME?"}}]
[null,null,0,0,0,0,0,25,0,0,0,0,0,50,75,{"$f":"INDEX($C62:$O62,,_xlfn.SINGLE(ColonnePériodeSélectionnée))/_xlfn.SINGLE(INDEX($C$72:$O$72,,_xlfn.SINGLE(ColonnePériodeSélectionnée)))","v":{"$error":"#NAME?"}}]
[null,null,0,0,100,100,100,100,100,100,100,100,100,100,{"v":1000,"d":"1,000"},{"$f":"INDEX($C63:$O63,,_xlfn.SINGLE(ColonnePériodeSélectionnée))/_xlfn.SINGLE(INDEX($C$72:$O$72,,_xlfn.SINGLE(ColonnePériodeSélectionnée)))","v":{"$error":"#NAME?"}}]
[null,null,0,0,0,50,50,50,50,50,50,50,50,50,450,{"$f":"INDEX($C64:$O64,,_xlfn.SINGLE(ColonnePériodeSélectionnée))/_xlfn.SINGLE(INDEX($C$72:$O$72,,_xlfn.SINGLE(ColonnePériodeSélectionnée)))","v":{"$error":"#NAME?"}}]
[null,null,0,0,0,100,100,100,100,100,100,100,100,100,900,{"$f":"INDEX($C65:$O65,,_xlfn.SINGLE(ColonnePériodeSélectionnée))/_xlfn.SINGLE(INDEX($C$72:$O$72,,_xlfn.SINGLE(ColonnePériodeSélectionnée)))","v":{"$error":"#NAME?"}}]
[]
["Entrez ou modifiez l’élément de dépenses dans la cellule située à droite, puis montants mensuels dans les cellules C67 à N70. Le revenu annuel est calculé dans les cellules O67 à O70, augmentation du pourcentage dans les cellules P67 à P70. Sparkline est mis à jour dans la cellule Q67. L’instruction suivante figure dans la cellule A72.","Autres frais",{"$f":"SUM(C68:C70)","v":198},{"$f":"SUM(D68:D70)","v":198},250,253,243,238,233,258,263,268,268,268,{"$f":"SUM(C67:N67)","v":{"v":2938,"d":"2,938"}},{"$f":"INDEX($C67:$O67,,_xlfn.SINGLE(ColonnePériodeSélectionnée))/_xlfn.SINGLE(INDEX($C$72:$O$72,,_xlfn.SINGLE(ColonnePériodeSélectionnée)))","v":{"$error":"#NAME?"}}]
[null,null,123,123,123,123,123,123,123,123,123,123,123,123,{"$f":"SUM(C68:N68)","v":{"v":1476,"d":"1,476"}},{"$f":"INDEX($C68:$O68,,_xlfn.SINGLE(ColonnePériodeSélectionnée))/_xlfn.SINGLE(INDEX($C$72:$O$72,,_xlfn.SINGLE(ColonnePériodeSélectionnée)))","v":{"$error":"#NAME?"}}]
{"$rows_left_out":5}
{"sheet":"chart_calcs","index":2,"n_rows":23,"n_cols":16,"rows_kept":23,"hidden":true}
["*** Cette feuille doit rester masquée ***"]
[]
[{"$nulls":3},{"$f":"IFERROR(LOWER(TEXT(VALUE(PériodeSélectionnée&\" 1\"),\"mmmm\")),\"Année\")","v":"Année"}]
[]
[{"$nulls":3},"Titres de graphique dynamique"]
[{"$nulls":3},{"$f":"\"revenus de \"&D3&\":\"","v":"revenus de Année:"},null,{"$f":"TEXT(INDEX('Budget étudiant mensuel'!$C$37:$O$37,,ColonnePériodeSélectionnée),\"# ###$\")","v":{"$error":"#VALUE!"}}]
[{"$nulls":3},{"$f":"\"dépenses de \"&D3&\":\"","v":"dépenses de Année:"},null,{"$f":"TEXT(INDEX('Budget étudiant mensuel'!$C$72:$O$72,,ColonnePériodeSélectionnée),\"# ###$\")","v":{"$error":"#VALUE!"}}]
[{"$nulls":3},{"$f":"\"trésorerie de \"&D3&\":\"","v":"trésorerie de Année:"},{"$f":"INDEX('Budget étudiant mensuel'!C28:O28,BarreDéfilementValeur)","v":169},{"$f":"TEXT(E8,\"# ###$\")","v":"169$"}]
[]
[]
[]
[{"$nulls":3},{"$f":"LOWER('Budget étudiant mensuel'!C27)","v":{"$error":"#VALUE!"}},{"$f":"LOWER('Budget étudiant mensuel'!D27)","v":{"$error":"#VALUE!"}},{"$f":"LOWER('Budget étudiant mensuel'!E27)","v":{"$error":"#VALUE!"}},{"$f":"LOWER('Budget étudiant mensuel'!F27)","v":{"$error":"#VALUE!"}},{"$f":"LOWER('Budget étudiant mensuel'!G27)","v":{"$error":"#VALUE!"}},{"$f":"LOWER('Budget étudiant mensuel'!H27)","v":{"$error":"#VALUE!"}},{"$f":"LOWER('Budget étudiant mensuel'!I27)","v":{"$error":"#VALUE!"}},{"$f":"LOWER('Budget étudiant mensuel'!J27)","v":{"$error":"#VALUE!"}},{"$f":"LOWER('Budget étudiant mensuel'!K27)","v":{"$error":"#VALUE!"}},{"$f":"LOWER('Budget étudiant mensuel'!L27)","v":{"$error":"#VALUE!"}},{"$f":"LOWER('Budget étudiant mensuel'!M27)","v":{"$error":"#VALUE!"}},{"$f":"LOWER('Budget étudiant mensuel'!N27)","v":{"$error":"#VALUE!"}},{"$f":"LOWER('Budget étudiant mensuel'!O27)","v":"année  "}]
[null,null,"Valeur de barre de défilement : ",1]
[null,null,"Graphique Trésorerie : ",{"$f":"IF(PériodeSélectionnée='Budget étudiant mensuel'!C$31,IF('Budget étudiant mensuel'!$C$28:$O$28>=0,'Budget étudiant mensuel'!$C$28:$O$28,NA()),NA())","v":{"$error":"#VALUE!"}},{"$f":"IF(PériodeSélectionnée='Budget étudiant mensuel'!D$31,IF('Budget étudiant mensuel'!$C$28:$O$28>=0,'Budget étudiant mensuel'!$C$28:$O$28,NA()),NA())","v":{"$error":"#VALUE!"}},{"$f":"IF(PériodeSélectionnée='Budget étudiant mensuel'!E$31,IF('Budget étudiant mensuel'!$C$28:$O$28>=0,'Budget étudiant mensuel'!$C$28:$O$28,NA()),NA())","v":{"$error":"#VALUE!"}},{"$f":"IF(PériodeSélectionnée='Budget étudiant mensuel'!F$31,IF('Budget étudiant mensuel'!$C$28:$O$28>=0,'Budget étudiant mensuel'!$C$28:$O$28,NA()),NA())","v":{"$error":"#VALUE!"}},{"$f":"IF(PériodeSélectionnée='Budget étudiant mensuel'!G$31,IF('Budget étudiant mensuel'!$C$28:$O$28>=0,'Budget étudiant mensuel'!$C$28:$O$28,NA()),NA())","v":{"$error":"#VALUE!"}},{"$f":"IF(PériodeSélectionnée='Budget étudiant mensuel'!H$31,IF('Budget étudiant mensuel'!$C$28:$O$28>=0,'Budget étudiant mensuel'!$C$28:$O$28,NA()),NA())","v":{"$error":"#VALUE!"}},{"$f":"IF(PériodeSélectionnée='Budget étudiant mensuel'!I$31,IF('Budget étudiant mensuel'!$C$28:$O$28>=0,'Budget étudiant mensuel'!$C$28:$O$28,NA()),NA())","v":{"$error":"#VALUE!"}},{"$f":"IF(PériodeSélectionnée='Budget étudiant mensuel'!J$31,IF('Budget étudiant mensuel'!$C$28:$O$28>=0,'Budget étudiant mensuel'!$C$28:$O$28,NA()),NA())","v":{"$error":"#VALUE!"}},{"$f":"IF(PériodeSélectionnée='Budget étudiant mensuel'!K$31,IF('Budget étudiant mensuel'!$C$28:$O$28>=0,'Budget étudiant mensuel'!$C$28:$O$28,NA()),NA())","v":{"$error":"#VALUE!"}},{"$f":"IF(PériodeSélectionnée='Budget étudiant mensuel'!L$31,IF('Budget étudiant mensuel'!$C$28:$O$28>=0,'Budget étudiant mensuel'!$C$28:$O$28,NA()),NA())","v":{"$error":"#VALUE!"}},{"$f":"IF(PériodeSélectionnée='Budget étudiant mensuel'!M$31,IF('Budget étudiant mensuel'!$C$28:$O$28>=0,'Budget étudiant mensuel'!$C$28:$O$28,NA()),NA())","v":{"$error":"#VALUE!"}},{"$f":"IF(PériodeSélectionnée='Budget étudiant mensuel'!N$31,IF('Budget étudiant mensuel'!$C$28:$O$28>=0,'Budget étudiant mensuel'!$C$28:$O$28,NA()),NA())","v":{"$error":"#VALUE!"}},{"$f":"IF(PériodeSélectionnée='Budget étudiant mensuel'!O$31,IF('Budget étudiant mensuel'!$C$28:$O$28>=0,'Budget étudiant mensuel'!$C$28:$O$28,NA()),NA())","v":{"$error":"#VALUE!"}}]
[null,null,"Cumul : ",{"$f":"IF(PériodeSélectionnée='Budget étudiant mensuel'!C$31,IF('Budget étudiant mensuel'!$C$28:$O$28<0,'Budget étudiant mensuel'!$C$28:$O$28,NA()),NA())","v":{"$error":"#VALUE!"}},{"$f":"IF(PériodeSélectionnée='Budget étudiant mensuel'!D$31,IF('Budget étudiant mensuel'!$C$28:$O$28<0,'Budget étudiant mensuel'!$C$28:$O$28,NA()),NA())","v":{"$error":"#VALUE!"}},{"$f":"IF(PériodeSélectionnée='Budget étudiant mensuel'!E$31,IF('Budget étudiant mensuel'!$C$28:$O$28<0,'Budget étudiant mensuel'!$C$28:$O$28,NA()),NA())","v":{"$error":"#VALUE!"}},{"$f":"IF(PériodeSélectionnée='Budget étudiant mensuel'!F$31,IF('Budget étudiant mensuel'!$C$28:$O$28<0,'Budget étudiant mensuel'!$C$28:$O$28,NA()),NA())","v":{"$error":"#VALUE!"}},{"$f":"IF(PériodeSélectionnée='Budget étudiant mensuel'!G$31,IF('Budget étudiant mensuel'!$C$28:$O$28<0,'Budget étudiant mensuel'!$C$28:$O$28,NA()),NA())","v":{"$error":"#VALUE!"}},{"$f":"IF(PériodeSélectionnée='Budget étudiant mensuel'!H$31,IF('Budget étudiant mensuel'!$C$28:$O$28<0,'Budget étudiant mensuel'!$C$28:$O$28,NA()),NA())","v":{"$error":"#VALUE!"}},{"$f":"IF(PériodeSélectionnée='Budget étudiant mensuel'!I$31,IF('Budget étudiant mensuel'!$C$28:$O$28<0,'Budget étudiant mensuel'!$C$28:$O$28,NA()),NA())","v":{"$error":"#VALUE!"}},{"$f":"IF(PériodeSélectionnée='Budget étudiant mensuel'!J$31,IF('Budget étudiant mensuel'!$C$28:$O$28<0,'Budget étudiant mensuel'!$C$28:$O$28,NA()),NA())","v":{"$error":"#VALUE!"}},{"$f":"IF(PériodeSélectionnée='Budget étudiant mensuel'!K$31,IF('Budget étudiant mensuel'!$C$28:$O$28<0,'Budget étudiant mensuel'!$C$28:$O$28,NA()),NA())","v":{"$error":"#VALUE!"}},{"$f":"IF(PériodeSélectionnée='Budget étudiant mensuel'!L$31,IF('Budget étudiant mensuel'!$C$28:$O$28<0,'Budget étudiant mensuel'!$C$28:$O$28,NA()),NA())","v":{"$error":"#VALUE!"}},{"$f":"IF(PériodeSélectionnée='Budget étudiant mensuel'!M$31,IF('Budget étudiant mensuel'!$C$28:$O$28<0,'Budget étudiant mensuel'!$C$28:$O$28,NA()),NA())","v":{"$error":"#VALUE!"}},{"$f":"IF(PériodeSélectionnée='Budget étudiant mensuel'!N$31,IF('Budget étudiant mensuel'!$C$28:$O$28<0,'Budget étudiant mensuel'!$C$28:$O$28,NA()),NA())","v":{"$error":"#VALUE!"}},{"$f":"IF(PériodeSélectionnée='Budget étudiant mensuel'!O$31,IF('Budget étudiant mensuel'!$C$28:$O$28<0,'Budget étudiant mensuel'!$C$28:$O$28,NA()),NA())","v":{"$error":"#VALUE!"}}]
[]
[]
[null,null,"DONNÉES DE GRAPHIQUE REVENUS"]
[null,null,"Aide financière (subventions, bourses, emprunts) payée pour vous",{"$f":"'Budget étudiant mensuel'!P32","v":{"$error":"#NAME?"}}]
[null,null,"Salaires après impôts à partir d’un travail",{"$f":"'Budget étudiant mensuel'!P33","v":{"$error":"#NAME?"}}]
[null,null,"Aide financière de famille",{"$f":"'Budget étudiant mensuel'!P34","v":{"$error":"#NAME?"}}]
[null,null,"Retraits d’épargne",{"$f":"'Budget étudiant mensuel'!P35","v":{"$error":"#NAME?"}}]
[null,null,"Autres (prise en charge des enfants, assistance public, cadeaux, etc.)",{"$f":"'Budget étudiant mensuel'!P36","v":{"$error":"#NAME?"}}]