{"text_format":"3","workbook":"xlsx","n_sheets":4,"sheets":["ALGUS","PROJEKTI PARAMEETRID","PROJEKTI ÜKSIKASJAD","PROJEKTI KOKKUVÕTTED"],"not_rendered":{"charts":2,"defined_names":3,"pivot_tables":1},"read":"whole","date_system":"1900"}

{"sheet":"ALGUS","index":0,"n_rows":7,"n_cols":2,"rows_kept":7}
[null,"TEAVE SELLE MALLI KOHTA"]
[null,"Selle ürituse planeerimise jälgimise töövihiku abil saate jälgida projekti parameetrid, projekti üksikasjad ja projekti kokkuvõtted."]
[null,"Sisestage teave töölehele Projekti parameetrid, et värskendada tulpdiagramme, ning töölehele Projekti üksikasjad. Töölehe Projekti kokkuvõtted PivotTable-liigendtabel värskendatakse automaatselt."]
[null,"Sisestage töölehel Parameetrid ettevõtte nimi ja see värskendatakse automaatselt teistel töölehtedel."]
[null,"Märkus.  "]
[null,"ÜRITUSE PLANEERIMISE JÄLGIMISE töövihiku iga töölehe veerus A on toodud lisajuhised. See tekst on tahtlikult peidetud. Teksti eemaldamiseks valige veerg A ja seejärel käsk KUSTUTA. Teksti kuvamiseks valige veerg A ja muutke seejärel fondi värvi."]
{"$rows_left_out":2}
{"sheet":"PROJEKTI PARAMEETRID","index":1,"n_rows":24,"n_cols":9,"rows_kept":24,"merged":[[23,1,42,3]]}
["Looge sellel töölehel Projekti parameetrid. Paremal asuvasse lahtrisse sisestage ettevõtte nimi. Selle veeru lahtritest leiate kasulikke juhiseid. Liikuge alustamiseks noolega alla.","Ettevõtte nimi"]
["Paremal asuvas lahtris on selle töölehe pealkiri.","Ürituse haldamise projekti jälgur"]
["Paremal asuvas lahtris on konfidentsiaalsusteade.",{"$f":"B1&\"  – konfidentsiaalne\"","v":"Ettevõtte nimi  – konfidentsiaalne"}]
["Näpunäited on paremal asuvas lahtris.","Varjustatud lahtrite väärtus arvutatakse teie eest. Te ei pea neisse midagi sisestama."]
["Sisestage üksikasjad parempoolsest lahtrist algavasse tabelisse Parameetrid. Järgmine juhis on lahtris A12.","PROJEKTI TÜÜP","KONTOHALDUR","PROJEKTIJUHT","STRATEEGIAJUHT","KUJUNDUSSPETSIALIST","ÜRITUSE PERSONAL","HALDUSPERSONAL","Kokku"]
[null,"Ürituse strateegia väljatöötamine",{"v":0.2,"d":"20%"},{"v":0.1,"d":"10%"},{"v":0.6,"d":"60%"},{"v":0,"d":"0%"},{"v":0,"d":"0%"},{"v":0.1,"d":"10%"},{"$f":"SUM(Parameetrid[[#This Row],[KONTOHALDUR]:[HALDUSPERSONAL]])","v":{"v":1,"d":"100%"}}]
{"$rows_left_out":19}
{"sheet":"PROJEKTI ÜKSIKASJAD","index":2,"n_rows":10,"n_cols":23,"rows_kept":10}
["Looge sellel töölehel Projekti üksikasjad. Paremal asuvas lahtris värskendatakse ettevõtte nimi automaatselt. Selle veeru lahtritest leiate kasulikke juhiseid. Liikuge alustamiseks noolega alla.",{"$f":"'PROJEKTI PARAMEETRID'!B1","v":"Ettevõtte nimi"}]
["Paremal asuvas lahtris on selle töölehe pealkiri.","Ürituse haldamise projekti jälgur"]
["Paremal asuvas lahtris on konfidentsiaalsusteade.",{"$f":"'PROJEKTI PARAMEETRID'!B3","v":"Ettevõtte nimi  – konfidentsiaalne"}]
["Sisestage teave parempoolsest lahtrist algavasse tabelisse „Projekti üksikasjad“.\nTEAVE\nTabelisse paremale rea lisamiseks valige tabeli sisuosas paremas allnurgas lahter (mitte kokkuvõtterida) ja vajutage seal, kuhu soovite rea lisada tabeldusklahvi (Tab) või klahvikombinatsiooni Shift+F10 ning valige Lisa | Tabeliread üles/Tabelirida alla.\nVeenduge, et kõik kasutamata read on kustutatud, kuna PivotTable-liigendtabel PROJEKTI KOKKUVÕTTED kasutab kõiki tabeli lahtreid ning annab vastasel korral vigaseid tulemeid.","PROJEKTI NIMI","PROJEKTI TÜÜP","HINNANGULINE ALGUSAEG","HINNANGULINE LÕPPAEG","TEGELIK ALGUSAEG","TEGELIK LÕPPAEG","HINNANGULINE TÖÖ MAHT","TEGELIK TÖÖ MAHT","HINNANGULINE KESTUS","TEGELIK KESTUS","KONTOHALDUR","PROJEKTIJUHT","STRATEEGIAJUHT","KUJUNDUSSPETSIALIST","ÜRITUSE PERSONAL","HALDUSPERSONAL","KONTOHALDUR ","PROJEKTIJUHT ","STRATEEGIAJUHT ","KUJUNDUSSPETSIALIST ","ÜRITUSE PERSONAL ","HALDUSPERSONAL "]
[null,"Projekt 1","Ürituse strateegia väljatöötamine",{"$f":"DATE(YEAR(TODAY()),6,9)","v":"2019-06-09"},{"$f":"DATE(YEAR(TODAY()),8,7)","v":"2019-08-07"},{"$f":"DATE(YEAR(TODAY()),6,29)","v":"2019-06-29"},{"$f":"DATE(YEAR(TODAY()),9,3)","v":"2019-09-03"},200,220,{"$f":"DAYS360(ProjektiÜksikasjad[[#This Row],[HINNANGULINE ALGUSAEG]],ProjektiÜksikasjad[[#This Row],[HINNANGULINE LÕPPAEG]],FALSE)","v":58},{"$f":"DAYS360(ProjektiÜksikasjad[[#This Row],[TEGELIK ALGUSAEG]],ProjektiÜksikasjad[[#This Row],[TEGELIK LÕPPAEG]],FALSE)","v":64},{"$f":"INDEX(Parameetrid[],MATCH(ProjektiÜksikasjad[[#This Row],[PROJEKTI TÜÜP]],Parameetrid[PROJEKTI TÜÜP],0),MATCH(ProjektiÜksikasjad[[#Headers],[KONTOHALDUR]],Parameetrid[#Headers],0))*INDEX('PROJEKTI PARAMEETRID'!$B$12:$H$12,1,MATCH(ProjektiÜksikasjad[[#Headers],[KONTOHALDUR]],Parameetrid[#Headers],0))*ProjektiÜksikasjad[[#This Row],[HINNANGULINE TÖÖ MAHT]]","v":{"v":7200,"d":"7,200 €"}},{"$f":"INDEX(Parameetrid[],MATCH(ProjektiÜksikasjad[[#This Row],[PROJEKTI TÜÜP]],Parameetrid[PROJEKTI TÜÜP],0),MATCH(ProjektiÜksikasjad[[#Headers],[PROJEKTIJUHT]],Parameetrid[#Headers],0))*INDEX('PROJEKTI PARAMEETRID'!$B$12:$H$12,1,MATCH(ProjektiÜksikasjad[[#Headers],[PROJEKTIJUHT]],Parameetrid[#Headers],0))*ProjektiÜksikasjad[[#This Row],[HINNANGULINE TÖÖ MAHT]]","v":{"v":2400,"d":"2,400 €"}},{"$f":"INDEX(Parameetrid[],MATCH(ProjektiÜksikasjad[[#This Row],[PROJEKTI TÜÜP]],Parameetrid[PROJEKTI TÜÜP],0),MATCH(ProjektiÜksikasjad[[#Headers],[STRATEEGIAJUHT]],Parameetrid[#Headers],0))*INDEX('PROJEKTI PARAMEETRID'!$B$12:$H$12,1,MATCH(ProjektiÜksikasjad[[#Headers],[STRATEEGIAJUHT]],Parameetrid[#Headers],0))*ProjektiÜksikasjad[[#This Row],[HINNANGULINE TÖÖ MAHT]]","v":{"v":18000,"d":"18,000 €"}},{"$f":"INDEX(Parameetrid[],MATCH(ProjektiÜksikasjad[[#This Row],[PROJEKTI TÜÜP]],Parameetrid[PROJEKTI TÜÜP],0),MATCH(ProjektiÜksikasjad[[#Headers],[KUJUNDUSSPETSIALIST]],Parameetrid[#Headers],0))*INDEX('PROJEKTI PARAMEETRID'!$B$12:$H$12,1,MATCH(ProjektiÜksikasjad[[#Headers],[KUJUNDUSSPETSIALIST]],Parameetrid[#Headers],0))*ProjektiÜksikasjad[[#This Row],[HINNANGULINE TÖÖ MAHT]]","v":{"v":0,"d":"0 €"}},{"$f":"INDEX(Parameetrid[],MATCH(ProjektiÜksikasjad[[#This Row],[PROJEKTI TÜÜP]],Parameetrid[PROJEKTI TÜÜP],0),MATCH(ProjektiÜksikasjad[[#Headers],[ÜRITUSE PERSONAL]],Parameetrid[#Headers],0))*INDEX('PROJEKTI PARAMEETRID'!$B$12:$H$12,1,MATCH(ProjektiÜksikasjad[[#Headers],[ÜRITUSE PERSONAL]],Parameetrid[#Headers],0))*ProjektiÜksikasjad[[#This Row],[HINNANGULINE TÖÖ MAHT]]","v":{"v":0,"d":"0 €"}},{"$f":"INDEX(Parameetrid[],MATCH(ProjektiÜksikasjad[[#This Row],[PROJEKTI TÜÜP]],Parameetrid[PROJEKTI TÜÜP],0),MATCH(ProjektiÜksikasjad[[#Headers],[HALDUSPERSONAL]],Parameetrid[#Headers],0))*INDEX('PROJEKTI PARAMEETRID'!$B$12:$H$12,1,MATCH(ProjektiÜksikasjad[[#Headers],[HALDUSPERSONAL]],Parameetrid[#Headers],0))*ProjektiÜksikasjad[[#This Row],[HINNANGULINE TÖÖ MAHT]]","v":{"v":1200,"d":"1,200 €"}},{"$f":"INDEX(Parameetrid[],MATCH(ProjektiÜksikasjad[[#This Row],[PROJEKTI TÜÜP]],Parameetrid[PROJEKTI TÜÜP],0),MATCH(ProjektiÜksikasjad[[#Headers],[KONTOHALDUR]],Parameetrid[#Headers],0))*INDEX('PROJEKTI PARAMEETRID'!$B$12:$H$12,1,MATCH(ProjektiÜksikasjad[[#Headers],[KONTOHALDUR]],Parameetrid[#Headers],0))*ProjektiÜksikasjad[[#This Row],[TEGELIK TÖÖ MAHT]]","v":{"v":7920,"d":"7,920 €"}},{"$f":"INDEX(Parameetrid[],MATCH(ProjektiÜksikasjad[[#This Row],[PROJEKTI TÜÜP]],Parameetrid[PROJEKTI TÜÜP],0),MATCH(ProjektiÜksikasjad[[#Headers],[PROJEKTIJUHT]],Parameetrid[#Headers],0))*INDEX('PROJEKTI PARAMEETRID'!$B$12:$H$12,1,MATCH(ProjektiÜksikasjad[[#Headers],[PROJEKTIJUHT]],Parameetrid[#Headers],0))*ProjektiÜksikasjad[[#This Row],[TEGELIK TÖÖ MAHT]]","v":{"v":2640,"d":"2,640 €"}},{"$f":"INDEX(Parameetrid[],MATCH(ProjektiÜksikasjad[[#This Row],[PROJEKTI TÜÜP]],Parameetrid[PROJEKTI TÜÜP],0),MATCH(ProjektiÜksikasjad[[#Headers],[STRATEEGIAJUHT]],Parameetrid[#Headers],0))*INDEX('PROJEKTI PARAMEETRID'!$B$12:$H$12,1,MATCH(ProjektiÜksikasjad[[#Headers],[STRATEEGIAJUHT]],Parameetrid[#Headers],0))*ProjektiÜksikasjad[[#This Row],[TEGELIK TÖÖ MAHT]]","v":{"v":19800,"d":"19,800 €"}},{"$f":"INDEX(Parameetrid[],MATCH(ProjektiÜksikasjad[[#This Row],[PROJEKTI TÜÜP]],Parameetrid[PROJEKTI TÜÜP],0),MATCH(ProjektiÜksikasjad[[#Headers],[KUJUNDUSSPETSIALIST]],Parameetrid[#Headers],0))*INDEX('PROJEKTI PARAMEETRID'!$B$12:$H$12,1,MATCH(ProjektiÜksikasjad[[#Headers],[KUJUNDUSSPETSIALIST]],Parameetrid[#Headers],0))*ProjektiÜksikasjad[[#This Row],[TEGELIK TÖÖ MAHT]]","v":{"v":0,"d":"0 €"}},{"$f":"INDEX(Parameetrid[],MATCH(ProjektiÜksikasjad[[#This Row],[PROJEKTI TÜÜP]],Parameetrid[PROJEKTI TÜÜP],0),MATCH(ProjektiÜksikasjad[[#Headers],[ÜRITUSE PERSONAL]],Parameetrid[#Headers],0))*INDEX('PROJEKTI PARAMEETRID'!$B$12:$H$12,1,MATCH(ProjektiÜksikasjad[[#Headers],[ÜRITUSE PERSONAL]],Parameetrid[#Headers],0))*ProjektiÜksikasjad[[#This Row],[TEGELIK TÖÖ MAHT]]","v":{"v":0,"d":"0 €"}},{"$f":"INDEX(Parameetrid[],MATCH(ProjektiÜksikasjad[[#This Row],[PROJEKTI TÜÜP]],Parameetrid[PROJEKTI TÜÜP],0),MATCH(ProjektiÜksikasjad[[#Headers],[HALDUSPERSONAL]],Parameetrid[#Headers],0))*INDEX('PROJEKTI PARAMEETRID'!$B$12:$H$12,1,MATCH(ProjektiÜksikasjad[[#Headers],[HALDUSPERSONAL]],Parameetrid[#Headers],0))*ProjektiÜksikasjad[[#This Row],[TEGELIK TÖÖ MAHT]]","v":{"v":1320,"d":"1,320 €"}}]
[null,"Projekt 2","Ürituse plaanimine",{"$f":"DATE(YEAR(TODAY())+1,6,25)","v":"2020-06-25"},{"$f":"DATE(YEAR(TODAY())+1,7,27)","v":"2020-07-27"},{"$f":"DATE(YEAR(TODAY()),7,15)","v":"2019-07-15"},{"$f":"DATE(YEAR(TODAY())+1,8,25)","v":"2020-08-25"},400,390,{"$f":"DAYS360(ProjektiÜksikasjad[[#This Row],[HINNANGULINE ALGUSAEG]],ProjektiÜksikasjad[[#This Row],[HINNANGULINE LÕPPAEG]],FALSE)","v":32},{"$f":"DAYS360(ProjektiÜksikasjad[[#This Row],[TEGELIK ALGUSAEG]],ProjektiÜksikasjad[[#This Row],[TEGELIK LÕPPAEG]],FALSE)","v":400},{"$f":"INDEX(Parameetrid[],MATCH(ProjektiÜksikasjad[[#This Row],[PROJEKTI TÜÜP]],Parameetrid[PROJEKTI TÜÜP],0),MATCH(ProjektiÜksikasjad[[#Headers],[KONTOHALDUR]],Parameetrid[#Headers],0))*INDEX('PROJEKTI PARAMEETRID'!$B$12:$H$12,1,MATCH(ProjektiÜksikasjad[[#Headers],[KONTOHALDUR]],Parameetrid[#Headers],0))*ProjektiÜksikasjad[[#This Row],[HINNANGULINE TÖÖ MAHT]]","v":{"v":14400,"d":"14,400 €"}},{"$f":"INDEX(Parameetrid[],MATCH(ProjektiÜksikasjad[[#This Row],[PROJEKTI TÜÜP]],Parameetrid[PROJEKTI TÜÜP],0),MATCH(ProjektiÜksikasjad[[#Headers],[PROJEKTIJUHT]],Parameetrid[#Headers],0))*INDEX('PROJEKTI PARAMEETRID'!$B$12:$H$12,1,MATCH(ProjektiÜksikasjad[[#Headers],[PROJEKTIJUHT]],Parameetrid[#Headers],0))*ProjektiÜksikasjad[[#This Row],[HINNANGULINE TÖÖ MAHT]]","v":{"v":24000,"d":"24,000 €"}},{"$f":"INDEX(Parameetrid[],MATCH(ProjektiÜksikasjad[[#This Row],[PROJEKTI TÜÜP]],Parameetrid[PROJEKTI TÜÜP],0),MATCH(ProjektiÜksikasjad[[#Headers],[STRATEEGIAJUHT]],Parameetrid[#Headers],0))*INDEX('PROJEKTI PARAMEETRID'!$B$12:$H$12,1,MATCH(ProjektiÜksikasjad[[#Headers],[STRATEEGIAJUHT]],Parameetrid[#Headers],0))*ProjektiÜksikasjad[[#This Row],[HINNANGULINE TÖÖ MAHT]]","v":{"v":6000,"d":"6,000 €"}},{"$f":"INDEX(Parameetrid[],MATCH(ProjektiÜksikasjad[[#This Row],[PROJEKTI TÜÜP]],Parameetrid[PROJEKTI TÜÜP],0),MATCH(ProjektiÜksikasjad[[#Headers],[KUJUNDUSSPETSIALIST]],Parameetrid[#Headers],0))*INDEX('PROJEKTI PARAMEETRID'!$B$12:$H$12,1,MATCH(ProjektiÜksikasjad[[#Headers],[KUJUNDUSSPETSIALIST]],Parameetrid[#Headers],0))*ProjektiÜksikasjad[[#This Row],[HINNANGULINE TÖÖ MAHT]]","v":{"v":4000,"d":"4,000 €"}},{"$f":"INDEX(Parameetrid[],MATCH(ProjektiÜksikasjad[[#This Row],[PROJEKTI TÜÜP]],Parameetrid[PROJEKTI TÜÜP],0),MATCH(ProjektiÜksikasjad[[#Headers],[ÜRITUSE PERSONAL]],Parameetrid[#Headers],0))*INDEX('PROJEKTI PARAMEETRID'!$B$12:$H$12,1,MATCH(ProjektiÜksikasjad[[#Headers],[ÜRITUSE PERSONAL]],Parameetrid[#Headers],0))*ProjektiÜksikasjad[[#This Row],[HINNANGULINE TÖÖ MAHT]]","v":{"v":0,"d":"0 €"}},{"$f":"INDEX(Parameetrid[],MATCH(ProjektiÜksikasjad[[#This Row],[PROJEKTI TÜÜP]],Parameetrid[PROJEKTI TÜÜP],0),MATCH(ProjektiÜksikasjad[[#Headers],[HALDUSPERSONAL]],Parameetrid[#Headers],0))*INDEX('PROJEKTI PARAMEETRID'!$B$12:$H$12,1,MATCH(ProjektiÜksikasjad[[#Headers],[HALDUSPERSONAL]],Parameetrid[#Headers],0))*ProjektiÜksikasjad[[#This Row],[HINNANGULINE TÖÖ MAHT]]","v":{"v":2400,"d":"2,400 €"}},{"$f":"INDEX(Parameetrid[],MATCH(ProjektiÜksikasjad[[#This Row],[PROJEKTI TÜÜP]],Parameetrid[PROJEKTI TÜÜP],0),MATCH(ProjektiÜksikasjad[[#Headers],[KONTOHALDUR]],Parameetrid[#Headers],0))*INDEX('PROJEKTI PARAMEETRID'!$B$12:$H$12,1,MATCH(ProjektiÜksikasjad[[#Headers],[KONTOHALDUR]],Parameetrid[#Headers],0))*ProjektiÜksikasjad[[#This Row],[TEGELIK TÖÖ MAHT]]","v":{"v":14040,"d":"14,040 €"}},{"$f":"INDEX(Parameetrid[],MATCH(ProjektiÜksikasjad[[#This Row],[PROJEKTI TÜÜP]],Parameetrid[PROJEKTI TÜÜP],0),MATCH(ProjektiÜksikasjad[[#Headers],[PROJEKTIJUHT]],Parameetrid[#Headers],0))*INDEX('PROJEKTI PARAMEETRID'!$B$12:$H$12,1,MATCH(ProjektiÜksikasjad[[#Headers],[PROJEKTIJUHT]],Parameetrid[#Headers],0))*ProjektiÜksikasjad[[#This Row],[TEGELIK TÖÖ MAHT]]","v":{"v":23400,"d":"23,400 €"}},{"$f":"INDEX(Parameetrid[],MATCH(ProjektiÜksikasjad[[#This Row],[PROJEKTI TÜÜP]],Parameetrid[PROJEKTI TÜÜP],0),MATCH(ProjektiÜksikasjad[[#Headers],[STRATEEGIAJUHT]],Parameetrid[#Headers],0))*INDEX('PROJEKTI PARAMEETRID'!$B$12:$H$12,1,MATCH(ProjektiÜksikasjad[[#Headers],[STRATEEGIAJUHT]],Parameetrid[#Headers],0))*ProjektiÜksikasjad[[#This Row],[TEGELIK TÖÖ MAHT]]","v":{"v":5850,"d":"5,850 €"}},{"$f":"INDEX(Parameetrid[],MATCH(ProjektiÜksikasjad[[#This Row],[PROJEKTI TÜÜP]],Parameetrid[PROJEKTI TÜÜP],0),MATCH(ProjektiÜksikasjad[[#Headers],[KUJUNDUSSPETSIALIST]],Parameetrid[#Headers],0))*INDEX('PROJEKTI PARAMEETRID'!$B$12:$H$12,1,MATCH(ProjektiÜksikasjad[[#Headers],[KUJUNDUSSPETSIALIST]],Parameetrid[#Headers],0))*ProjektiÜksikasjad[[#This Row],[TEGELIK TÖÖ MAHT]]","v":{"v":3900,"d":"3,900 €"}},{"$f":"INDEX(Parameetrid[],MATCH(ProjektiÜksikasjad[[#This Row],[PROJEKTI TÜÜP]],Parameetrid[PROJEKTI TÜÜP],0),MATCH(ProjektiÜksikasjad[[#Headers],[ÜRITUSE PERSONAL]],Parameetrid[#Headers],0))*INDEX('PROJEKTI PARAMEETRID'!$B$12:$H$12,1,MATCH(ProjektiÜksikasjad[[#Headers],[ÜRITUSE PERSONAL]],Parameetrid[#Headers],0))*ProjektiÜksikasjad[[#This Row],[TEGELIK TÖÖ MAHT]]","v":{"v":0,"d":"0 €"}},{"$f":"INDEX(Parameetrid[],MATCH(ProjektiÜksikasjad[[#This Row],[PROJEKTI TÜÜP]],Parameetrid[PROJEKTI TÜÜP],0),MATCH(ProjektiÜksikasjad[[#Headers],[HALDUSPERSONAL]],Parameetrid[#Headers],0))*INDEX('PROJEKTI PARAMEETRID'!$B$12:$H$12,1,MATCH(ProjektiÜksikasjad[[#Headers],[HALDUSPERSONAL]],Parameetrid[#Headers],0))*ProjektiÜksikasjad[[#This Row],[TEGELIK TÖÖ MAHT]]","v":{"v":2340,"d":"2,340 €"}}]
{"$rows_left_out":5}
{"sheet":"PROJEKTI KOKKUVÕTTED","index":3,"n_rows":10,"n_cols":14,"rows_kept":10}
["Sellel töölehel saate Projekti kokkuvõtted. Paremal asuvas lahtris värskendatakse ettevõtte nimi automaatselt. Selle veeru lahtritest leiate kasulikke juhiseid. Liikuge alustamiseks noolega alla.",{"$f":"'PROJEKTI PARAMEETRID'!B1","v":"Ettevõtte nimi"}]
["Paremal asuvas lahtris on selle töölehe pealkiri.","Ürituse haldamise projekti jälgur"]
["Paremal asuvas lahtris on konfidentsiaalsusteade.",{"$f":"'PROJEKTI PARAMEETRID'!B3","v":"Ettevõtte nimi  – konfidentsiaalne"}]
["Parempoolsest lahtrist algavat PivotTable-liigendtabelit värskendatakse automaatselt.\nTEAVE\nParempoolse PivotTable-liigendtabeli värskendamiseks valige see (mis tahes lahter PivotTable-liigendtabelis) ja klõpsake siis menüüs PIVOTTABLE-LIIGENDTABELI TÖÖRIISTAD | ANALÜÜS nuppu Värskenda. Samuti võite mõnes PivotTable-liigendtabeli lahtris vajutada klahvikombinatsiooni Shift + F10 ja seejärel valida nupu Värskenda.","PROJEKTI NIMI","KONTOHALDURI HINNANGULINE TASU","PROJEKTIJUHI HINNANGULINE TASU","STRATEEGIAJUHI HINNANGULINE TASU","KUJUNDUSSPETSIALISTI HINNANGULINE TASU","ÜRITUSE PERSONALI HINNANGULINE TASU","HALDUSPERSONALI HINNANGULINE TASU","KONTOHALDURI TEGELIK TASU","PROJEKTIJUHI TEGELIK TASU","STRATEEGIAJUHT TEGELIK TASU","KUJUNDUSSPETSIALIST TEGELIK TASU","ÜRITUSE PERSONAL TEGELIK TASU","HALDUSPERSONAL TEGELIK TASU"]
[null,"Projekt 1",{"v":7200,"d":"7,200.00 €"},{"v":2400,"d":"2,400.00 €"},{"v":18000,"d":"18,000.00 €"},{"v":0,"d":"0.00 €"},{"v":0,"d":"0.00 €"},{"v":1200,"d":"1,200.00 €"},{"v":7920,"d":"7,920.00 €"},{"v":2640,"d":"2,640.00 €"},{"v":19800,"d":"19,800.00 €"},{"v":0,"d":"0.00 €"},{"v":0,"d":"0.00 €"},{"v":1320,"d":"1,320.00 €"}]
[null,"Projekt 2",{"v":14400,"d":"14,400.00 €"},{"v":24000,"d":"24,000.00 €"},{"v":6000,"d":"6,000.00 €"},{"v":4000,"d":"4,000.00 €"},{"v":0,"d":"0.00 €"},{"v":2400,"d":"2,400.00 €"},{"v":14040,"d":"14,040.00 €"},{"v":23400,"d":"23,400.00 €"},{"v":5850,"d":"5,850.00 €"},{"v":3900,"d":"3,900.00 €"},{"v":0,"d":"0.00 €"},{"v":2340,"d":"2,340.00 €"}]
{"$rows_left_out":4}