{"text_format":"3","workbook":"xlsx","n_sheets":4,"sheets":["Punktide jälgimine","Teie edenemine","Sätted","Arvutused"],"not_rendered":{"defined_names":3,"comments":1},"read":"whole","date_system":"1900"}

{"sheet":"Punktide jälgimine","index":0,"n_rows":14,"n_cols":6,"rows_kept":14}
[null,"Sisestage siia oma punktid"]
[]
[null,null,"Õppeaine","Tüüp","Kirjeldus","Punktid"]
[null,null,"Prantsuse keel","Kodutööd","II maailmasõja ajalugu",{"v":0.8,"d":"80%"}]
[null,null,"Programmeerimine Java-keeles","Tasemetöö",null,{"v":0.75,"d":"75%"}]
[null,null,"Hispaania keel","Kodutööd",null,{"v":0.5,"d":"50%"}]
[null,null,"Teoreetiline füüsika","Kodutööd",null,{"v":0.95,"d":"95%"}]
[null,null,"Prantsuse keel","Kodutööd","I maailmasõja ajalugu",{"v":0.9,"d":"90%"}]
[null,null,"Prantsuse keel","Kodutööd","Lk 30–41",{"v":0.8,"d":"80%"}]
[null,null,"Kirjand","Essee","Kaaskiri",{"v":0.95,"d":"95%"}]
[null,null,"Matemaatika 1","Kodutööd","Lk 21 ja 26",{"v":0.8,"d":"80%"}]
[null,null,"Matemaatika 2","Kodutööd","Lk 15 ja 18",{"v":0.85,"d":"85%"}]
[null,null,"Matemaatika 1","Kodutööd","Lk 34–36",{"v":0.8,"d":"80%"}]
[null,null,"Matemaatika 2","Tunnikontroll",null,{"v":0.95,"d":"95%"}]

{"sheet":"Teie edenemine","index":1,"n_rows":31,"n_cols":8,"rows_kept":31}
[null,"Teie edenemine"]
[]
[null,null,"Kokku"]
[null,null,{"$f":"\"Tunnid: \"&SUM(tblÕppeained[Ainepunktid])","v":"Tunnid: 24"},{"$f":"AVERAGE(D7:D31)","v":{"v":0.8104761904761906,"d":"81%"}},{"$f":"AVERAGE(E7:E31)","v":{"v":2.7142857142857144,"d":"2.71"}},{"$f":"SUM(F7:F31)","v":{"v":2.625,"d":"2.63"}},{"$f":"IFERROR(HLOOKUP(D4,lstGPAMapping,2),\"\")","v":"B-"}]
[]
[null,null,"Õppeained","%","Keskmine hinne","Kaalutud keskmine hinne","Täht","Üldised näitajad"]
[null,null,{"$f":"Arvutused!C6","v":"Prantsuse keel"},{"$f":"Arvutused!AL6","v":{"v":0.8333333333333334,"d":"83%"}},{"$f":"Arvutused!AM6","v":{"v":3,"d":"3.00"}},{"$f":"IFERROR(E7*Sätted!D9/SUM(tblÕppeained[Ainepunktid]),\"\")","v":{"v":0.375,"d":"0.38"}},{"$f":"Arvutused!AN6","v":"B"}]
[null,null,{"$f":"Arvutused!C7","v":"Teoreetiline füüsika"},{"$f":"Arvutused!AL7","v":{"v":0.95,"d":"95%"}},{"$f":"Arvutused!AM7","v":{"v":4,"d":"4.00"}},{"$f":"IFERROR(E8*Sätted!D10/SUM(tblÕppeained[Ainepunktid]),\"\")","v":{"v":0.5,"d":"0.50"}},{"$f":"Arvutused!AN7","v":"A"}]
[null,null,{"$f":"Arvutused!C8","v":"Matemaatika 1"},{"$f":"Arvutused!AL8","v":{"v":0.8000000000000002,"d":"80%"}},{"$f":"Arvutused!AM8","v":2.67},{"$f":"IFERROR(E9*Sätted!D11/SUM(tblÕppeained[Ainepunktid]),\"\")","v":{"v":0.445,"d":"0.45"}},{"$f":"Arvutused!AN8","v":"B-"}]
[null,null,{"$f":"Arvutused!C9","v":"Matemaatika 2"},{"$f":"Arvutused!AL9","v":{"v":0.89,"d":"89%"}},{"$f":"Arvutused!AM9","v":3.33},{"$f":"IFERROR(E10*Sätted!D12/SUM(tblÕppeained[Ainepunktid]),\"\")","v":{"v":0.555,"d":"0.56"}},{"$f":"Arvutused!AN9","v":"B+"}]
[null,null,{"$f":"Arvutused!C10","v":"Programmeerimine Java-keeles"},{"$f":"Arvutused!AL10","v":{"v":0.7500000000000001,"d":"75%"}},{"$f":"Arvutused!AM10","v":{"v":2,"d":"2.00"}},{"$f":"IFERROR(E11*Sätted!D13/SUM(tblÕppeained[Ainepunktid]),\"\")","v":{"v":0.4166666666666667,"d":"0.42"}},{"$f":"Arvutused!AN10","v":"C"}]
[null,null,{"$f":"Arvutused!C11","v":"Hispaania keel"},{"$f":"Arvutused!AL11","v":{"v":0.5,"d":"50%"}},{"$f":"Arvutused!AM11","v":{"v":0,"d":"0.00"}},{"$f":"IFERROR(E12*Sätted!D14/SUM(tblÕppeained[Ainepunktid]),\"\")","v":{"v":0,"d":"0.00"}},{"$f":"Arvutused!AN11","v":"F"}]
[null,null,{"$f":"Arvutused!C12","v":"Kirjand"},{"$f":"Arvutused!AL12","v":{"v":0.95,"d":"95%"}},{"$f":"Arvutused!AM12","v":{"v":4,"d":"4.00"}},{"$f":"IFERROR(E13*Sätted!D15/SUM(tblÕppeained[Ainepunktid]),\"\")","v":{"v":0.3333333333333333,"d":"0.33"}},{"$f":"Arvutused!AN12","v":"A"}]
[null,null,{"$f":"Arvutused!C13","v":""},{"$f":"Arvutused!AL13","v":""},{"$f":"Arvutused!AM13","v":""},{"$f":"IFERROR(E14*Sätted!D16/SUM(tblÕppeained[Ainepunktid]),\"\")","v":""},{"$f":"Arvutused!AN13","v":""}]
[null,null,{"$f":"Arvutused!C14","v":""},{"$f":"Arvutused!AL14","v":""},{"$f":"Arvutused!AM14","v":""},{"$f":"IFERROR(E15*Sätted!D17/SUM(tblÕppeained[Ainepunktid]),\"\")","v":""},{"$f":"Arvutused!AN14","v":""}]
{"$rows_left_out":17}
{"sheet":"Sätted","index":2,"n_rows":15,"n_cols":16,"rows_kept":15,"merged":[[5,2,5,15]]}
[null,"Sätted"]
[null,null,"Hinded ja keskmise hinde vastendamine"]
[null,null,"Protsent",{"v":0,"d":"0%"},{"v":0.6,"d":"60%"},{"v":0.63,"d":"63%"},{"v":0.67,"d":"67%"},{"v":0.7,"d":"70%"},{"v":0.73,"d":"73%"},{"v":0.77,"d":"77%"},{"v":0.8,"d":"80%"},{"v":0.83,"d":"83%"},{"v":0.87,"d":"87%"},{"v":0.9,"d":"90%"},{"v":0.93,"d":"93%"},{"v":0.97,"d":"97%"}]
[null,null,"Hinne tähena","F","D-","D","D+","C-","C","C+","B-","B","B+","A-","A","A+"]
[null,null,"Keskmine hinne",0,0.67,1,1.33,1.67,2,2.33,2.67,3,3.33,3.67,4,4]
[]
[null,null,"Kaalutud hinded kuni 25 õppeaine jaoks"]
[null,null,"Õpilase ained","Ainepunktid","Kodutööd","Essee","Tunnikontroll","Projekt","Tasemetöö","Lõpueksam","Muu","% kokku"]
[null,null,"Prantsuse keel",{"v":3,"d":"3.0"},{"v":0.1,"d":"10%"},{"v":0.15,"d":"15%"},{"v":0.15,"d":"15%"},{"v":0.1,"d":"10%"},{"v":0.2,"d":"20%"},{"v":0.3,"d":"30%"},null,{"$f":"SUM(tblÕppeained[[#This Row],[Kodutööd]:[Muu]])","v":{"v":1,"d":"100%"}}]
[null,null,"Teoreetiline füüsika",{"v":3,"d":"3.0"},{"v":0.15,"d":"15%"},{"v":0.15,"d":"15%"},{"v":0.1,"d":"10%"},{"v":0.1,"d":"10%"},{"v":0.15,"d":"15%"},{"v":0.3,"d":"30%"},{"v":0.05,"d":"5%"},{"$f":"SUM(tblÕppeained[[#This Row],[Kodutööd]:[Muu]])","v":{"v":1,"d":"100%"}}]
[null,null,"Matemaatika 1",{"v":4,"d":"4.0"},{"v":0.1,"d":"10%"},{"v":0.15,"d":"15%"},{"v":0.15,"d":"15%"},{"v":0.1,"d":"10%"},{"v":0.2,"d":"20%"},{"v":0.3,"d":"30%"},null,{"$f":"SUM(tblÕppeained[[#This Row],[Kodutööd]:[Muu]])","v":{"v":1,"d":"100%"}}]
[null,null,"Matemaatika 2",{"v":4,"d":"4.0"},{"v":0.15,"d":"15%"},{"v":0.15,"d":"15%"},{"v":0.1,"d":"10%"},{"v":0.1,"d":"10%"},{"v":0.15,"d":"15%"},{"v":0.3,"d":"30%"},{"v":0.05,"d":"5%"},{"$f":"SUM(tblÕppeained[[#This Row],[Kodutööd]:[Muu]])","v":{"v":1,"d":"100%"}}]
[null,null,"Programmeerimine Java-keeles",{"v":5,"d":"5.0"},{"v":0.15,"d":"15%"},{"v":0.15,"d":"15%"},{"v":0.1,"d":"10%"},{"v":0.1,"d":"10%"},{"v":0.2,"d":"20%"},{"v":0.3,"d":"30%"},null,{"$f":"SUM(tblÕppeained[[#This Row],[Kodutööd]:[Muu]])","v":{"v":1,"d":"100%"}}]
[null,null,"Hispaania keel",{"v":3,"d":"3.0"},{"v":0.1,"d":"10%"},{"v":0.15,"d":"15%"},{"v":0.17,"d":"17%"},{"v":0.13,"d":"13%"},{"v":0.2,"d":"20%"},{"v":0.2,"d":"20%"},{"v":0.05,"d":"5%"},{"$f":"SUM(tblÕppeained[[#This Row],[Kodutööd]:[Muu]])","v":{"v":1,"d":"100%"}}]
[null,null,"Kirjand",{"v":2,"d":"2.0"},{"v":0.15,"d":"15%"},{"v":0.15,"d":"15%"},{"v":0.12,"d":"12%"},{"v":0.15,"d":"15%"},{"v":0.15,"d":"15%"},{"v":0.25,"d":"25%"},{"v":0.03,"d":"3%"},{"$f":"SUM(tblÕppeained[[#This Row],[Kodutööd]:[Muu]])","v":{"v":1,"d":"100%"}}]
{"$rows_left_out":1}
{"sheet":"Arvutused","index":3,"n_rows":657,"n_cols":40,"rows_kept":657,"hidden":true}
[null,"Arvutused"]
[null,null,"Sellel töölehel arvutatakse teie hinded ja keskmine hinne ning see peaks jääma peidetuks. Kui sellel lehel muudatusi teha, võib see kaasa tuua vigu."]
[]
[null,null,"Praegused õppeained","Punktisummad (tervik on 1)",{"$nulls":24},"Hinde arvutamine"]
[null,null,"Õppeaine",1,2,3,4,5,6,7,8,9,10,11,12,13,14,15,16,17,18,19,20,21,22,23,24,25,{"$f":"tblÕppeained[[#Headers],[Kodutööd]]","v":"Kodutööd"},{"$f":"tblÕppeained[[#Headers],[Essee]]","v":"Essee"},{"$f":"tblÕppeained[[#Headers],[Tunnikontroll]]","v":"Tunnikontroll"},{"$f":"tblÕppeained[[#Headers],[Projekt]]","v":"Projekt"},{"$f":"tblÕppeained[[#Headers],[Tasemetöö]]","v":"Tasemetöö"},{"$f":"tblÕppeained[[#Headers],[Lõpueksam]]","v":"Lõpueksam"},{"$f":"tblÕppeained[[#Headers],[Muu]]","v":"Muu"},"Kokku","Võimalikud punktid kokku","Kokku %","Hinne","Hinne tähena"]
[null,null,{"$f":"IF(Sätted!C9=\"\",\"\",Sätted!C9)","v":"Prantsuse keel"},{"$f":"IFERROR(INDEX(tblÕppeainedHinded[],MATCH($C6:$C30&D$5:AB$5,Arvutused!$C$33:$C$657,0),4),\"\")","v":{"v":0.8,"d":"80%"}},{"v":0.9,"d":"90%"},{"v":0.8,"d":"80%"},"","","","","","","","","","","","","","","","","","","","","","",{"$f":"IFERROR(AVERAGEIFS(tblÕppeainedHinded[Punktid],tblÕppeainedHinded[Õppeaine],Arvutused!$C6,tblÕppeainedHinded[Tüüp],Arvutused!AC$5)*Sätted!E9,\"\")","v":0.08333333333333334},{"$f":"IFERROR(AVERAGEIFS(tblÕppeainedHinded[Punktid],tblÕppeainedHinded[Õppeaine],Arvutused!$C6,tblÕppeainedHinded[Tüüp],Arvutused!AD$5)*Sätted!F9,\"\")","v":""},{"$f":"IFERROR(AVERAGEIFS(tblÕppeainedHinded[Punktid],tblÕppeainedHinded[Õppeaine],Arvutused!$C6,tblÕppeainedHinded[Tüüp],Arvutused!AE$5)*Sätted!G9,\"\")","v":""},{"$f":"IFERROR(AVERAGEIFS(tblÕppeainedHinded[Punktid],tblÕppeainedHinded[Õppeaine],Arvutused!$C6,tblÕppeainedHinded[Tüüp],Arvutused!AF$5)*Sätted!H9,\"\")","v":""},{"$f":"IFERROR(AVERAGEIFS(tblÕppeainedHinded[Punktid],tblÕppeainedHinded[Õppeaine],Arvutused!$C6,tblÕppeainedHinded[Tüüp],Arvutused!AG$5)*Sätted!I9,\"\")","v":""},{"$f":"IFERROR(AVERAGEIFS(tblÕppeainedHinded[Punktid],tblÕppeainedHinded[Õppeaine],Arvutused!$C6,tblÕppeainedHinded[Tüüp],Arvutused!AH$5)*Sätted!J9,\"\")","v":""},{"$f":"IFERROR(AVERAGEIFS(tblÕppeainedHinded[Punktid],tblÕppeainedHinded[Õppeaine],Arvutused!$C6,tblÕppeainedHinded[Tüüp],Arvutused!AI$5)*Sätted!K9,\"\")","v":""},{"$f":"SUM(AC6:AI6)","v":0.08333333333333334},{"$f":"SUMIFS(Sätted!E9:K9,Arvutused!AC6:AI6,\">0\")","v":0.1},{"$f":"IFERROR(AJ6/AK6,\"\")","v":{"v":0.8333333333333334,"d":"83%"}},{"$f":"IFERROR(HLOOKUP(AL6,lstGPAMapping,3),\"\")","v":3},{"$f":"IFERROR(HLOOKUP(AL6,lstGPAMapping,2),\"\")","v":"B"}]
[null,null,{"$f":"IF(Sätted!C10=\"\",\"\",Sätted!C10)","v":"Teoreetiline füüsika"},{"v":0.95,"d":"95%"},"","","","","","","","","","","","","","","","","","","","","","","","",{"$f":"IFERROR(AVERAGEIFS(tblÕppeainedHinded[Punktid],tblÕppeainedHinded[Õppeaine],Arvutused!$C7,tblÕppeainedHinded[Tüüp],Arvutused!AC$5)*Sätted!E10,\"\")","v":0.1425},{"$f":"IFERROR(AVERAGEIFS(tblÕppeainedHinded[Punktid],tblÕppeainedHinded[Õppeaine],Arvutused!$C7,tblÕppeainedHinded[Tüüp],Arvutused!AD$5)*Sätted!F10,\"\")","v":""},{"$f":"IFERROR(AVERAGEIFS(tblÕppeainedHinded[Punktid],tblÕppeainedHinded[Õppeaine],Arvutused!$C7,tblÕppeainedHinded[Tüüp],Arvutused!AE$5)*Sätted!G10,\"\")","v":""},{"$f":"IFERROR(AVERAGEIFS(tblÕppeainedHinded[Punktid],tblÕppeainedHinded[Õppeaine],Arvutused!$C7,tblÕppeainedHinded[Tüüp],Arvutused!AF$5)*Sätted!H10,\"\")","v":""},{"$f":"IFERROR(AVERAGEIFS(tblÕppeainedHinded[Punktid],tblÕppeainedHinded[Õppeaine],Arvutused!$C7,tblÕppeainedHinded[Tüüp],Arvutused!AG$5)*Sätted!I10,\"\")","v":""},{"$f":"IFERROR(AVERAGEIFS(tblÕppeainedHinded[Punktid],tblÕppeainedHinded[Õppeaine],Arvutused!$C7,tblÕppeainedHinded[Tüüp],Arvutused!AH$5)*Sätted!J10,\"\")","v":""},{"$f":"IFERROR(AVERAGEIFS(tblÕppeainedHinded[Punktid],tblÕppeainedHinded[Õppeaine],Arvutused!$C7,tblÕppeainedHinded[Tüüp],Arvutused!AI$5)*Sätted!K10,\"\")","v":""},{"$f":"SUM(AC7:AI7)","v":0.1425},{"$f":"SUMIFS(Sätted!E10:K10,Arvutused!AC7:AI7,\">0\")","v":0.15},{"$f":"IFERROR(AJ7/AK7,\"\")","v":{"v":0.95,"d":"95%"}},4,"A"]
[null,null,{"$f":"IF(Sätted!C11=\"\",\"\",Sätted!C11)","v":"Matemaatika 1"},{"v":0.8,"d":"80%"},{"v":0.8,"d":"80%"},"","","","","","","","","","","","","","","","","","","","","","","",{"$f":"IFERROR(AVERAGEIFS(tblÕppeainedHinded[Punktid],tblÕppeainedHinded[Õppeaine],Arvutused!$C8,tblÕppeainedHinded[Tüüp],Arvutused!AC$5)*Sätted!E11,\"\")","v":0.08000000000000002},{"$f":"IFERROR(AVERAGEIFS(tblÕppeainedHinded[Punktid],tblÕppeainedHinded[Õppeaine],Arvutused!$C8,tblÕppeainedHinded[Tüüp],Arvutused!AD$5)*Sätted!F11,\"\")","v":""},{"$f":"IFERROR(AVERAGEIFS(tblÕppeainedHinded[Punktid],tblÕppeainedHinded[Õppeaine],Arvutused!$C8,tblÕppeainedHinded[Tüüp],Arvutused!AE$5)*Sätted!G11,\"\")","v":""},{"$f":"IFERROR(AVERAGEIFS(tblÕppeainedHinded[Punktid],tblÕppeainedHinded[Õppeaine],Arvutused!$C8,tblÕppeainedHinded[Tüüp],Arvutused!AF$5)*Sätted!H11,\"\")","v":""},{"$f":"IFERROR(AVERAGEIFS(tblÕppeainedHinded[Punktid],tblÕppeainedHinded[Õppeaine],Arvutused!$C8,tblÕppeainedHinded[Tüüp],Arvutused!AG$5)*Sätted!I11,\"\")","v":""},{"$f":"IFERROR(AVERAGEIFS(tblÕppeainedHinded[Punktid],tblÕppeainedHinded[Õppeaine],Arvutused!$C8,tblÕppeainedHinded[Tüüp],Arvutused!AH$5)*Sätted!J11,\"\")","v":""},{"$f":"IFERROR(AVERAGEIFS(tblÕppeainedHinded[Punktid],tblÕppeainedHinded[Õppeaine],Arvutused!$C8,tblÕppeainedHinded[Tüüp],Arvutused!AI$5)*Sätted!K11,\"\")","v":""},0.08000000000000002,{"$f":"SUMIFS(Sätted!E11:K11,Arvutused!AC8:AI8,\">0\")","v":0.1},{"v":0.8000000000000002,"d":"80%"},2.67,"B-"]
[null,null,{"$f":"IF(Sätted!C12=\"\",\"\",Sätted!C12)","v":"Matemaatika 2"},{"v":0.85,"d":"85%"},{"v":0.95,"d":"95%"},"","","","","","","","","","","","","","","","","","","","","","","",{"$f":"IFERROR(AVERAGEIFS(tblÕppeainedHinded[Punktid],tblÕppeainedHinded[Õppeaine],Arvutused!$C9,tblÕppeainedHinded[Tüüp],Arvutused!AC$5)*Sätted!E12,\"\")","v":0.1275},{"$f":"IFERROR(AVERAGEIFS(tblÕppeainedHinded[Punktid],tblÕppeainedHinded[Õppeaine],Arvutused!$C9,tblÕppeainedHinded[Tüüp],Arvutused!AD$5)*Sätted!F12,\"\")","v":""},{"$f":"IFERROR(AVERAGEIFS(tblÕppeainedHinded[Punktid],tblÕppeainedHinded[Õppeaine],Arvutused!$C9,tblÕppeainedHinded[Tüüp],Arvutused!AE$5)*Sätted!G12,\"\")","v":0.095},{"$f":"IFERROR(AVERAGEIFS(tblÕppeainedHinded[Punktid],tblÕppeainedHinded[Õppeaine],Arvutused!$C9,tblÕppeainedHinded[Tüüp],Arvutused!AF$5)*Sätted!H12,\"\")","v":""},{"$f":"IFERROR(AVERAGEIFS(tblÕppeainedHinded[Punktid],tblÕppeainedHinded[Õppeaine],Arvutused!$C9,tblÕppeainedHinded[Tüüp],Arvutused!AG$5)*Sätted!I12,\"\")","v":""},{"$f":"IFERROR(AVERAGEIFS(tblÕppeainedHinded[Punktid],tblÕppeainedHinded[Õppeaine],Arvutused!$C9,tblÕppeainedHinded[Tüüp],Arvutused!AH$5)*Sätted!J12,\"\")","v":""},{"$f":"IFERROR(AVERAGEIFS(tblÕppeainedHinded[Punktid],tblÕppeainedHinded[Õppeaine],Arvutused!$C9,tblÕppeainedHinded[Tüüp],Arvutused!AI$5)*Sätted!K12,\"\")","v":""},0.2225,{"$f":"SUMIFS(Sätted!E12:K12,Arvutused!AC9:AI9,\">0\")","v":0.25},{"v":0.89,"d":"89%"},3.33,"B+"]
[null,null,{"$f":"IF(Sätted!C13=\"\",\"\",Sätted!C13)","v":"Programmeerimine Java-keeles"},{"v":0.75,"d":"75%"},"","","","","","","","","","","","","","","","","","","","","","","","",{"$f":"IFERROR(AVERAGEIFS(tblÕppeainedHinded[Punktid],tblÕppeainedHinded[Õppeaine],Arvutused!$C10,tblÕppeainedHinded[Tüüp],Arvutused!AC$5)*Sätted!E13,\"\")","v":""},{"$f":"IFERROR(AVERAGEIFS(tblÕppeainedHinded[Punktid],tblÕppeainedHinded[Õppeaine],Arvutused!$C10,tblÕppeainedHinded[Tüüp],Arvutused!AD$5)*Sätted!F13,\"\")","v":""},{"$f":"IFERROR(AVERAGEIFS(tblÕppeainedHinded[Punktid],tblÕppeainedHinded[Õppeaine],Arvutused!$C10,tblÕppeainedHinded[Tüüp],Arvutused!AE$5)*Sätted!G13,\"\")","v":""},{"$f":"IFERROR(AVERAGEIFS(tblÕppeainedHinded[Punktid],tblÕppeainedHinded[Õppeaine],Arvutused!$C10,tblÕppeainedHinded[Tüüp],Arvutused!AF$5)*Sätted!H13,\"\")","v":""},{"$f":"IFERROR(AVERAGEIFS(tblÕppeainedHinded[Punktid],tblÕppeainedHinded[Õppeaine],Arvutused!$C10,tblÕppeainedHinded[Tüüp],Arvutused!AG$5)*Sätted!I13,\"\")","v":0.15000000000000002},{"$f":"IFERROR(AVERAGEIFS(tblÕppeainedHinded[Punktid],tblÕppeainedHinded[Õppeaine],Arvutused!$C10,tblÕppeainedHinded[Tüüp],Arvutused!AH$5)*Sätted!J13,\"\")","v":""},{"$f":"IFERROR(AVERAGEIFS(tblÕppeainedHinded[Punktid],tblÕppeainedHinded[Õppeaine],Arvutused!$C10,tblÕppeainedHinded[Tüüp],Arvutused!AI$5)*Sätted!K13,\"\")","v":""},0.15000000000000002,{"$f":"SUMIFS(Sätted!E13:K13,Arvutused!AC10:AI10,\">0\")","v":0.2},{"v":0.7500000000000001,"d":"75%"},2,"C"]
[null,null,{"$f":"IF(Sätted!C14=\"\",\"\",Sätted!C14)","v":"Hispaania keel"},{"v":0.5,"d":"50%"},"","","","","","","","","","","","","","","","","","","","","","","","",{"$f":"IFERROR(AVERAGEIFS(tblÕppeainedHinded[Punktid],tblÕppeainedHinded[Õppeaine],Arvutused!$C11,tblÕppeainedHinded[Tüüp],Arvutused!AC$5)*Sätted!E14,\"\")","v":0.05},{"$f":"IFERROR(AVERAGEIFS(tblÕppeainedHinded[Punktid],tblÕppeainedHinded[Õppeaine],Arvutused!$C11,tblÕppeainedHinded[Tüüp],Arvutused!AD$5)*Sätted!F14,\"\")","v":""},{"$f":"IFERROR(AVERAGEIFS(tblÕppeainedHinded[Punktid],tblÕppeainedHinded[Õppeaine],Arvutused!$C11,tblÕppeainedHinded[Tüüp],Arvutused!AE$5)*Sätted!G14,\"\")","v":""},{"$f":"IFERROR(AVERAGEIFS(tblÕppeainedHinded[Punktid],tblÕppeainedHinded[Õppeaine],Arvutused!$C11,tblÕppeainedHinded[Tüüp],Arvutused!AF$5)*Sätted!H14,\"\")","v":""},{"$f":"IFERROR(AVERAGEIFS(tblÕppeainedHinded[Punktid],tblÕppeainedHinded[Õppeaine],Arvutused!$C11,tblÕppeainedHinded[Tüüp],Arvutused!AG$5)*Sätted!I14,\"\")","v":""},{"$f":"IFERROR(AVERAGEIFS(tblÕppeainedHinded[Punktid],tblÕppeainedHinded[Õppeaine],Arvutused!$C11,tblÕppeainedHinded[Tüüp],Arvutused!AH$5)*Sätted!J14,\"\")","v":""},{"$f":"IFERROR(AVERAGEIFS(tblÕppeainedHinded[Punktid],tblÕppeainedHinded[Õppeaine],Arvutused!$C11,tblÕppeainedHinded[Tüüp],Arvutused!AI$5)*Sätted!K14,\"\")","v":""},0.05,{"$f":"SUMIFS(Sätted!E14:K14,Arvutused!AC11:AI11,\">0\")","v":0.1},{"v":0.5,"d":"50%"},0,"F"]
[null,null,{"$f":"IF(Sätted!C15=\"\",\"\",Sätted!C15)","v":"Kirjand"},{"v":0.95,"d":"95%"},"","","","","","","","","","","","","","","","","","","","","","","","",{"$f":"IFERROR(AVERAGEIFS(tblÕppeainedHinded[Punktid],tblÕppeainedHinded[Õppeaine],Arvutused!$C12,tblÕppeainedHinded[Tüüp],Arvutused!AC$5)*Sätted!E15,\"\")","v":""},{"$f":"IFERROR(AVERAGEIFS(tblÕppeainedHinded[Punktid],tblÕppeainedHinded[Õppeaine],Arvutused!$C12,tblÕppeainedHinded[Tüüp],Arvutused!AD$5)*Sätted!F15,\"\")","v":0.1425},{"$f":"IFERROR(AVERAGEIFS(tblÕppeainedHinded[Punktid],tblÕppeainedHinded[Õppeaine],Arvutused!$C12,tblÕppeainedHinded[Tüüp],Arvutused!AE$5)*Sätted!G15,\"\")","v":""},{"$f":"IFERROR(AVERAGEIFS(tblÕppeainedHinded[Punktid],tblÕppeainedHinded[Õppeaine],Arvutused!$C12,tblÕppeainedHinded[Tüüp],Arvutused!AF$5)*Sätted!H15,\"\")","v":""},{"$f":"IFERROR(AVERAGEIFS(tblÕppeainedHinded[Punktid],tblÕppeainedHinded[Õppeaine],Arvutused!$C12,tblÕppeainedHinded[Tüüp],Arvutused!AG$5)*Sätted!I15,\"\")","v":""},{"$f":"IFERROR(AVERAGEIFS(tblÕppeainedHinded[Punktid],tblÕppeainedHinded[Õppeaine],Arvutused!$C12,tblÕppeainedHinded[Tüüp],Arvutused!AH$5)*Sätted!J15,\"\")","v":""},{"$f":"IFERROR(AVERAGEIFS(tblÕppeainedHinded[Punktid],tblÕppeainedHinded[Õppeaine],Arvutused!$C12,tblÕppeainedHinded[Tüüp],Arvutused!AI$5)*Sätted!K15,\"\")","v":""},0.1425,{"$f":"SUMIFS(Sätted!E15:K15,Arvutused!AC12:AI12,\">0\")","v":0.15},{"v":0.95,"d":"95%"},4,"A"]
[null,null,{"$f":"IF(Sätted!C16=\"\",\"\",Sätted!C16)","v":""},"","","","","","","","","","","","","","","","","","","","","","","","","",{"$f":"IFERROR(AVERAGEIFS(tblÕppeainedHinded[Punktid],tblÕppeainedHinded[Õppeaine],Arvutused!$C13,tblÕppeainedHinded[Tüüp],Arvutused!AC$5)*Sätted!E16,\"\")","v":""},{"$f":"IFERROR(AVERAGEIFS(tblÕppeainedHinded[Punktid],tblÕppeainedHinded[Õppeaine],Arvutused!$C13,tblÕppeainedHinded[Tüüp],Arvutused!AD$5)*Sätted!F16,\"\")","v":""},{"$f":"IFERROR(AVERAGEIFS(tblÕppeainedHinded[Punktid],tblÕppeainedHinded[Õppeaine],Arvutused!$C13,tblÕppeainedHinded[Tüüp],Arvutused!AE$5)*Sätted!G16,\"\")","v":""},{"$f":"IFERROR(AVERAGEIFS(tblÕppeainedHinded[Punktid],tblÕppeainedHinded[Õppeaine],Arvutused!$C13,tblÕppeainedHinded[Tüüp],Arvutused!AF$5)*Sätted!H16,\"\")","v":""},{"$f":"IFERROR(AVERAGEIFS(tblÕppeainedHinded[Punktid],tblÕppeainedHinded[Õppeaine],Arvutused!$C13,tblÕppeainedHinded[Tüüp],Arvutused!AG$5)*Sätted!I16,\"\")","v":""},{"$f":"IFERROR(AVERAGEIFS(tblÕppeainedHinded[Punktid],tblÕppeainedHinded[Õppeaine],Arvutused!$C13,tblÕppeainedHinded[Tüüp],Arvutused!AH$5)*Sätted!J16,\"\")","v":""},{"$f":"IFERROR(AVERAGEIFS(tblÕppeainedHinded[Punktid],tblÕppeainedHinded[Õppeaine],Arvutused!$C13,tblÕppeainedHinded[Tüüp],Arvutused!AI$5)*Sätted!K16,\"\")","v":""},0,{"$f":"SUMIFS(Sätted!E16:K16,Arvutused!AC13:AI13,\">0\")","v":0},"","",""]
[null,null,{"$f":"IF(Sätted!C17=\"\",\"\",Sätted!C17)","v":""},"","","","","","","","","","","","","","","","","","","","","","","","","",{"$f":"IFERROR(AVERAGEIFS(tblÕppeainedHinded[Punktid],tblÕppeainedHinded[Õppeaine],Arvutused!$C14,tblÕppeainedHinded[Tüüp],Arvutused!AC$5)*Sätted!E17,\"\")","v":""},{"$f":"IFERROR(AVERAGEIFS(tblÕppeainedHinded[Punktid],tblÕppeainedHinded[Õppeaine],Arvutused!$C14,tblÕppeainedHinded[Tüüp],Arvutused!AD$5)*Sätted!F17,\"\")","v":""},{"$f":"IFERROR(AVERAGEIFS(tblÕppeainedHinded[Punktid],tblÕppeainedHinded[Õppeaine],Arvutused!$C14,tblÕppeainedHinded[Tüüp],Arvutused!AE$5)*Sätted!G17,\"\")","v":""},{"$f":"IFERROR(AVERAGEIFS(tblÕppeainedHinded[Punktid],tblÕppeainedHinded[Õppeaine],Arvutused!$C14,tblÕppeainedHinded[Tüüp],Arvutused!AF$5)*Sätted!H17,\"\")","v":""},{"$f":"IFERROR(AVERAGEIFS(tblÕppeainedHinded[Punktid],tblÕppeainedHinded[Õppeaine],Arvutused!$C14,tblÕppeainedHinded[Tüüp],Arvutused!AG$5)*Sätted!I17,\"\")","v":""},{"$f":"IFERROR(AVERAGEIFS(tblÕppeainedHinded[Punktid],tblÕppeainedHinded[Õppeaine],Arvutused!$C14,tblÕppeainedHinded[Tüüp],Arvutused!AH$5)*Sätted!J17,\"\")","v":""},{"$f":"IFERROR(AVERAGEIFS(tblÕppeainedHinded[Punktid],tblÕppeainedHinded[Õppeaine],Arvutused!$C14,tblÕppeainedHinded[Tüüp],Arvutused!AI$5)*Sätted!K17,\"\")","v":""},0,{"$f":"SUMIFS(Sätted!E17:K17,Arvutused!AC14:AI14,\">0\")","v":0},"","",""]
[null,null,{"$f":"IF(Sätted!C18=\"\",\"\",Sätted!C18)","v":""},"","","","","","","","","","","","","","","","","","","","","","","","","",{"$f":"IFERROR(AVERAGEIFS(tblÕppeainedHinded[Punktid],tblÕppeainedHinded[Õppeaine],Arvutused!$C15,tblÕppeainedHinded[Tüüp],Arvutused!AC$5)*Sätted!E18,\"\")","v":""},{"$f":"IFERROR(AVERAGEIFS(tblÕppeainedHinded[Punktid],tblÕppeainedHinded[Õppeaine],Arvutused!$C15,tblÕppeainedHinded[Tüüp],Arvutused!AD$5)*Sätted!F18,\"\")","v":""},{"$f":"IFERROR(AVERAGEIFS(tblÕppeainedHinded[Punktid],tblÕppeainedHinded[Õppeaine],Arvutused!$C15,tblÕppeainedHinded[Tüüp],Arvutused!AE$5)*Sätted!G18,\"\")","v":""},{"$f":"IFERROR(AVERAGEIFS(tblÕppeainedHinded[Punktid],tblÕppeainedHinded[Õppeaine],Arvutused!$C15,tblÕppeainedHinded[Tüüp],Arvutused!AF$5)*Sätted!H18,\"\")","v":""},{"$f":"IFERROR(AVERAGEIFS(tblÕppeainedHinded[Punktid],tblÕppeainedHinded[Õppeaine],Arvutused!$C15,tblÕppeainedHinded[Tüüp],Arvutused!AG$5)*Sätted!I18,\"\")","v":""},{"$f":"IFERROR(AVERAGEIFS(tblÕppeainedHinded[Punktid],tblÕppeainedHinded[Õppeaine],Arvutused!$C15,tblÕppeainedHinded[Tüüp],Arvutused!AH$5)*Sätted!J18,\"\")","v":""},{"$f":"IFERROR(AVERAGEIFS(tblÕppeainedHinded[Punktid],tblÕppeainedHinded[Õppeaine],Arvutused!$C15,tblÕppeainedHinded[Tüüp],Arvutused!AI$5)*Sätted!K18,\"\")","v":""},0,{"$f":"SUMIFS(Sätted!E18:K18,Arvutused!AC15:AI15,\">0\")","v":0},"","",""]
{"$rows_left_out":642}