{"text_format":"3","workbook":"xlsx","n_sheets":4,"sheets":["Datos del gráfico","Diagrama de Gantt","Datos de gráf. dinámico ocultos","Acerca de"],"not_rendered":{"charts":1,"defined_names":4},"read":"whole","date_system":"1900"}

{"sheet":"Datos del gráfico","index":0,"n_rows":26,"n_cols":11,"rows_kept":26,"merged":[[1,1,1,3]]}
["Crea un Diagrama de Gantt de seguimiento de fecha en esta hoja de cálculo.\nEl título de esta hoja de cálculo está en la celda B1. \nLa información sobre cómo usar esta hoja de cálculo, incluidas las instrucciones para los lectores de pantalla, está en la hoja de cálculo Acerca de.\nContinúa desplazándote hacia abajo en la columna A para obtener más instrucciones.","Diagrama de Gantt de seguimiento de fecha"]
["Selecciona la opción Sí en la celda E2 para resaltar la fecha actual de la hoja de cálculo del diagrama de Gantt. \nSelecciona la opción No en la celda E2 para no resaltar la fecha actual de la hoja de cálculo del diagrama de Gantt.\nEn la celda E2, selecciona ALT + flecha abajo para opciones.","¿Realizar un seguimiento de la fecha de hoy?",null,null,"Sí"]
["El encabezado de los hitos de la tabla de hitos está en la celda B3.\nEl encabezado de tareas de la tabla de tareas está en la celda G3.","Hitos",{"$nulls":4},"Tareas"]
["En las celdas B4 a E4 hay información sobre las columnas de la tabla de los hitos.\nEn las celdas G4 a J4 hay información sobre las columnas de la tabla de las tareas.","Esta columna debe ordenarse secuencialmente.","La columna de posición ubica los hitos dentro del gráfico de la tarea.","Especifica la fecha del hito en esta columna","Escribe la descripción del hito en esta columna. Estas descripciones se mostrarán en el gráfico.",null,"Esta columna debe ordenarse secuencialmente.","Escribe la fecha de inicio para cada tarea a continuación. Para obtener mejores resultados, ordena esta columna en orden ascendente.","A continuación, escribe la fecha de finalización de cada tarea o una actividad en esta columna.","Escribe las tareas o las actividades de esta columna.","Columna calculada de forma automática usada para representar la duración de cada tarea. No eliminar ni modificar."]
["Los encabezados de la tabla de hitos están en las celdas B5 a E5. Los encabezados de la tabla de tareas están en las celdas G5 a K5.\nLos datos de ejemplo de hitos están en las celdas B6 a E17. \nLos datos de ejemplo de tareas están en las celdas G6 a J17.\nLa siguiente instrucción está en la celda A21.","N.º","Puesto","fecha","Hito",null,"N.º","Fecha de inicio","Fecha de finalización","Tarea","Duración en días"]
[null,1,1,{"$f":"Fecha_inicial+10","v":"2018-08-25"},"Hito 1",null,1,{"$f":"TODAY()-1","v":"2018-08-15"},{"$f":"Tareas[[#This Row],[Fecha de inicio]]+1","v":"2018-08-16"},"Actividad 1",{"$f":"IFERROR(IF(LEN(Tareas[[#This Row],[Fecha de inicio]])=0,\"\",(INT(Tareas[[#This Row],[Fecha de finalización]])-INT(Tareas[[#This Row],[Fecha de inicio]]))-(INT(Tareas[[#This Row],[Fecha de inicio]])-INT(Tareas[[#This Row],[Fecha de inicio]]))+1),\"\")","v":2}]
[null,2,1,{"$f":"TODAY()+25","v":"2018-09-10"},"Hito 2",null,2,{"$f":"TODAY()","v":"2018-08-16"},{"$f":"Tareas[[#This Row],[Fecha de inicio]]+1","v":"2018-08-17"},"Actividad 2",{"$f":"IFERROR(IF(LEN(Tareas[[#This Row],[Fecha de inicio]])=0,\"\",(INT(Tareas[[#This Row],[Fecha de finalización]])-INT(Tareas[[#This Row],[Fecha de inicio]]))-(INT(Tareas[[#This Row],[Fecha de inicio]])-INT(Tareas[[#This Row],[Fecha de inicio]]))+1),\"\")","v":2}]
[null,3,1,{"$f":"TODAY()+35","v":"2018-09-20"},"Hito 3",null,3,{"$f":"TODAY()","v":"2018-08-16"},{"$f":"Tareas[[#This Row],[Fecha de inicio]]+5","v":"2018-08-21"},"Actividad 3",{"$f":"IFERROR(IF(LEN(Tareas[[#This Row],[Fecha de inicio]])=0,\"\",(INT(Tareas[[#This Row],[Fecha de finalización]])-INT(Tareas[[#This Row],[Fecha de inicio]]))-(INT(Tareas[[#This Row],[Fecha de inicio]])-INT(Tareas[[#This Row],[Fecha de inicio]]))+1),\"\")","v":6}]
[null,4,1,{"$f":"TODAY()+45","v":"2018-09-30"},"Hito 4",null,4,{"$f":"TODAY()+1","v":"2018-08-17"},{"$f":"Tareas[[#This Row],[Fecha de inicio]]+7","v":"2018-08-24"},"Actividad 4",{"$f":"IFERROR(IF(LEN(Tareas[[#This Row],[Fecha de inicio]])=0,\"\",(INT(Tareas[[#This Row],[Fecha de finalización]])-INT(Tareas[[#This Row],[Fecha de inicio]]))-(INT(Tareas[[#This Row],[Fecha de inicio]])-INT(Tareas[[#This Row],[Fecha de inicio]]))+1),\"\")","v":8}]
[null,5,1,{"$f":"TODAY()+60","v":"2018-10-15"},"Hito 5",null,5,{"$f":"TODAY()+8","v":"2018-08-24"},{"$f":"Tareas[[#This Row],[Fecha de inicio]]+10","v":"2018-09-03"},"Actividad 5",{"$f":"IFERROR(IF(LEN(Tareas[[#This Row],[Fecha de inicio]])=0,\"\",(INT(Tareas[[#This Row],[Fecha de finalización]])-INT(Tareas[[#This Row],[Fecha de inicio]]))-(INT(Tareas[[#This Row],[Fecha de inicio]])-INT(Tareas[[#This Row],[Fecha de inicio]]))+1),\"\")","v":11}]
[null,6,1,{"$f":"TODAY()+70","v":"2018-10-25"},"Hito 6",null,6,{"$f":"TODAY()+12","v":"2018-08-28"},{"$f":"Tareas[[#This Row],[Fecha de inicio]]+30","v":"2018-09-27"},"Actividad 6",{"$f":"IFERROR(IF(LEN(Tareas[[#This Row],[Fecha de inicio]])=0,\"\",(INT(Tareas[[#This Row],[Fecha de finalización]])-INT(Tareas[[#This Row],[Fecha de inicio]]))-(INT(Tareas[[#This Row],[Fecha de inicio]])-INT(Tareas[[#This Row],[Fecha de inicio]]))+1),\"\")","v":31}]
[{"$nulls":6},7,{"$f":"TODAY()+15","v":"2018-08-31"},{"$f":"Tareas[[#This Row],[Fecha de inicio]]+15","v":"2018-09-15"},"Actividad 7",{"$f":"IFERROR(IF(LEN(Tareas[[#This Row],[Fecha de inicio]])=0,\"\",(INT(Tareas[[#This Row],[Fecha de finalización]])-INT(Tareas[[#This Row],[Fecha de inicio]]))-(INT(Tareas[[#This Row],[Fecha de inicio]])-INT(Tareas[[#This Row],[Fecha de inicio]]))+1),\"\")","v":16}]
[{"$nulls":6},8,{"$f":"TODAY()+25","v":"2018-09-10"},{"$f":"Tareas[[#This Row],[Fecha de inicio]]+5","v":"2018-09-15"},"Actividad 8",{"$f":"IFERROR(IF(LEN(Tareas[[#This Row],[Fecha de inicio]])=0,\"\",(INT(Tareas[[#This Row],[Fecha de finalización]])-INT(Tareas[[#This Row],[Fecha de inicio]]))-(INT(Tareas[[#This Row],[Fecha de inicio]])-INT(Tareas[[#This Row],[Fecha de inicio]]))+1),\"\")","v":6}]
[{"$nulls":6},9,{"$f":"TODAY()+34","v":"2018-09-19"},{"$f":"Tareas[[#This Row],[Fecha de inicio]]+2","v":"2018-09-21"},"Actividad 9",{"$f":"IFERROR(IF(LEN(Tareas[[#This Row],[Fecha de inicio]])=0,\"\",(INT(Tareas[[#This Row],[Fecha de finalización]])-INT(Tareas[[#This Row],[Fecha de inicio]]))-(INT(Tareas[[#This Row],[Fecha de inicio]])-INT(Tareas[[#This Row],[Fecha de inicio]]))+1),\"\")","v":3}]
[{"$nulls":6},10,{"$f":"TODAY()+40","v":"2018-09-25"},{"$f":"Tareas[[#This Row],[Fecha de inicio]]+30","v":"2018-10-25"},"Actividad 10",{"$f":"IFERROR(IF(LEN(Tareas[[#This Row],[Fecha de inicio]])=0,\"\",(INT(Tareas[[#This Row],[Fecha de finalización]])-INT(Tareas[[#This Row],[Fecha de inicio]]))-(INT(Tareas[[#This Row],[Fecha de inicio]])-INT(Tareas[[#This Row],[Fecha de inicio]]))+1),\"\")","v":31}]
[{"$nulls":6},11,{"$f":"TODAY()+42","v":"2018-09-27"},{"$f":"Tareas[[#This Row],[Fecha de inicio]]+23","v":"2018-10-20"},"Actividad 11",{"$f":"IFERROR(IF(LEN(Tareas[[#This Row],[Fecha de inicio]])=0,\"\",(INT(Tareas[[#This Row],[Fecha de finalización]])-INT(Tareas[[#This Row],[Fecha de inicio]]))-(INT(Tareas[[#This Row],[Fecha de inicio]])-INT(Tareas[[#This Row],[Fecha de inicio]]))+1),\"\")","v":24}]
[{"$nulls":6},12,{"$f":"TODAY()+50","v":"2018-10-05"},{"$f":"Tareas[[#This Row],[Fecha de inicio]]+5","v":"2018-10-10"},"Actividad 12",{"$f":"IFERROR(IF(LEN(Tareas[[#This Row],[Fecha de inicio]])=0,\"\",(INT(Tareas[[#This Row],[Fecha de finalización]])-INT(Tareas[[#This Row],[Fecha de inicio]]))-(INT(Tareas[[#This Row],[Fecha de inicio]])-INT(Tareas[[#This Row],[Fecha de inicio]]))+1),\"\")","v":6}]
[{"$nulls":10},{"$f":"IFERROR(IF(LEN(Tareas[[#This Row],[Fecha de inicio]])=0,\"\",(INT(Tareas[[#This Row],[Fecha de finalización]])-INT(Tareas[[#This Row],[Fecha de inicio]]))-(INT(Tareas[[#This Row],[Fecha de inicio]])-INT(Tareas[[#This Row],[Fecha de inicio]]))+1),\"\")","v":""}]
[{"$nulls":10},{"$f":"IFERROR(IF(LEN(Tareas[[#This Row],[Fecha de inicio]])=0,\"\",(INT(Tareas[[#This Row],[Fecha de finalización]])-INT(Tareas[[#This Row],[Fecha de inicio]]))-(INT(Tareas[[#This Row],[Fecha de inicio]])-INT(Tareas[[#This Row],[Fecha de inicio]]))+1),\"\")","v":""}]
[{"$nulls":10},{"$f":"IFERROR(IF(LEN(Tareas[[#This Row],[Fecha de inicio]])=0,\"\",(INT(Tareas[[#This Row],[Fecha de finalización]])-INT(Tareas[[#This Row],[Fecha de inicio]]))-(INT(Tareas[[#This Row],[Fecha de inicio]])-INT(Tareas[[#This Row],[Fecha de inicio]]))+1),\"\")","v":""}]
{"$rows_left_out":7}
{"sheet":"Diagrama de Gantt","index":1,"n_rows":1,"n_cols":1,"rows_kept":1}
["El diagrama de Gantt que muestra Hoy, hitos y tareas en un intervalo de fechas está en esta hoja de cálculo. \nHay una barra de desplazamiento en la fila 1 de las celdas de B1 a R1 que aumenta el intervalo de fecha que muestra los hitos futuros.\nEl gráfico se dibuja dentro de las celdas B2 a R3.\nEsta es la última instrucción en esta hoja de cálculo."]

{"sheet":"Datos de gráf. dinámico ocultos","index":2,"n_rows":32,"n_cols":10,"rows_kept":32,"hidden":true}
["El título de esta hoja de cálculo está en la celda B1.","Datos del gráfico dinámico, NO edites ni elimines esta hoja de cálculo."]
["El título de la tabla está en las celdas B2 y C2.",{"$f":"IF(TODAY()>=MIN(DatosDeTareaDinámicos[Fecha de inicio]),\"Hoy\",\"\")","v":"Hoy"},"resaltar"]
["El encabezado de la tabla está en las celdas B3 y C3. Estas coordenadas crean el Hoy resaltar en el gráfico.\nLa primera columna señala el día, la segunda indica dibujar la línea que resalta hoy.\nLa fecha de la primera columna puede cambiar para que el rango de fecha del gráfico permanezca legible a medida que las fechas avanzan, sin embargo, una coordenada Y de 0 indica que no se dibuja ninguna línea.\nNo modifiques ni elimines este contenido, dado que podrían romperse los gráficos. Para dejar de resaltar Hoy, simplemente selecciona \"no\" en la hoja de cálculo de datos del gráfico en la celda E2.\nLa siguiente instrucción está en la celda A7.","hoy, resalte coordenada X","coordenada Y"]
[null,{"$f":"IFERROR(IF(TODAY()<MIN(DatosDeTareaDinámicos[Fecha de inicio]),MIN($B$11,MIN(DatosDeTareaDinámicos[Fecha de inicio])),TODAY()),TODAY())","v":"2018-08-16"},{"$f":"IFERROR(IF(Seguimiento_Hoy=\"Sí\",IF(TODAY()<MIN(DatosDeTareaDinámicos[Fecha de inicio]),0,9),0),0)","v":9}]
[null,{"$f":"IFERROR(IF(TODAY()<MIN(DatosDeTareaDinámicos[Fecha de inicio]),MIN($B$11,MIN(DatosDeTareaDinámicos[Fecha de inicio])),TODAY()),TODAY())","v":"2018-08-16"},{"$f":"IFERROR(IF(Seguimiento_Hoy=\"Sí\",IF(TODAY()<MIN(DatosDeTareaDinámicos[Fecha de inicio]),0,9),0),0)","v":9}]
[]
["El encabezado de la tabla está en la celda B7.\nEl incremento de desplazamiento de la celda B8 representa los datos representados en el gráfico y que aparecen en algún momento en el diagrama de Gantt. \nAl desplazarte con la barra de desplazamiento en la parte superior del gráfico en la fila 1 de la hoja de cálculo del diagrama de Gantt, se incrementará este número.\nLos gráficos funcionan mejor con incrementos únicos.\nLa siguiente instrucción está en la celda A10.","incremento de desplazamiento"]
[null,0]
[]
["El encabezado de la tabla está en la celda B10 a D10.\nEl rango de creación de gráficos te ayuda a seleccionar el rango adecuado de tareas e hitos. No modifiques estos campos.\nEl número de antigüedad mantiene el gráfico legible al ordenar las tareas del rango por antigüedad y trazar solo aquellas que están dentro del rango. No modifiques este número.\nLa siguiente instrucción está en la celda A14.\n\n","Rango de gráficos",null,"antigüedad"]
[null,{"$f":"IFERROR(IF(IncrementoDeDesplazamiento[incremento de desplazamiento]=0,Fecha_inicial,IF(Fecha_inicial+IncrementoDeDesplazamiento[incremento de desplazamiento]*15<Fecha_final,Fecha_inicial+IncrementoDeDesplazamiento[incremento de desplazamiento]*15,Fecha_final-1)),\"\")","v":"2018-08-15"},null,45]
[null,{"$f":"IFERROR(IF($B$11+15<Fecha_final,$B$11+15,Fecha_final),\"\")","v":"2018-08-30"}]
[]
["El encabezado de tabla para datos de hito dinámicos está en celdas B14 a E14. Hay una nota en la celda F14.\nEsta tabla crea el diagrama de Gantt en la hoja de cálculo del diagrama de Gantt, al trazar 7 hitos por vez.\nLos datos en este gráfico se generan automáticamente según el contenido de la tabla anterior. \nNo modifiques ni elimines esta tabla o su contenido.\nLa siguiente instrucción está en la celda A17.","Tareas","Fecha de inicio","Duración de la tarea en días","puesto","<-- esta tabla crea el diagrama de Gantt, al trazar 7 hitos por vez."]
[null,{"$f":"IFERROR(IF(LEN(OFFSET('Datos del gráfico'!$H6,IncrementoDeDesplazamiento[incremento de desplazamiento],0,1,1))=0,\"\",IF(OR(OFFSET('Datos del gráfico'!$I6,IncrementoDeDesplazamiento[incremento de desplazamiento],0,1,1)<=$B$12,OFFSET('Datos del gráfico'!$H6,IncrementoDeDesplazamiento[incremento de desplazamiento],0,1,1)>=($B$11-$D$11)),INDEX(Tareas[],OFFSET('Datos del gráfico'!$G6,IncrementoDeDesplazamiento[incremento de desplazamiento],0,1,1),4),\"\")),\"\")","v":"Actividad 1"},{"$f":"IFERROR(IF(LEN(DatosDeTareaDinámicos[[#This Row],[Tareas]])=0,$B$11,INDEX(Tareas[],OFFSET('Datos del gráfico'!$G6,IncrementoDeDesplazamiento[incremento de desplazamiento],0,1,1),2)),\"\")","v":"2018-08-15"},{"$f":"IFERROR(IF(LEN(DatosDeTareaDinámicos[[#This Row],[Tareas]])=0,0,IF(AND('Datos del gráfico'!$H6<=$B$12,'Datos del gráfico'!$I6>=$B$12),ABS(OFFSET('Datos del gráfico'!$H6,IncrementoDeDesplazamiento[incremento de desplazamiento],0,1,1)-$B$12)+1,OFFSET('Datos del gráfico'!$K6,IncrementoDeDesplazamiento[incremento de desplazamiento],0,1,1))),\"\")","v":2},{"$f":"IFERROR(IF(LEN(DatosDeTareaDinámicos[[#This Row],[Tareas]])=0,\"\",8),\"\")","v":8}]
[null,{"$f":"IFERROR(IF(LEN(OFFSET('Datos del gráfico'!$H7,IncrementoDeDesplazamiento[incremento de desplazamiento],0,1,1))=0,\"\",IF(OR(OFFSET('Datos del gráfico'!$I7,IncrementoDeDesplazamiento[incremento de desplazamiento],0,1,1)<=$B$12,OFFSET('Datos del gráfico'!$H7,IncrementoDeDesplazamiento[incremento de desplazamiento],0,1,1)>=($B$11-$D$11)),INDEX(Tareas[],OFFSET('Datos del gráfico'!$G7,IncrementoDeDesplazamiento[incremento de desplazamiento],0,1,1),4),\"\")),\"\")","v":"Actividad 2"},{"$f":"IFERROR(IF(LEN(DatosDeTareaDinámicos[[#This Row],[Tareas]])=0,$B$11,INDEX(Tareas[],OFFSET('Datos del gráfico'!$G7,IncrementoDeDesplazamiento[incremento de desplazamiento],0,1,1),2)),\"\")","v":"2018-08-16"},{"$f":"IFERROR(IF(LEN(DatosDeTareaDinámicos[[#This Row],[Tareas]])=0,0,IF(AND('Datos del gráfico'!$H7<=$B$12,'Datos del gráfico'!$I7>=$B$12),ABS(OFFSET('Datos del gráfico'!$H7,IncrementoDeDesplazamiento[incremento de desplazamiento],0,1,1)-$B$12)+1,OFFSET('Datos del gráfico'!$K7,IncrementoDeDesplazamiento[incremento de desplazamiento],0,1,1))),\"\")","v":2},{"$f":"IFERROR(IF(LEN(DatosDeTareaDinámicos[[#This Row],[Tareas]])=0,\"\",7),\"\")","v":7},null,"Gráficos de hitos"]
["Las celdas G15 a I15 contienen los encabezados de datos de hitos dinámicos. \nLa información de esta tabla puede aparecer en blanco y las fechas pueden parecer incorrectas. No rellenes, edites, elimines ni modifiques los datos o correrás el riesgo de sobrescribir fórmulas y arruinar la capacidad de realizar gráficos del diagrama.\nLa tabla permite representar 15 hitos. Para representar más de 15, simplemente expande la tabla para que abarque la cantidad deseada. Recuerda que solo debes agregar los hitos en la hoja de cálculo de datos del gráfico. No agregues contenido a esta tabla.\nHay una nota en la celda J15.\nLa siguiente instrucción está en la celda A32.",{"$f":"IFERROR(IF(LEN(OFFSET('Datos del gráfico'!$H8,IncrementoDeDesplazamiento[incremento de desplazamiento],0,1,1))=0,\"\",IF(OR(OFFSET('Datos del gráfico'!$I8,IncrementoDeDesplazamiento[incremento de desplazamiento],0,1,1)<=$B$12,OFFSET('Datos del gráfico'!$H8,IncrementoDeDesplazamiento[incremento de desplazamiento],0,1,1)>=($B$11-$D$11)),INDEX(Tareas[],OFFSET('Datos del gráfico'!$G8,IncrementoDeDesplazamiento[incremento de desplazamiento],0,1,1),4),\"\")),\"\")","v":"Actividad 3"},{"$f":"IFERROR(IF(LEN(DatosDeTareaDinámicos[[#This Row],[Tareas]])=0,$B$11,INDEX(Tareas[],OFFSET('Datos del gráfico'!$G8,IncrementoDeDesplazamiento[incremento de desplazamiento],0,1,1),2)),\"\")","v":"2018-08-16"},{"$f":"IFERROR(IF(LEN(DatosDeTareaDinámicos[[#This Row],[Tareas]])=0,0,IF(AND('Datos del gráfico'!$H8<=$B$12,'Datos del gráfico'!$I8>=$B$12),ABS(OFFSET('Datos del gráfico'!$H8,IncrementoDeDesplazamiento[incremento de desplazamiento],0,1,1)-$B$12)+1,OFFSET('Datos del gráfico'!$K8,IncrementoDeDesplazamiento[incremento de desplazamiento],0,1,1))),\"\")","v":6},{"$f":"IFERROR(IF(LEN(DatosDeTareaDinámicos[[#This Row],[Tareas]])=0,\"\",6),\"\")","v":6},null,"Hitos","Fecha","Línea de base","<-- esta tabla crea los marcadores de hito en el diagrama de Gantt, donde se representan solo los hitos que pueden caber en el intervalo de fechas que se muestran; hasta 15 hitos"]
[null,{"$f":"IFERROR(IF(LEN(OFFSET('Datos del gráfico'!$H9,IncrementoDeDesplazamiento[incremento de desplazamiento],0,1,1))=0,\"\",IF(OR(OFFSET('Datos del gráfico'!$I9,IncrementoDeDesplazamiento[incremento de desplazamiento],0,1,1)<=$B$12,OFFSET('Datos del gráfico'!$H9,IncrementoDeDesplazamiento[incremento de desplazamiento],0,1,1)>=($B$11-$D$11)),INDEX(Tareas[],OFFSET('Datos del gráfico'!$G9,IncrementoDeDesplazamiento[incremento de desplazamiento],0,1,1),4),\"\")),\"\")","v":"Actividad 4"},{"$f":"IFERROR(IF(LEN(DatosDeTareaDinámicos[[#This Row],[Tareas]])=0,$B$11,INDEX(Tareas[],OFFSET('Datos del gráfico'!$G9,IncrementoDeDesplazamiento[incremento de desplazamiento],0,1,1),2)),\"\")","v":"2018-08-17"},{"$f":"IFERROR(IF(LEN(DatosDeTareaDinámicos[[#This Row],[Tareas]])=0,0,IF(AND('Datos del gráfico'!$H9<=$B$12,'Datos del gráfico'!$I9>=$B$12),ABS(OFFSET('Datos del gráfico'!$H9,IncrementoDeDesplazamiento[incremento de desplazamiento],0,1,1)-$B$12)+1,OFFSET('Datos del gráfico'!$K9,IncrementoDeDesplazamiento[incremento de desplazamiento],0,1,1))),\"\")","v":8},{"$f":"IFERROR(IF(LEN(DatosDeTareaDinámicos[[#This Row],[Tareas]])=0,\"\",5),\"\")","v":5},null,{"$f":"IFERROR(IF(LEN('Datos del gráfico'!D6)=0,\"\",IF(AND('Datos del gráfico'!D6<=$B$12,'Datos del gráfico'!D6>=$B$11-$D$11),'Datos del gráfico'!E6,\"\")),\"\")","v":"Hito 1"},{"$f":"IFERROR(IF(LEN(DatosDeHitosDinámicos[[#This Row],[Hitos]])=0,$B$12,'Datos del gráfico'!$D6),2)","v":"2018-08-25"},{"$f":"IFERROR(IF(LEN(DatosDeHitosDinámicos[[#This Row],[Hitos]])=0,\"\",'Datos del gráfico'!$C6),\"\")","v":1}]
[null,{"$f":"IFERROR(IF(LEN(OFFSET('Datos del gráfico'!$H10,IncrementoDeDesplazamiento[incremento de desplazamiento],0,1,1))=0,\"\",IF(OR(OFFSET('Datos del gráfico'!$I10,IncrementoDeDesplazamiento[incremento de desplazamiento],0,1,1)<=$B$12,OFFSET('Datos del gráfico'!$H10,IncrementoDeDesplazamiento[incremento de desplazamiento],0,1,1)>=($B$11-$D$11)),INDEX(Tareas[],OFFSET('Datos del gráfico'!$G10,IncrementoDeDesplazamiento[incremento de desplazamiento],0,1,1),4),\"\")),\"\")","v":"Actividad 5"},{"$f":"IFERROR(IF(LEN(DatosDeTareaDinámicos[[#This Row],[Tareas]])=0,$B$11,INDEX(Tareas[],OFFSET('Datos del gráfico'!$G10,IncrementoDeDesplazamiento[incremento de desplazamiento],0,1,1),2)),\"\")","v":"2018-08-24"},{"$f":"IFERROR(IF(LEN(DatosDeTareaDinámicos[[#This Row],[Tareas]])=0,0,IF(AND('Datos del gráfico'!$H10<=$B$12,'Datos del gráfico'!$I10>=$B$12),ABS(OFFSET('Datos del gráfico'!$H10,IncrementoDeDesplazamiento[incremento de desplazamiento],0,1,1)-$B$12)+1,OFFSET('Datos del gráfico'!$K10,IncrementoDeDesplazamiento[incremento de desplazamiento],0,1,1))),\"\")","v":7},{"$f":"IFERROR(IF(LEN(DatosDeTareaDinámicos[[#This Row],[Tareas]])=0,\"\",4),\"\")","v":4},null,{"$f":"IFERROR(IF(LEN('Datos del gráfico'!D7)=0,\"\",IF(AND('Datos del gráfico'!D7<=$B$12,'Datos del gráfico'!D7>=$B$11-$D$11),'Datos del gráfico'!E7,\"\")),\"\")","v":""},{"$f":"IFERROR(IF(LEN(DatosDeHitosDinámicos[[#This Row],[Hitos]])=0,$B$12,'Datos del gráfico'!$D7),2)","v":"2018-08-30"},{"$f":"IFERROR(IF(LEN(DatosDeHitosDinámicos[[#This Row],[Hitos]])=0,\"\",'Datos del gráfico'!$C7),\"\")","v":""}]
[null,{"$f":"IFERROR(IF(LEN(OFFSET('Datos del gráfico'!$H11,IncrementoDeDesplazamiento[incremento de desplazamiento],0,1,1))=0,\"\",IF(OR(OFFSET('Datos del gráfico'!$I11,IncrementoDeDesplazamiento[incremento de desplazamiento],0,1,1)<=$B$12,OFFSET('Datos del gráfico'!$H11,IncrementoDeDesplazamiento[incremento de desplazamiento],0,1,1)>=($B$11-$D$11)),INDEX(Tareas[],OFFSET('Datos del gráfico'!$G11,IncrementoDeDesplazamiento[incremento de desplazamiento],0,1,1),4),\"\")),\"\")","v":"Actividad 6"},{"$f":"IFERROR(IF(LEN(DatosDeTareaDinámicos[[#This Row],[Tareas]])=0,$B$11,INDEX(Tareas[],OFFSET('Datos del gráfico'!$G11,IncrementoDeDesplazamiento[incremento de desplazamiento],0,1,1),2)),\"\")","v":"2018-08-28"},{"$f":"IFERROR(IF(LEN(DatosDeTareaDinámicos[[#This Row],[Tareas]])=0,0,IF(AND('Datos del gráfico'!$H11<=$B$12,'Datos del gráfico'!$I11>=$B$12),ABS(OFFSET('Datos del gráfico'!$H11,IncrementoDeDesplazamiento[incremento de desplazamiento],0,1,1)-$B$12)+1,OFFSET('Datos del gráfico'!$K11,IncrementoDeDesplazamiento[incremento de desplazamiento],0,1,1))),\"\")","v":3},{"$f":"IFERROR(IF(LEN(DatosDeTareaDinámicos[[#This Row],[Tareas]])=0,\"\",3),\"\")","v":3},null,{"$f":"IFERROR(IF(LEN('Datos del gráfico'!D8)=0,\"\",IF(AND('Datos del gráfico'!D8<=$B$12,'Datos del gráfico'!D8>=$B$11-$D$11),'Datos del gráfico'!E8,\"\")),\"\")","v":""},{"$f":"IFERROR(IF(LEN(DatosDeHitosDinámicos[[#This Row],[Hitos]])=0,$B$12,'Datos del gráfico'!$D8),2)","v":"2018-08-30"},{"$f":"IFERROR(IF(LEN(DatosDeHitosDinámicos[[#This Row],[Hitos]])=0,\"\",'Datos del gráfico'!$C8),\"\")","v":""}]
{"$rows_left_out":13}
{"sheet":"Acerca de","index":3,"n_rows":11,"n_cols":1,"rows_kept":11}
["Acerca de este libro"]
["Escribe la información del hito y la tarea en la hoja de cálculo de datos del gráfico. Para ubicar hitos en la escala de tiempo, escribe 0 en el campo de número de columna, a continuación, actualiza la posición de la etiqueta a \"debajo\" para evitar la superposición de etiquetas.\n\nLa columna de posición de la tabla de hito ubica los hitos dentro del gráfico de tareas, ya sea en la misma fila o en filas apiladas. Para representarlos en la misma fila, escribe el mismo número para cada hito en esta columna. Para representarlos en filas diferentes, escribe números diferentes. Los datos de ejemplo representan todos los hitos en la posición de fila 2.\n"]
["Guía para los lectores de pantalla"]
["\nHay 4 hojas de cálculo en este libro. \n\nDatos del gráfico\nDiagrama de Gantt\nDatos de gráf. dinámico (ocultos)\nAcerca de\n\nLas instrucciones para cada hoja de cálculo están en la columna A a partir de la celda A1 de cada hoja de cálculo. Se escriben con texto oculto. Cada paso te guiará por la información de esa fila. Cada paso subsiguiente continúa en la celda A2, A3 y así sucesivamente, a menos que se indique lo contrario de forma explícita. Por ejemplo, el texto de instrucciones podría decir \"pasar a la celda A6\" para el siguiente paso. \n\nEl texto oculto no se imprimirá.\nPara quitar estas instrucciones de cualquier hoja de cálculo, basta con eliminar la columna A.\n"]
["Datos de gráf. dinámico (ocultos)"]
["\nNo elimines ni modifiques contenido en la hoja de cálculo oculta. Si lo haces, puedes poner en peligro la integridad de los diagramas de Gantt.\n\nLa información puede aparecer en blanco y las fechas pueden parecer incorrectas. No rellenes, edites, elimines ni modifiques los datos o correrás el riesgo de sobrescribir fórmulas y arruinar la capacidad de realizar gráficos del diagrama.\n\nLa tabla HitosDinámicos permite representar 15 hitos. Para representar más de 15, simplemente expande la tabla para que abarque la cantidad deseada. Recuerda que solo debes agregar los datos reales del hito en la hoja de cálculo de datos del gráfico.\n"]
["Sugerencias"]
["\nDe forma predeterminada, los hitos se representan en la fila 1 del diagrama de Gantt con la columna de posición de la hoja de cálculo de datos del gráfico, comenzando por la celda C5. Para ubicar los hitos en filas diferentes, basta con cambiar el número. \n"]
["La configuración predeterminada es resaltar la fecha de hoy en el diagrama de Gantt. Para dejar de resaltar Hoy, simplemente selecciona \"no\" en la hoja de cálculo de datos del gráfico en la celda E2.\n"]
["La escala de tiempo de fecha del diagrama de Gantt se representa con un intervalo de 5 fechas. Para cambiarlo, selecciona la escala de tiempo de la hoja de cálculo del diagrama de Gantt y selecciona el formato de ejes. Cambiar la unidad principal de 5 a 1 o 10, por ejemplo. \n"]
["Esta es la última instrucción en esta hoja de cálculo."]