{"text_format":"3","workbook":"xlsx","n_sheets":7,"sheets":["Introducción","Entrada del usuario","Llaves","Ranking de la NCAA","Anotación de ataque","Anotación de defensa","% de ganados y perdidos"],"not_rendered":{"images":7,"defined_names":8},"read":"whole","date_system":"1900"}

{"sheet":"Introducción","index":0,"n_rows":16,"n_cols":14,"rows_kept":16,"merged":[[5,1,5,11],[6,1,6,11],[7,2,7,11],[13,1,13,3],[15,1,15,11]]}
[{"$nulls":13}," "]
[]
[]
[null,"Te damos la bienvenida a la herramienta de predicción de llaves para torneos de baloncesto."]
[]
[null,"Esta herramienta te permite ingresar tus propias ponderaciones a diferentes rangos y estadísticas establecidos, así como a tus propias predicciones de rendimiento para predecir los ganadores de todos los enfrentamientos en el torneo."]
[null,"Los participantes del torneo, rankings, estadísticas, cuatro primeros enfrentamientos y enfrentamientos de la primera ronda se cargaron previamente en las celdas grises de la hoja de cálculo.  "]
[null,"Paso 1","En la hoja de cálculo de datos proporcionados por el usuario, simplemente asigna tus propias predicciones de rendimiento y ponderación a las celdas de color verde claro."]
[null,"Paso 2","Verifica los resultados de los datos ingresados en la hoja de cálculo Llaves."]
[]
[null,"Y eso es todo, ya puedes pronosticar quién será el campeón nacional."]
[]
[null,"¿Estás interesado en un enfoque diferente?"]
[null,"Buscar las predicciones de Bing aquí"]
[]
[null,"Nota: Esta herramienta es ofrecida por Microsoft Corporation. No cuenta con patrocinio ni apoyo de la NCAA, ni está afiliada a ella. Esta herramienta es solo para diversión y no fue diseñada para usar en apuestas ni en otras actividades que generan valor. No formulamos ninguna declaración respecto de la precisión de las predicciones ni de las llaves derivadas de esta herramienta."]

{"sheet":"Entrada del usuario","index":1,"n_rows":77,"n_cols":28,"rows_kept":77,"merged":[[4,1,4,2],[4,3,4,6],[4,7,4,8],[5,1,5,2],[8,1,8,2]]}
[{"$nulls":15}," "]
[]
[]
[]
[null,"Nombre de usuario",null,"4 semifinalistas proyectados",{"$nulls":3},"Finalistas proyectados",{"$nulls":6},"Campeón"]
[null,"Escribe el nombre de usuario",null,{"$f":"+Llaves!W34","v":"Duke"},{"$f":"+Llaves!W98","v":"Gonzaga"},{"$f":"+Llaves!AO34","v":"Virginia"},{"$f":"+Llaves!AO98","v":"Houston"},{"$f":"+Llaves!AB66","v":"Gonzaga"},{"$f":"+Llaves!AJ66","v":"Virginia"},{"$nulls":5},{"$f":"+Llaves!AF66","v":"Virginia"}]
[]
[{"$nulls":16},{"$f":"+D8","v":0},{"$f":"+E8","v":0},{"$f":"+F8","v":0},{"$f":"+G8","v":0},{"$f":"+H8","v":0},{"$f":"+I8","v":0},{"$f":"+J8","v":0},{"$f":"+K8","v":0},{"$f":"+L8","v":0},{"$f":"+M8","v":0},{"$f":"+N8","v":0},{"$f":"+O8","v":0}]
[null,"Ponderación de columna asignada por el usuario \nEntre 0 (no usar) y 10 (factor más alto)",null,5,1,1,1,2,5,0,0,0,{"$nulls":4},{"$f":"+D9","v":5},{"$f":"+E9","v":1},{"$f":"+F9","v":1},{"$f":"+G9","v":1},2,5,0,0,0]
[null,1,"Duke",1,{"$f":"VLOOKUP(C10,'Ranking de la NCAA'!$D$6:$L$358,9,FALSE)","v":3},{"$f":"VLOOKUP(C10,'Anotación de ataque'!$C$6:$F$356,4,FALSE)","v":84.1},{"$f":"VLOOKUP(C10,'Anotación de defensa'!$C$6:$F$356,4,FALSE)","v":67.4},{"$f":"VLOOKUP(C10,'% de ganados y perdidos'!$C$6:$F$356,4,FALSE)/100","v":{"v":0.8390000000000001,"d":"83.9%"}},5,0,0,0,null,null,{"$f":"+AB10","v":{"v":7.464329405038098,"d":"7.46"}},null,{"$f":"_xlfn.RANK.EQ(D10,D$10:D$77,0)/COUNT($B$10:$B$77)*10","v":{"v":10,"d":"10.00"}},{"$f":"_xlfn.RANK.EQ(E10,E$10:E$77,0)/COUNT($B$10:$B$77)*10","v":{"v":9.705882352941176,"d":"9.71"}},{"$f":"((F10-MIN(F$10:F$77))/(MAX(F$10:F$77)-MIN(F$10:F$77)))*10","v":{"v":7.947598253275108,"d":"7.95"}},{"$f":"10-((G10-MIN(G$10:G$77))/(MAX(G$10:G$77)-MIN(G$10:G$77)))*10","v":{"v":3.9047619047619007,"d":"3.90"}},{"$f":"((H10-MIN(H$10:H$77))/(MAX(H$10:H$77)-MIN(H$10:H$77)))*10","v":{"v":7.703349282296652,"d":"7.70"}},{"$f":"+I10","v":5},{"$f":"+J10","v":0},{"$f":"+K10","v":0},{"$f":"+L10","v":0},null,null,{"$f":"+(Q10*Q$9+R10*R$9+S10*S$9+T10*T$9+U10*U$9+V10*V$9+W10*W$9+X10*X$9+Y10*Y$9)/SUM(Q$9:Y$9)","v":{"v":7.464329405038098,"d":"7.46"}}]
[null,2,"Virginia",2,{"$f":"VLOOKUP(C11,'Ranking de la NCAA'!$D$6:$L$358,9,FALSE)","v":1},{"$f":"VLOOKUP(C11,'Anotación de ataque'!$C$6:$F$356,4,FALSE)","v":72.1},{"$f":"VLOOKUP(C11,'Anotación de defensa'!$C$6:$F$356,4,FALSE)","v":54.6},{"$f":"VLOOKUP(C11,'% de ganados y perdidos'!$C$6:$F$356,4,FALSE)/100","v":{"v":0.9329999999999999,"d":"93.3%"}},5,0,0,0,null,null,{"$f":"+AB11","v":{"v":7.791762378882311,"d":"7.79"}},null,{"$f":"_xlfn.RANK.EQ(D11,D$10:D$77,0)/COUNT($B$10:$B$77)*10","v":{"v":9.852941176470589,"d":"9.85"}},{"v":10,"d":"10.00"},{"v":2.7074235807860223,"d":"2.71"},{"v":10,"d":"10.00"},{"v":9.952153110047844,"d":"9.95"},{"$f":"+I11","v":5},0,0,0,null,null,{"v":7.791762378882311,"d":"7.79"}]
[null,3,"North Carolina",3,{"$f":"VLOOKUP(C12,'Ranking de la NCAA'!$D$6:$L$358,9,FALSE)","v":7},{"$f":"VLOOKUP(C12,'Anotación de ataque'!$C$6:$F$356,4,FALSE)","v":86.6},{"$f":"VLOOKUP(C12,'Anotación de defensa'!$C$6:$F$356,4,FALSE)","v":72.9},{"$f":"VLOOKUP(C12,'% de ganados y perdidos'!$C$6:$F$356,4,FALSE)/100","v":{"v":0.8390000000000001,"d":"83.9%"}},5,0,0,0,null,null,{"v":7.22525153225871,"d":"7.23"},null,{"v":9.705882352941176,"d":"9.71"},{"v":9.117647058823529,"d":"9.12"},{"v":9.039301310043667,"d":"9.04"},{"v":1.2857142857142811,"d":"1.29"},{"v":7.703349282296652,"d":"7.70"},5,0,0,0,null,null,{"v":7.22525153225871,"d":"7.23"}]
[null,4,"Gonzaga",4,{"$f":"VLOOKUP(C13,'Ranking de la NCAA'!$D$6:$L$358,9,FALSE)","v":2},{"$f":"VLOOKUP(C13,'Anotación de ataque'!$C$6:$F$356,4,FALSE)","v":88.8},{"$f":"VLOOKUP(C13,'Anotación de defensa'!$C$6:$F$356,4,FALSE)","v":65.1},{"$f":"VLOOKUP(C13,'% de ganados y perdidos'!$C$6:$F$356,4,FALSE)/100","v":{"v":0.909,"d":"90.9%"}},5,0,0,0,null,null,{"v":7.760202645651562,"d":"7.76"},null,{"v":9.558823529411764,"d":"9.56"},{"v":9.852941176470589,"d":"9.85"},{"v":10,"d":"10.00"},{"v":5.000000000000002,"d":"5.00"},{"v":9.377990430622008,"d":"9.38"},5,0,0,0,null,null,{"v":7.760202645651562,"d":"7.76"}]
[null,5,"Tennessee",5,{"$f":"VLOOKUP(C14,'Ranking de la NCAA'!$D$6:$L$358,9,FALSE)","v":5},{"$f":"VLOOKUP(C14,'Anotación de ataque'!$C$6:$F$356,4,FALSE)","v":82.3},{"$f":"VLOOKUP(C14,'Anotación de defensa'!$C$6:$F$356,4,FALSE)","v":67.6},{"$f":"VLOOKUP(C14,'% de ganados y perdidos'!$C$6:$F$356,4,FALSE)/100","v":{"v":0.871,"d":"87.1%"}},5,0,0,0,null,null,{"v":7.291965542685459,"d":"7.29"},null,{"v":9.411764705882353,"d":"9.41"},{"v":9.411764705882353,"d":"9.41"},{"v":7.161572052401746,"d":"7.16"},{"v":3.80952380952381,"d":"3.81"},{"v":8.4688995215311,"d":"8.47"},5,0,0,0,null,null,{"v":7.291965542685459,"d":"7.29"}]
[null,6,"Michigan St.",6,{"$f":"VLOOKUP(C15,'Ranking de la NCAA'!$D$6:$L$358,9,FALSE)","v":8},{"$f":"VLOOKUP(C15,'Anotación de ataque'!$C$6:$F$356,4,FALSE)","v":79.7},{"$f":"VLOOKUP(C15,'Anotación de defensa'!$C$6:$F$356,4,FALSE)","v":65.9},{"$f":"VLOOKUP(C15,'% de ganados y perdidos'!$C$6:$F$356,4,FALSE)/100","v":{"v":0.8059999999999999,"d":"80.6%"}},5,0,0,0,null,null,{"v":6.984474489042742,"d":"6.98"},null,{"v":9.264705882352942,"d":"9.26"},{"v":8.970588235294118,"d":"8.97"},{"v":6.026200873362447,"d":"6.03"},{"v":4.619047619047615,"d":"4.62"},{"v":6.913875598086122,"d":"6.91"},5,0,0,0,null,null,{"v":6.984474489042742,"d":"6.98"}]
[null,7,"Kentucky",7,{"$f":"VLOOKUP(C16,'Ranking de la NCAA'!$D$6:$L$358,9,FALSE)","v":6},{"$f":"VLOOKUP(C16,'Anotación de ataque'!$C$6:$F$356,4,FALSE)","v":76.8},{"$f":"VLOOKUP(C16,'Anotación de defensa'!$C$6:$F$356,4,FALSE)","v":65.2},{"$f":"VLOOKUP(C16,'% de ganados y perdidos'!$C$6:$F$356,4,FALSE)/100","v":{"v":0.8390000000000001,"d":"83.9%"}},5,0,0,0,null,null,{"v":6.998123068063717,"d":"7.00"},null,{"v":9.117647058823529,"d":"9.12"},{"v":9.264705882352942,"d":"9.26"},{"$f":"((F16-MIN(F$10:F$77))/(MAX(F$10:F$77)-MIN(F$10:F$77)))*10","v":{"v":4.759825327510915,"d":"4.76"}},{"$f":"10-((G16-MIN(G$10:G$77))/(MAX(G$10:G$77)-MIN(G$10:G$77)))*10","v":{"v":4.952380952380951,"d":"4.95"}},{"$f":"((H16-MIN(H$10:H$77))/(MAX(H$10:H$77)-MIN(H$10:H$77)))*10","v":{"v":7.703349282296652,"d":"7.70"}},{"$f":"+I16","v":5},{"$f":"+J16","v":0},{"$f":"+K16","v":0},{"$f":"+L16","v":0},null,null,{"v":6.998123068063717,"d":"7.00"}]
[null,8,"Michigan",8,{"$f":"VLOOKUP(C17,'Ranking de la NCAA'!$D$6:$L$358,9,FALSE)","v":9},{"$f":"VLOOKUP(C17,'Anotación de ataque'!$C$6:$F$356,4,FALSE)","v":70.4},{"$f":"VLOOKUP(C17,'Anotación de defensa'!$C$6:$F$356,4,FALSE)","v":58.8},{"$f":"VLOOKUP(C17,'% de ganados y perdidos'!$C$6:$F$356,4,FALSE)/100","v":{"v":0.8390000000000001,"d":"83.9%"}},5,0,0,0,null,null,{"v":6.9365489770007995,"d":"6.94"},null,{"v":8.970588235294118,"d":"8.97"},{"v":8.823529411764707,"d":"8.82"},{"$f":"((F17-MIN(F$10:F$77))/(MAX(F$10:F$77)-MIN(F$10:F$77)))*10","v":{"v":1.965065502183407,"d":"1.97"}},{"$f":"10-((G17-MIN(G$10:G$77))/(MAX(G$10:G$77)-MIN(G$10:G$77)))*10","v":{"v":8.000000000000002,"d":"8.00"}},{"$f":"((H17-MIN(H$10:H$77))/(MAX(H$10:H$77)-MIN(H$10:H$77)))*10","v":{"v":7.703349282296652,"d":"7.70"}},5,0,0,0,null,null,{"v":6.9365489770007995,"d":"6.94"}]
[null,9,"Houston",9,{"$f":"VLOOKUP(C18,'Ranking de la NCAA'!$D$6:$L$358,9,FALSE)","v":4},{"$f":"VLOOKUP(C18,'Anotación de ataque'!$C$6:$F$356,4,FALSE)","v":76.4},{"$f":"VLOOKUP(C18,'Anotación de defensa'!$C$6:$F$356,4,FALSE)","v":61.6},{"$f":"VLOOKUP(C18,'% de ganados y perdidos'!$C$6:$F$356,4,FALSE)/100","v":{"v":0.935,"d":"93.5%"}},5,0,0,0,null,null,{"v":7.328552672888661,"d":"7.33"},null,{"v":8.823529411764707,"d":"8.82"},{"v":9.558823529411764,"d":"9.56"},{"v":4.585152838427949,"d":"4.59"},{"v":6.666666666666666,"d":"6.67"},{"v":10,"d":"10.00"},5,0,0,0,null,null,{"v":7.328552672888661,"d":"7.33"}]
[null,10,"Texas Tech",10,{"$f":"VLOOKUP(C19,'Ranking de la NCAA'!$D$6:$L$358,9,FALSE)","v":10},{"$f":"VLOOKUP(C19,'Anotación de ataque'!$C$6:$F$356,4,FALSE)","v":73.1},{"$f":"VLOOKUP(C19,'Anotación de defensa'!$C$6:$F$356,4,FALSE)","v":58.6},{"$f":"VLOOKUP(C19,'% de ganados y perdidos'!$C$6:$F$356,4,FALSE)/100","v":{"v":0.8390000000000001,"d":"83.9%"}},5,0,0,0,null,null,{"v":6.9136576661824405,"d":"6.91"},null,{"v":8.676470588235293,"d":"8.68"},{"v":8.676470588235293,"d":"8.68"},{"v":3.144104803493446,"d":"3.14"},{"v":8.095238095238095,"d":"8.10"},{"v":7.703349282296652,"d":"7.70"},5,0,0,0,null,null,{"v":6.9136576661824405,"d":"6.91"}]
[null,11,"LSU",11,{"$f":"VLOOKUP(C20,'Ranking de la NCAA'!$D$6:$L$358,9,FALSE)","v":14},{"$f":"VLOOKUP(C20,'Anotación de ataque'!$C$6:$F$356,4,FALSE)","v":81.6},{"$f":"VLOOKUP(C20,'Anotación de defensa'!$C$6:$F$356,4,FALSE)","v":72.9},{"$f":"VLOOKUP(C20,'% de ganados y perdidos'!$C$6:$F$356,4,FALSE)/100","v":{"v":0.8390000000000001,"d":"83.9%"}},5,0,0,0,null,null,{"v":6.618906810964079,"d":"6.62"},null,{"v":8.529411764705882,"d":"8.53"},{"v":8.088235294117647,"d":"8.09"},{"v":6.855895196506547,"d":"6.86"},{"v":1.2857142857142811,"d":"1.29"},{"v":7.703349282296652,"d":"7.70"},5,0,0,0,null,null,{"v":6.618906810964079,"d":"6.62"}]
[null,12,"Purdue",12,{"$f":"VLOOKUP(C21,'Ranking de la NCAA'!$D$6:$L$358,9,FALSE)","v":12},{"$f":"VLOOKUP(C21,'Anotación de ataque'!$C$6:$F$356,4,FALSE)","v":76.3},{"$f":"VLOOKUP(C21,'Anotación de defensa'!$C$6:$F$356,4,FALSE)","v":66.5},{"$f":"VLOOKUP(C21,'% de ganados y perdidos'!$C$6:$F$356,4,FALSE)/100","v":{"v":0.742,"d":"74.2%"}},5,0,0,0,null,null,{"v":6.328965729052253,"d":"6.33"},null,{"v":8.382352941176471,"d":"8.38"},{"v":8.382352941176471,"d":"8.38"},{"v":4.541484716157203,"d":"4.54"},{"v":4.333333333333332,"d":"4.33"},{"v":5.382775119617223,"d":"5.38"},5,0,0,0,null,null,{"v":6.328965729052253,"d":"6.33"}]
[null,13,"Kansas",13,{"$f":"VLOOKUP(C22,'Ranking de la NCAA'!$D$6:$L$358,9,FALSE)","v":20},{"$f":"VLOOKUP(C22,'Anotación de ataque'!$C$6:$F$356,4,FALSE)","v":75.6},{"$f":"VLOOKUP(C22,'Anotación de defensa'!$C$6:$F$356,4,FALSE)","v":70.1},{"$f":"VLOOKUP(C22,'% de ganados y perdidos'!$C$6:$F$356,4,FALSE)/100","v":{"v":0.742,"d":"74.2%"}},5,0,0,0,null,null,{"v":6.066850577314702,"d":"6.07"},null,{"v":8.235294117647058,"d":"8.24"},{"v":7.205882352941177,"d":"7.21"},{"v":4.235807860262005,"d":"4.24"},{"v":2.6190476190476195,"d":"2.62"},{"v":5.382775119617223,"d":"5.38"},5,0,0,0,null,null,{"v":6.066850577314702,"d":"6.07"}]
[null,14,"Florida St.",14,{"$f":"VLOOKUP(C23,'Ranking de la NCAA'!$D$6:$L$358,9,FALSE)","v":16},{"$f":"VLOOKUP(C23,'Anotación de ataque'!$C$6:$F$356,4,FALSE)","v":75.8},{"$f":"VLOOKUP(C23,'Anotación de defensa'!$C$6:$F$356,4,FALSE)","v":67.3},{"$f":"VLOOKUP(C23,'% de ganados y perdidos'!$C$6:$F$356,4,FALSE)/100","v":{"v":0.8059999999999999,"d":"80.6%"}},5,0,0,0,null,null,{"v":6.35590469140025,"d":"6.36"},null,{"v":8.088235294117647,"d":"8.09"},{"v":7.794117647058823,"d":"7.79"},{"v":4.323144104803491,"d":"4.32"},{"v":3.9523809523809526,"d":"3.95"},{"v":6.913875598086122,"d":"6.91"},5,0,0,0,null,null,{"v":6.35590469140025,"d":"6.36"}]
[null,15,"Kansas St.",15,{"$f":"VLOOKUP(C24,'Ranking de la NCAA'!$D$6:$L$358,9,FALSE)","v":24},{"$f":"VLOOKUP(C24,'Anotación de ataque'!$C$6:$F$356,4,FALSE)","v":65.9},{"$f":"VLOOKUP(C24,'Anotación de defensa'!$C$6:$F$356,4,FALSE)","v":59.1},{"$f":"VLOOKUP(C24,'% de ganados y perdidos'!$C$6:$F$356,4,FALSE)/100","v":{"v":0.774,"d":"77.4%"}},5,0,0,0,null,null,{"v":6.098488199107393,"d":"6.10"},null,{"v":7.941176470588235,"d":"7.94"},{"v":6.617647058823529,"d":"6.62"},{"v":0,"d":"0.00"},{"v":7.857142857142856,"d":"7.86"},{"v":6.1483253588516735,"d":"6.15"},5,0,0,0,null,null,{"v":6.098488199107393,"d":"6.10"}]
[null,16,"Virginia Tech",16,{"$f":"VLOOKUP(C25,'Ranking de la NCAA'!$D$6:$L$358,9,FALSE)","v":11},{"$f":"VLOOKUP(C25,'Anotación de ataque'!$C$6:$F$356,4,FALSE)","v":74.5},{"$f":"VLOOKUP(C25,'Anotación de defensa'!$C$6:$F$356,4,FALSE)","v":{"v":62,"d":"62.0"}},{"$f":"VLOOKUP(C25,'% de ganados y perdidos'!$C$6:$F$356,4,FALSE)/100","v":{"v":0.774,"d":"77.4%"}},5,0,0,0,null,null,{"v":6.335219980611844,"d":"6.34"},null,{"v":7.794117647058823,"d":"7.79"},{"v":8.529411764705882,"d":"8.53"},{"v":3.7554585152838413,"d":"3.76"},{"v":6.476190476190476,"d":"6.48"},{"v":6.1483253588516735,"d":"6.15"},5,0,0,0,null,null,{"v":6.335219980611844,"d":"6.34"}]
[null,17,"Marquette",17,{"$f":"VLOOKUP(C26,'Ranking de la NCAA'!$D$6:$L$358,9,FALSE)","v":28},{"$f":"VLOOKUP(C26,'Anotación de ataque'!$C$6:$F$356,4,FALSE)","v":77.4},{"$f":"VLOOKUP(C26,'Anotación de defensa'!$C$6:$F$356,4,FALSE)","v":69.2},{"$f":"VLOOKUP(C26,'% de ganados y perdidos'!$C$6:$F$356,4,FALSE)/100","v":{"v":0.742,"d":"74.2%"}},5,0,0,0,null,null,{"v":5.873313948689454,"d":"5.87"},null,{"v":7.647058823529411,"d":"7.65"},{"v":6.029411764705882,"d":"6.03"},{"v":5.0218340611353725,"d":"5.02"},{"v":3.047619047619045,"d":"3.05"},{"v":5.382775119617223,"d":"5.38"},5,0,0,0,null,null,{"v":5.873313948689454,"d":"5.87"}]
[null,18,"Auburn",18,{"$f":"VLOOKUP(C27,'Ranking de la NCAA'!$D$6:$L$358,9,FALSE)","v":18},{"$f":"VLOOKUP(C27,'Anotación de ataque'!$C$6:$F$356,4,FALSE)","v":80.1},{"$f":"VLOOKUP(C27,'Anotación de defensa'!$C$6:$F$356,4,FALSE)","v":68.5},{"$f":"VLOOKUP(C27,'% de ganados y perdidos'!$C$6:$F$356,4,FALSE)/100","v":{"v":0.71,"d":"71.0%"}},5,0,0,0,null,null,{"v":5.92108503361089,"d":"5.92"},null,{"v":7.5,"d":"7.50"},{"v":7.5,"d":"7.50"},{"v":6.200873362445413,"d":"6.20"},{"v":3.3809523809523787,"d":"3.38"},{"v":4.617224880382774,"d":"4.62"},5,0,0,0,null,null,{"v":5.92108503361089,"d":"5.92"}]
[null,19,"Wisconsin",19,{"$f":"VLOOKUP(C28,'Ranking de la NCAA'!$D$6:$L$358,9,FALSE)","v":17},{"$f":"VLOOKUP(C28,'Anotación de ataque'!$C$6:$F$356,4,FALSE)","v":69.6},{"$f":"VLOOKUP(C28,'Anotación de defensa'!$C$6:$F$356,4,FALSE)","v":61.2},{"$f":"VLOOKUP(C28,'% de ganados y perdidos'!$C$6:$F$356,4,FALSE)/100","v":{"v":0.71,"d":"71.0%"}},5,0,0,0,null,null,{"v":5.807938523187215,"d":"5.81"},null,{"v":7.352941176470589,"d":"7.35"},{"v":7.647058823529411,"d":"7.65"},{"v":1.615720524017463,"d":"1.62"},{"v":6.857142857142856,"d":"6.86"},{"v":4.617224880382774,"d":"4.62"},5,0,0,0,null,null,{"v":5.807938523187215,"d":"5.81"}]
[null,20,"Mississippi St.",20,{"$f":"VLOOKUP(C29,'Ranking de la NCAA'!$D$6:$L$358,9,FALSE)","v":19},{"$f":"VLOOKUP(C29,'Anotación de ataque'!$C$6:$F$356,4,FALSE)","v":77.3},{"$f":"VLOOKUP(C29,'Anotación de defensa'!$C$6:$F$356,4,FALSE)","v":70.2},{"$f":"VLOOKUP(C29,'% de ganados y perdidos'!$C$6:$F$356,4,FALSE)/100","v":{"v":0.71,"d":"71.0%"}},5,0,0,0,null,null,{"v":5.677759814149014,"d":"5.68"},null,{"v":7.205882352941177,"d":"7.21"},{"v":7.352941176470589,"d":"7.35"},{"v":4.9781659388646275,"d":"4.98"},{"v":2.5714285714285676,"d":"2.57"},{"v":4.617224880382774,"d":"4.62"},5,0,0,0,null,null,{"v":5.677759814149014,"d":"5.68"}]
[null,21,"Villanova",21,{"$f":"VLOOKUP(C30,'Ranking de la NCAA'!$D$6:$L$358,9,FALSE)","v":26},{"$f":"VLOOKUP(C30,'Anotación de ataque'!$C$6:$F$356,4,FALSE)","v":74.6},{"$f":"VLOOKUP(C30,'Anotación de defensa'!$C$6:$F$356,4,FALSE)","v":67.1},{"$f":"VLOOKUP(C30,'% de ganados y perdidos'!$C$6:$F$356,4,FALSE)/100","v":{"v":0.71,"d":"71.0%"}},5,0,0,0,null,null,{"v":5.579922833650847,"d":"5.58"},null,{"v":7.058823529411765,"d":"7.06"},{"v":6.323529411764706,"d":"6.32"},{"v":3.799126637554582,"d":"3.80"},{"v":4.047619047619049,"d":"4.05"},{"v":4.617224880382774,"d":"4.62"},5,0,0,0,null,null,{"v":5.579922833650847,"d":"5.58"}]
[null,22,"Maryland",22,{"$f":"VLOOKUP(C31,'Ranking de la NCAA'!$D$6:$L$358,9,FALSE)","v":27},{"$f":"VLOOKUP(C31,'Anotación de ataque'!$C$6:$F$356,4,FALSE)","v":71.7},{"$f":"VLOOKUP(C31,'Anotación de defensa'!$C$6:$F$356,4,FALSE)","v":64.9},{"$f":"VLOOKUP(C31,'% de ganados y perdidos'!$C$6:$F$356,4,FALSE)/100","v":{"v":0.71,"d":"71.0%"}},5,0,0,0,null,null,{"v":5.506515537690251,"d":"5.51"},null,{"v":6.911764705882353,"d":"6.91"},{"v":6.176470588235294,"d":"6.18"},{"v":2.5327510917030565,"d":"2.53"},{"v":5.095238095238091,"d":"5.10"},{"v":4.617224880382774,"d":"4.62"},5,0,0,0,null,null,{"v":5.506515537690251,"d":"5.51"}]
[null,23,"Buffalo",23,{"$f":"VLOOKUP(C32,'Ranking de la NCAA'!$D$6:$L$358,9,FALSE)","v":15},{"$f":"VLOOKUP(C32,'Anotación de ataque'!$C$6:$F$356,4,FALSE)","v":{"v":85,"d":"85.0"}},{"$f":"VLOOKUP(C32,'Anotación de defensa'!$C$6:$F$356,4,FALSE)","v":70.9},{"$f":"VLOOKUP(C32,'% de ganados y perdidos'!$C$6:$F$356,4,FALSE)/100","v":{"v":0.903,"d":"90.3%"}},5,0,0,0,null,null,{"v":6.387487466379404,"d":"6.39"},null,{"v":6.764705882352942,"d":"6.76"},{"v":7.941176470588235,"d":"7.94"},{"v":8.340611353711791,"d":"8.34"},{"v":2.2380952380952337,"d":"2.24"},{"v":9.23444976076555,"d":"9.23"},5,0,0,0,null,null,{"v":6.387487466379404,"d":"6.39"}]
[null,24,"Iowa St.",24,{"$f":"VLOOKUP(C33,'Ranking de la NCAA'!$D$6:$L$358,9,FALSE)","v":21},{"$f":"VLOOKUP(C33,'Anotación de ataque'!$C$6:$F$356,4,FALSE)","v":77.7},{"$f":"VLOOKUP(C33,'Anotación de defensa'!$C$6:$F$356,4,FALSE)","v":68.8},{"$f":"VLOOKUP(C33,'% de ganados y perdidos'!$C$6:$F$356,4,FALSE)/100","v":{"v":0.645,"d":"64.5%"}},5,0,0,0,null,null,{"v":5.31082629356319,"d":"5.31"},null,{"v":6.617647058823529,"d":"6.62"},{"v":7.058823529411765,"d":"7.06"},{"v":5.152838427947599,"d":"5.15"},{"v":3.2380952380952372,"d":"3.24"},{"v":3.062200956937799,"d":"3.06"},5,0,0,0,null,null,{"v":5.31082629356319,"d":"5.31"}]
[null,25,"Louisville",25,{"$f":"VLOOKUP(C34,'Ranking de la NCAA'!$D$6:$L$358,9,FALSE)","v":22},{"$f":"VLOOKUP(C34,'Anotación de ataque'!$C$6:$F$356,4,FALSE)","v":74.7},{"$f":"VLOOKUP(C34,'Anotación de defensa'!$C$6:$F$356,4,FALSE)","v":67.3},{"$f":"VLOOKUP(C34,'% de ganados y perdidos'!$C$6:$F$356,4,FALSE)/100","v":{"v":0.625,"d":"62.5%"}},5,0,0,0,null,null,{"v":5.14848971395945,"d":"5.15"},null,{"v":6.470588235294118,"d":"6.47"},{"v":6.911764705882353,"d":"6.91"},{"v":3.8427947598253276,"d":"3.84"},{"v":3.9523809523809526,"d":"3.95"},{"v":2.5837320574162677,"d":"2.58"},5,0,0,0,null,null,{"v":5.14848971395945,"d":"5.15"}]
[null,26,"Nevada",26,{"$f":"VLOOKUP(C35,'Ranking de la NCAA'!$D$6:$L$358,9,FALSE)","v":23},{"$f":"VLOOKUP(C35,'Anotación de ataque'!$C$6:$F$356,4,FALSE)","v":81.6},{"$f":"VLOOKUP(C35,'Anotación de defensa'!$C$6:$F$356,4,FALSE)","v":66.6},{"$f":"VLOOKUP(C35,'% de ganados y perdidos'!$C$6:$F$356,4,FALSE)/100","v":{"v":0.903,"d":"90.3%"}},5,0,0,0,null,null,{"v":6.199524129661893,"d":"6.20"},null,{"v":6.323529411764706,"d":"6.32"},{"v":6.764705882352942,"d":"6.76"},{"v":6.855895196506547,"d":"6.86"},{"v":4.285714285714287,"d":"4.29"},{"v":9.23444976076555,"d":"9.23"},5,0,0,0,null,null,{"v":6.199524129661893,"d":"6.20"}]
[null,27,"Cincinnati",27,{"$f":"VLOOKUP(C36,'Ranking de la NCAA'!$D$6:$L$358,9,FALSE)","v":25},{"$f":"VLOOKUP(C36,'Anotación de ataque'!$C$6:$F$356,4,FALSE)","v":71.6},{"$f":"VLOOKUP(C36,'Anotación de defensa'!$C$6:$F$356,4,FALSE)","v":{"v":62,"d":"62.0"}},{"$f":"VLOOKUP(C36,'% de ganados y perdidos'!$C$6:$F$356,4,FALSE)/100","v":{"v":0.8059999999999999,"d":"80.6%"}},5,0,0,0,null,null,{"v":5.6763977212177075,"d":"5.68"},null,{"v":6.176470588235294,"d":"6.18"},{"v":6.470588235294118,"d":"6.47"},{"v":2.4890829694323107,"d":"2.49"},{"v":6.476190476190476,"d":"6.48"},{"v":6.913875598086122,"d":"6.91"},5,0,0,0,null,null,{"v":5.6763977212177075,"d":"5.68"}]
[null,28,"Wofford",28,{"$f":"VLOOKUP(C37,'Ranking de la NCAA'!$D$6:$L$358,9,FALSE)","v":13},{"$f":"VLOOKUP(C37,'Anotación de ataque'!$C$6:$F$356,4,FALSE)","v":{"v":83,"d":"83.0"}},{"$f":"VLOOKUP(C37,'Anotación de defensa'!$C$6:$F$356,4,FALSE)","v":65.6},{"$f":"VLOOKUP(C37,'% de ganados y perdidos'!$C$6:$F$356,4,FALSE)/100","v":{"v":0.879,"d":"87.9%"}},5,0,0,0,null,null,{"v":6.195472051603841,"d":"6.20"},null,{"v":6.029411764705882,"d":"6.03"},{"v":8.235294117647058,"d":"8.24"},{"v":7.467248908296944,"d":"7.47"},{"v":4.761904761904764,"d":"4.76"},{"v":8.660287081339712,"d":"8.66"},5,0,0,0,null,null,{"v":6.195472051603841,"d":"6.20"}]
[null,29,"VCU",29,{"$f":"VLOOKUP(C38,'Ranking de la NCAA'!$D$6:$L$358,9,FALSE)","v":34},{"$f":"VLOOKUP(C38,'Anotación de ataque'!$C$6:$F$356,4,FALSE)","v":71.5},{"$f":"VLOOKUP(C38,'Anotación de defensa'!$C$6:$F$356,4,FALSE)","v":61.2},{"$f":"VLOOKUP(C38,'% de ganados y perdidos'!$C$6:$F$356,4,FALSE)/100","v":{"v":0.8059999999999999,"d":"80.6%"}},5,0,0,0,null,null,{"v":5.522412750227857,"d":"5.52"},null,{"v":5.882352941176471,"d":"5.88"},{"v":5.294117647058823,"d":"5.29"},{"v":2.4454148471615706,"d":"2.45"},{"v":6.857142857142856,"d":"6.86"},{"v":6.913875598086122,"d":"6.91"},5,0,0,0,null,null,{"v":5.522412750227857,"d":"5.52"}]
[null,30,"Syracuse",30,{"$f":"VLOOKUP(C39,'Ranking de la NCAA'!$D$6:$L$358,9,FALSE)","v":42},{"$f":"VLOOKUP(C39,'Anotación de ataque'!$C$6:$F$356,4,FALSE)","v":69.5},{"$f":"VLOOKUP(C39,'Anotación de defensa'!$C$6:$F$356,4,FALSE)","v":65.1},{"$f":"VLOOKUP(C39,'% de ganados y perdidos'!$C$6:$F$356,4,FALSE)/100","v":{"v":0.625,"d":"62.5%"}},5,0,0,0,null,null,{"v":4.6649873756150875,"d":"4.66"},null,{"v":5.735294117647058,"d":"5.74"},{"v":4.5588235294117645,"d":"4.56"},{"v":1.572052401746723,"d":"1.57"},{"v":5.000000000000002,"d":"5.00"},{"v":2.5837320574162677,"d":"2.58"},5,0,0,0,null,null,{"v":4.6649873756150875,"d":"4.66"}]
[null,31,"Ole Miss",31,{"$f":"VLOOKUP(C40,'Ranking de la NCAA'!$D$6:$L$358,9,FALSE)","v":36},{"$f":"VLOOKUP(C40,'Anotación de ataque'!$C$6:$F$356,4,FALSE)","v":{"v":76,"d":"76.0"}},{"$f":"VLOOKUP(C40,'Anotación de defensa'!$C$6:$F$356,4,FALSE)","v":70.6},{"$f":"VLOOKUP(C40,'% de ganados y perdidos'!$C$6:$F$356,4,FALSE)/100","v":{"v":0.645,"d":"64.5%"}},5,0,0,0,null,null,{"v":4.733604662552707,"d":"4.73"},null,{"v":5.588235294117647,"d":"5.59"},{"v":5.147058823529411,"d":"5.15"},{"v":4.410480349344978,"d":"4.41"},{"v":2.3809523809523814,"d":"2.38"},{"v":3.062200956937799,"d":"3.06"},5,0,0,0,null,null,{"v":4.733604662552707,"d":"4.73"}]
[null,32,"Utah St.",32,{"$f":"VLOOKUP(C41,'Ranking de la NCAA'!$D$6:$L$358,9,FALSE)","v":29},{"$f":"VLOOKUP(C41,'Anotación de ataque'!$C$6:$F$356,4,FALSE)","v":{"v":79,"d":"79.0"}},{"$f":"VLOOKUP(C41,'Anotación de defensa'!$C$6:$F$356,4,FALSE)","v":66.8},{"$f":"VLOOKUP(C41,'% de ganados y perdidos'!$C$6:$F$356,4,FALSE)/100","v":{"v":0.8059999999999999,"d":"80.6%"}},5,0,0,0,null,null,{"v":5.455132446548888,"d":"5.46"},null,{"v":5.441176470588235,"d":"5.44"},{"v":5.882352941176471,"d":"5.88"},{"v":5.720524017467249,"d":"5.72"},{"v":4.19047619047619,"d":"4.19"},{"v":6.913875598086122,"d":"6.91"},5,0,0,0,null,null,{"v":5.455132446548888,"d":"5.46"}]
[null,33,"Washington",33,{"$f":"VLOOKUP(C42,'Ranking de la NCAA'!$D$6:$L$358,9,FALSE)","v":45},{"$f":"VLOOKUP(C42,'Anotación de ataque'!$C$6:$F$356,4,FALSE)","v":70.4},{"$f":"VLOOKUP(C42,'Anotación de defensa'!$C$6:$F$356,4,FALSE)","v":{"v":64,"d":"64.0"}},{"$f":"VLOOKUP(C42,'% de ganados y perdidos'!$C$6:$F$356,4,FALSE)/100","v":{"v":0.774,"d":"77.4%"}},5,0,0,0,null,null,{"v":5.024917402520928,"d":"5.02"},null,{"v":5.294117647058823,"d":"5.29"},{"v":4.117647058823529,"d":"4.12"},{"v":1.965065502183407,"d":"1.97"},{"v":5.523809523809523,"d":"5.52"},{"v":6.1483253588516735,"d":"6.15"},5,0,0,0,null,null,{"$f":"+(Q42*Q$9+R42*R$9+S42*S$9+T42*T$9+U42*U$9+V42*V$9+W42*W$9+X42*X$9+Y42*Y$9)/SUM(Q$9:Y$9)","v":{"v":5.024917402520928,"d":"5.02"}}]
[null,34,"UCF",34,{"$f":"VLOOKUP(C43,'Ranking de la NCAA'!$D$6:$L$358,9,FALSE)","v":30},{"$f":"VLOOKUP(C43,'Anotación de ataque'!$C$6:$F$356,4,FALSE)","v":72.7},{"$f":"VLOOKUP(C43,'Anotación de defensa'!$C$6:$F$356,4,FALSE)","v":63.8},{"$f":"VLOOKUP(C43,'% de ganados y perdidos'!$C$6:$F$356,4,FALSE)/100","v":{"v":0.767,"d":"76.7%"}},5,0,0,0,null,null,{"v":5.134719377119366,"d":"5.13"},null,{"v":5.147058823529411,"d":"5.15"},{"v":5.735294117647058,"d":"5.74"},{"v":2.96943231441048,"d":"2.97"},{"v":5.6190476190476195,"d":"5.62"},{"v":5.980861244019138,"d":"5.98"},5,0,0,0,null,null,{"v":5.134719377119366,"d":"5.13"}]
[null,35,"Baylor",35,{"$f":"VLOOKUP(C44,'Ranking de la NCAA'!$D$6:$L$358,9,FALSE)","v":39},{"$f":"VLOOKUP(C44,'Anotación de ataque'!$C$6:$F$356,4,FALSE)","v":71.8},{"$f":"VLOOKUP(C44,'Anotación de defensa'!$C$6:$F$356,4,FALSE)","v":66.7},{"$f":"VLOOKUP(C44,'% de ganados y perdidos'!$C$6:$F$356,4,FALSE)/100","v":{"v":0.613,"d":"61.3%"}},5,0,0,0,null,null,{"v":4.417383804263087,"d":"4.42"},null,{"v":5,"d":"5.00"},{"v":4.852941176470588,"d":"4.85"},{"v":2.5764192139737965,"d":"2.58"},{"v":4.2380952380952355,"d":"4.24"},{"v":2.2966507177033484,"d":"2.30"},5,0,0,0,null,null,{"v":4.417383804263087,"d":"4.42"}]
[null,36,"Oklahoma",36,{"$f":"VLOOKUP(C45,'Ranking de la NCAA'!$D$6:$L$358,9,FALSE)","v":37},{"$f":"VLOOKUP(C45,'Anotación de ataque'!$C$6:$F$356,4,FALSE)","v":71.2},{"$f":"VLOOKUP(C45,'Anotación de defensa'!$C$6:$F$356,4,FALSE)","v":68.2},{"$f":"VLOOKUP(C45,'% de ganados y perdidos'!$C$6:$F$356,4,FALSE)/100","v":{"v":0.594,"d":"59.4%"}},5,0,0,0,null,null,{"v":4.252475760855173,"d":"4.25"},null,{"v":4.852941176470588,"d":"4.85"},{"v":5,"d":"5.00"},{"v":2.3144104803493444,"d":"2.31"},{"v":3.523809523809521,"d":"3.52"},{"v":1.8421052631578936,"d":"1.84"},5,0,0,0,null,null,{"v":4.252475760855173,"d":"4.25"}]
[null,37,"Iowa",37,{"$f":"VLOOKUP(C46,'Ranking de la NCAA'!$D$6:$L$358,9,FALSE)","v":43},{"$f":"VLOOKUP(C46,'Anotación de ataque'!$C$6:$F$356,4,FALSE)","v":{"v":79,"d":"79.0"}},{"$f":"VLOOKUP(C46,'Anotación de defensa'!$C$6:$F$356,4,FALSE)","v":{"v":74,"d":"74.0"}},{"$f":"VLOOKUP(C46,'% de ganados y perdidos'!$C$6:$F$356,4,FALSE)/100","v":{"v":0.677,"d":"67.7%"}},5,0,0,0,null,null,{"v":4.471940509486983,"d":"4.47"},null,{"v":4.705882352941177,"d":"4.71"},{"v":4.411764705882353,"d":"4.41"},{"v":5.720524017467249,"d":"5.72"},{"v":0.7619047619047592,"d":"0.76"},{"v":3.8277511961722492,"d":"3.83"},5,0,0,0,null,null,{"v":4.471940509486983,"d":"4.47"}]
[null,38,"Seton Hall",38,{"$f":"VLOOKUP(C47,'Ranking de la NCAA'!$D$6:$L$358,9,FALSE)","v":57},{"$f":"VLOOKUP(C47,'Anotación de ataque'!$C$6:$F$356,4,FALSE)","v":73.8},{"$f":"VLOOKUP(C47,'Anotación de defensa'!$C$6:$F$356,4,FALSE)","v":71.6},{"$f":"VLOOKUP(C47,'% de ganados y perdidos'!$C$6:$F$356,4,FALSE)/100","v":{"v":0.6,"d":"60.0%"}},5,0,0,0,null,null,{"v":4.033487067894304,"d":"4.03"},null,{"v":4.5588235294117645,"d":"4.56"},{"v":3.382352941176471,"d":"3.38"},{"v":3.449781659388644,"d":"3.45"},{"v":1.904761904761905,"d":"1.90"},{"v":1.985645933014353,"d":"1.99"},5,0,0,0,null,null,{"v":4.033487067894304,"d":"4.03"}]
[null,39,"Minnesota",39,{"$f":"VLOOKUP(C48,'Ranking de la NCAA'!$D$6:$L$358,9,FALSE)","v":61},{"$f":"VLOOKUP(C48,'Anotación de ataque'!$C$6:$F$356,4,FALSE)","v":71.2},{"$f":"VLOOKUP(C48,'Anotación de defensa'!$C$6:$F$356,4,FALSE)","v":68.7},{"$f":"VLOOKUP(C48,'% de ganados y perdidos'!$C$6:$F$356,4,FALSE)/100","v":{"v":0.613,"d":"61.3%"}},5,0,0,0,null,null,{"v":4.022699001666649,"d":"4.02"},null,{"v":4.411764705882353,"d":"4.41"},{"v":3.088235294117647,"d":"3.09"},{"v":2.3144104803493444,"d":"2.31"},{"v":3.285714285714283,"d":"3.29"},{"v":2.2966507177033484,"d":"2.30"},5,0,0,0,null,null,{"v":4.022699001666649,"d":"4.02"}]
[null,40,"Florida",40,{"$f":"VLOOKUP(C49,'Ranking de la NCAA'!$D$6:$L$358,9,FALSE)","v":31},{"$f":"VLOOKUP(C49,'Anotación de ataque'!$C$6:$F$356,4,FALSE)","v":68.3},{"$f":"VLOOKUP(C49,'Anotación de defensa'!$C$6:$F$356,4,FALSE)","v":63.7},{"$f":"VLOOKUP(C49,'% de ganados y perdidos'!$C$6:$F$356,4,FALSE)/100","v":{"v":0.5479999999999999,"d":"54.8%"}},5,0,0,0,null,null,{"v":4.007314659704238,"d":"4.01"},null,{"v":4.264705882352941,"d":"4.26"},{"v":5.588235294117647,"d":"5.59"},{"v":1.0480349344978133,"d":"1.05"},{"v":5.666666666666664,"d":"5.67"},{"v":0.7416267942583711,"d":"0.74"},5,0,0,0,null,null,{"v":4.007314659704238,"d":"4.01"}]
[null,41,"Ohio St.",41,{"$f":"VLOOKUP(C50,'Ranking de la NCAA'!$D$6:$L$358,9,FALSE)","v":55},{"$f":"VLOOKUP(C50,'Anotación de ataque'!$C$6:$F$356,4,FALSE)","v":69.3},{"$f":"VLOOKUP(C50,'Anotación de defensa'!$C$6:$F$356,4,FALSE)","v":65.6},{"$f":"VLOOKUP(C50,'% de ganados y perdidos'!$C$6:$F$356,4,FALSE)/100","v":{"v":0.581,"d":"58.1%"}},5,0,0,0,null,null,{"v":3.9049018505600492,"d":"3.90"},null,{"v":4.117647058823529,"d":"4.12"},{"v":3.6764705882352944,"d":"3.68"},{"v":1.484716157205237,"d":"1.48"},{"v":4.761904761904764,"d":"4.76"},{"v":1.5311004784688982,"d":"1.53"},5,0,0,0,null,null,{"v":3.9049018505600492,"d":"3.90"}]
[null,42,"Belmont",42,{"$f":"VLOOKUP(C51,'Ranking de la NCAA'!$D$6:$L$358,9,FALSE)","v":47},{"$f":"VLOOKUP(C51,'Anotación de ataque'!$C$6:$F$356,4,FALSE)","v":87.4},{"$f":"VLOOKUP(C51,'Anotación de defensa'!$C$6:$F$356,4,FALSE)","v":73.9},{"$f":"VLOOKUP(C51,'% de ganados y perdidos'!$C$6:$F$356,4,FALSE)/100","v":{"v":0.8390000000000001,"d":"83.9%"}},5,0,0,0,null,null,{"v":4.961893204939428,"d":"4.96"},null,{"v":3.9705882352941173,"d":"3.97"},{"v":3.9705882352941173,"d":"3.97"},{"v":9.38864628820961,"d":"9.39"},{"v":0.8095238095238049,"d":"0.81"},{"v":7.703349282296652,"d":"7.70"},5,0,0,0,null,null,{"v":4.961893204939428,"d":"4.96"}]
[null,43,"Temple",43,{"$f":"VLOOKUP(C52,'Ranking de la NCAA'!$D$6:$L$358,9,FALSE)","v":56},{"$f":"VLOOKUP(C52,'Anotación de ataque'!$C$6:$F$356,4,FALSE)","v":74.9},{"$f":"VLOOKUP(C52,'Anotación de defensa'!$C$6:$F$356,4,FALSE)","v":70.9},{"$f":"VLOOKUP(C52,'% de ganados y perdidos'!$C$6:$F$356,4,FALSE)/100","v":{"v":0.742,"d":"74.2%"}},5,0,0,0,null,null,{"v":4.305389020348394,"d":"4.31"},null,{"v":3.8235294117647056,"d":"3.82"},{"v":3.5294117647058827,"d":"3.53"},{"v":3.930131004366814,"d":"3.93"},{"v":2.2380952380952337,"d":"2.24"},{"v":5.382775119617223,"d":"5.38"},5,0,0,0,null,null,{"v":4.305389020348394,"d":"4.31"}]
[null,44,"Saint Mary's (CA)",44,{"$f":"VLOOKUP(C53,'Ranking de la NCAA'!$D$6:$L$358,9,FALSE)","v":32},{"$f":"VLOOKUP(C53,'Anotación de ataque'!$C$6:$F$356,4,FALSE)","v":72.9},{"$f":"VLOOKUP(C53,'Anotación de defensa'!$C$6:$F$356,4,FALSE)","v":64.4},{"$f":"VLOOKUP(C53,'% de ganados y perdidos'!$C$6:$F$356,4,FALSE)/100","v":{"v":0.667,"d":"66.7%"}},5,0,0,0,null,null,{"v":4.292710986458198,"d":"4.29"},null,{"v":3.6764705882352944,"d":"3.68"},{"v":5.441176470588235,"d":"5.44"},{"v":3.056768558951966,"d":"3.06"},{"v":5.33333333333333,"d":"5.33"},{"v":3.5885167464114835,"d":"3.59"},5,0,0,0,null,null,{"v":4.292710986458198,"d":"4.29"}]
[null,45,"Arizona St.",45,{"$f":"VLOOKUP(C54,'Ranking de la NCAA'!$D$6:$L$358,9,FALSE)","v":63},{"$f":"VLOOKUP(C54,'Anotación de ataque'!$C$6:$F$356,4,FALSE)","v":77.7},{"$f":"VLOOKUP(C54,'Anotación de defensa'!$C$6:$F$356,4,FALSE)","v":72.9},{"$f":"VLOOKUP(C54,'% de ganados y perdidos'!$C$6:$F$356,4,FALSE)/100","v":{"v":0.7,"d":"70.0%"}},5,0,0,0,null,null,{"v":4.052184591268236,"d":"4.05"},null,{"v":3.5294117647058827,"d":"3.53"},{"v":2.9411764705882355,"d":"2.94"},{"v":5.152838427947599,"d":"5.15"},{"v":1.2857142857142811,"d":"1.29"},{"v":4.377990430622008,"d":"4.38"},5,0,0,0,null,null,{"v":4.052184591268236,"d":"4.05"}]
[null,46,"Murray St.",46,{"$f":"VLOOKUP(C55,'Ranking de la NCAA'!$D$6:$L$358,9,FALSE)","v":44},{"$f":"VLOOKUP(C55,'Anotación de ataque'!$C$6:$F$356,4,FALSE)","v":83.3},{"$f":"VLOOKUP(C55,'Anotación de defensa'!$C$6:$F$356,4,FALSE)","v":67.8},{"$f":"VLOOKUP(C55,'% de ganados y perdidos'!$C$6:$F$356,4,FALSE)/100","v":{"v":0.871,"d":"87.1%"}},5,0,0,0,null,null,{"v":4.961787241379493,"d":"4.96"},null,{"v":3.382352941176471,"d":"3.38"},{"v":4.264705882352941,"d":"4.26"},{"v":7.598253275109169,"d":"7.60"},{"v":3.7142857142857144,"d":"3.71"},{"v":8.4688995215311,"d":"8.47"},5,0,0,0,null,null,{"v":4.961787241379493,"d":"4.96"}]
[null,47,"St. John's (NY)",47,{"$f":"VLOOKUP(C56,'Ranking de la NCAA'!$D$6:$L$358,9,FALSE)","v":73},{"$f":"VLOOKUP(C56,'Anotación de ataque'!$C$6:$F$356,4,FALSE)","v":78.1},{"$f":"VLOOKUP(C56,'Anotación de defensa'!$C$6:$F$356,4,FALSE)","v":74.4},{"$f":"VLOOKUP(C56,'% de ganados y perdidos'!$C$6:$F$356,4,FALSE)/100","v":{"v":0.6559999999999999,"d":"65.6%"}},5,0,0,0,null,null,{"v":3.7484085186695797,"d":"3.75"},null,{"v":3.235294117647059,"d":"3.24"},{"v":2.5,"d":"2.50"},{"v":5.327510917030565,"d":"5.33"},{"v":0.5714285714285658,"d":"0.57"},{"v":3.3253588516746384,"d":"3.33"},5,0,0,0,null,null,{"v":3.7484085186695797,"d":"3.75"}]
[null,48,"Oregon",48,{"$f":"VLOOKUP(C57,'Ranking de la NCAA'!$D$6:$L$358,9,FALSE)","v":51},{"$f":"VLOOKUP(C57,'Anotación de ataque'!$C$6:$F$356,4,FALSE)","v":{"v":70,"d":"70.0"}},{"$f":"VLOOKUP(C57,'Anotación de defensa'!$C$6:$F$356,4,FALSE)","v":63.3},{"$f":"VLOOKUP(C57,'% de ganados y perdidos'!$C$6:$F$356,4,FALSE)/100","v":{"v":0.625,"d":"62.5%"}},5,0,0,0,null,null,{"v":3.8053137244952513,"d":"3.81"},null,{"v":3.088235294117647,"d":"3.09"},{"v":3.8235294117647056,"d":"3.82"},{"v":1.7903930131004349,"d":"1.79"},{"v":5.857142857142858,"d":"5.86"},{"v":2.5837320574162677,"d":"2.58"},5,0,0,0,null,null,{"v":3.8053137244952513,"d":"3.81"}]
[null,49,"New Mexico St.",49,{"$f":"VLOOKUP(C58,'Ranking de la NCAA'!$D$6:$L$358,9,FALSE)","v":40},{"$f":"VLOOKUP(C58,'Anotación de ataque'!$C$6:$F$356,4,FALSE)","v":77.5},{"$f":"VLOOKUP(C58,'Anotación de defensa'!$C$6:$F$356,4,FALSE)","v":64.6},{"$f":"VLOOKUP(C58,'% de ganados y perdidos'!$C$6:$F$356,4,FALSE)/100","v":{"v":0.871,"d":"87.1%"}},5,0,0,0,null,null,{"v":4.776877411363061,"d":"4.78"},null,{"v":2.9411764705882355,"d":"2.94"},{"v":4.705882352941177,"d":"4.71"},{"v":5.065502183406113,"d":"5.07"},{"v":5.23809523809524,"d":"5.24"},{"v":8.4688995215311,"d":"8.47"},5,0,0,0,null,null,{"v":4.776877411363061,"d":"4.78"}]
[null,50,"Liberty",50,{"$f":"VLOOKUP(C59,'Ranking de la NCAA'!$D$6:$L$358,9,FALSE)","v":58},{"$f":"VLOOKUP(C59,'Anotación de ataque'!$C$6:$F$356,4,FALSE)","v":{"v":74,"d":"74.0"}},{"$f":"VLOOKUP(C59,'Anotación de defensa'!$C$6:$F$356,4,FALSE)","v":60.8},{"$f":"VLOOKUP(C59,'% de ganados y perdidos'!$C$6:$F$356,4,FALSE)/100","v":{"v":0.8240000000000001,"d":"82.4%"}},5,0,0,0,null,null,{"v":4.498640967986757,"d":"4.50"},null,{"v":2.7941176470588234,"d":"2.79"},{"v":3.235294117647059,"d":"3.24"},{"v":3.5371179039301297,"d":"3.54"},{"v":7.047619047619049,"d":"7.05"},{"v":7.344497607655502,"d":"7.34"},5,0,0,0,null,null,{"v":4.498640967986757,"d":"4.50"}]
[null,51,"UC Irvine",51,{"$f":"VLOOKUP(C60,'Ranking de la NCAA'!$D$6:$L$358,9,FALSE)","v":68},{"$f":"VLOOKUP(C60,'Anotación de ataque'!$C$6:$F$356,4,FALSE)","v":72.5},{"$f":"VLOOKUP(C60,'Anotación de defensa'!$C$6:$F$356,4,FALSE)","v":63.8},{"$f":"VLOOKUP(C60,'% de ganados y perdidos'!$C$6:$F$356,4,FALSE)/100","v":{"v":0.8440000000000001,"d":"84.4%"}},5,0,0,0,null,null,{"v":4.345099231198437,"d":"4.35"},null,{"v":2.6470588235294117,"d":"2.65"},{"v":2.7941176470588234,"d":"2.79"},{"v":2.882096069868994,"d":"2.88"},{"v":5.6190476190476195,"d":"5.62"},{"v":7.822966507177035,"d":"7.82"},5,0,0,0,null,null,{"v":4.345099231198437,"d":"4.35"}]
[null,52,"Vermont",52,{"$f":"VLOOKUP(C61,'Ranking de la NCAA'!$D$6:$L$358,9,FALSE)","v":71},{"$f":"VLOOKUP(C61,'Anotación de ataque'!$C$6:$F$356,4,FALSE)","v":74.2},{"$f":"VLOOKUP(C61,'Anotación de defensa'!$C$6:$F$356,4,FALSE)","v":63.1},{"$f":"VLOOKUP(C61,'% de ganados y perdidos'!$C$6:$F$356,4,FALSE)/100","v":{"v":0.813,"d":"81.3%"}},5,0,0,0,null,null,{"v":4.25910489001462,"d":"4.26"},null,{"v":2.5,"d":"2.50"},{"v":2.6470588235294117,"d":"2.65"},{"v":3.624454148471616,"d":"3.62"},{"v":5.952380952380951,"d":"5.95"},{"v":7.081339712918658,"d":"7.08"},5,0,0,0,null,null,{"v":4.25910489001462,"d":"4.26"}]
[null,53,"Saint Louis",53,{"$f":"VLOOKUP(C62,'Ranking de la NCAA'!$D$6:$L$358,9,FALSE)","v":103},{"$f":"VLOOKUP(C62,'Anotación de ataque'!$C$6:$F$356,4,FALSE)","v":67.4},{"$f":"VLOOKUP(C62,'Anotación de defensa'!$C$6:$F$356,4,FALSE)","v":64.9},{"$f":"VLOOKUP(C62,'% de ganados y perdidos'!$C$6:$F$356,4,FALSE)/100","v":{"v":0.613,"d":"61.3%"}},5,0,0,0,null,null,{"v":3.2680021301960815,"d":"3.27"},null,{"v":2.3529411764705883,"d":"2.35"},{"v":1.9117647058823528,"d":"1.91"},{"v":0.6550218340611357,"d":"0.66"},{"v":5.095238095238091,"d":"5.10"},{"v":2.2966507177033484,"d":"2.30"},5,0,0,0,null,null,{"v":3.2680021301960815,"d":"3.27"}]
[null,54,"Northeastern",54,{"$f":"VLOOKUP(C63,'Ranking de la NCAA'!$D$6:$L$358,9,FALSE)","v":78},{"$f":"VLOOKUP(C63,'Anotación de ataque'!$C$6:$F$356,4,FALSE)","v":76.1},{"$f":"VLOOKUP(C63,'Anotación de defensa'!$C$6:$F$356,4,FALSE)","v":70.3},{"$f":"VLOOKUP(C63,'% de ganados y perdidos'!$C$6:$F$356,4,FALSE)/100","v":{"v":0.6970000000000001,"d":"69.7%"}},5,0,0,0,null,null,{"v":3.5981834085326185,"d":"3.60"},null,{"v":2.2058823529411766,"d":"2.21"},{"v":2.3529411764705883,"d":"2.35"},{"v":4.454148471615717,"d":"4.45"},{"v":2.5238095238095237,"d":"2.52"},{"v":4.306220095693781,"d":"4.31"},5,0,0,0,null,null,{"v":3.5981834085326185,"d":"3.60"}]
[null,55,"Yale",55,{"$f":"VLOOKUP(C64,'Ranking de la NCAA'!$D$6:$L$358,9,FALSE)","v":86},{"$f":"VLOOKUP(C64,'Anotación de ataque'!$C$6:$F$356,4,FALSE)","v":80.5},{"$f":"VLOOKUP(C64,'Anotación de defensa'!$C$6:$F$356,4,FALSE)","v":72.6},{"$f":"VLOOKUP(C64,'% de ganados y perdidos'!$C$6:$F$356,4,FALSE)/100","v":{"v":0.741,"d":"74.1%"}},5,0,0,0,null,null,{"v":3.7347880419588075,"d":"3.73"},null,{"v":2.0588235294117645,"d":"2.06"},{"v":2.2058823529411766,"d":"2.21"},{"v":6.3755458515283845,"d":"6.38"},{"v":1.4285714285714288,"d":"1.43"},{"v":5.358851674641148,"d":"5.36"},5,0,0,0,null,null,{"v":3.7347880419588075,"d":"3.73"}]
[null,56,"Old Dominion",56,{"$f":"VLOOKUP(C65,'Ranking de la NCAA'!$D$6:$L$358,9,FALSE)","v":100},{"$f":"VLOOKUP(C65,'Anotación de ataque'!$C$6:$F$356,4,FALSE)","v":66.8},{"$f":"VLOOKUP(C65,'Anotación de defensa'!$C$6:$F$356,4,FALSE)","v":61.2},{"$f":"VLOOKUP(C65,'% de ganados y perdidos'!$C$6:$F$356,4,FALSE)/100","v":{"v":0.742,"d":"74.2%"}},5,0,0,0,null,null,{"v":3.642223550375834,"d":"3.64"},null,{"v":1.9117647058823528,"d":"1.91"},{"v":2.0588235294117645,"d":"2.06"},{"v":0.39301310043667764,"d":"0.39"},{"v":6.857142857142856,"d":"6.86"},{"v":5.382775119617223,"d":"5.38"},5,0,0,0,null,null,{"v":3.642223550375834,"d":"3.64"}]
[null,57,"Georgia St.",57,{"$f":"VLOOKUP(C66,'Ranking de la NCAA'!$D$6:$L$358,9,FALSE)","v":121},{"$f":"VLOOKUP(C66,'Anotación de ataque'!$C$6:$F$356,4,FALSE)","v":77.8},{"$f":"VLOOKUP(C66,'Anotación de defensa'!$C$6:$F$356,4,FALSE)","v":74.1},{"$f":"VLOOKUP(C66,'% de ganados y perdidos'!$C$6:$F$356,4,FALSE)/100","v":{"v":0.71,"d":"71.0%"}},5,0,0,0,null,null,{"v":3.3724278997238555,"d":"3.37"},null,{"v":1.7647058823529413,"d":"1.76"},{"v":1.6176470588235294,"d":"1.62"},{"v":5.196506550218338,"d":"5.20"},{"v":0.7142857142857153,"d":"0.71"},{"v":4.617224880382774,"d":"4.62"},5,0,0,0,null,null,{"v":3.3724278997238555,"d":"3.37"}]
[null,58,"Northern Ky.",58,{"$f":"VLOOKUP(C67,'Ranking de la NCAA'!$D$6:$L$358,9,FALSE)","v":115},{"$f":"VLOOKUP(C67,'Anotación de ataque'!$C$6:$F$356,4,FALSE)","v":79.1},{"$f":"VLOOKUP(C67,'Anotación de defensa'!$C$6:$F$356,4,FALSE)","v":68.8},{"$f":"VLOOKUP(C67,'% de ganados y perdidos'!$C$6:$F$356,4,FALSE)/100","v":{"v":0.765,"d":"76.5%"}},5,0,0,0,null,null,{"v":3.7147504841625194,"d":"3.71"},null,{"v":1.6176470588235294,"d":"1.62"},{"v":1.7647058823529413,"d":"1.76"},{"v":5.764192139737988,"d":"5.76"},{"v":3.2380952380952372,"d":"3.24"},{"v":5.9330143540669855,"d":"5.93"},5,0,0,0,null,null,{"v":3.7147504841625194,"d":"3.71"}]
[null,59,"Montana",59,{"$f":"VLOOKUP(C68,'Ranking de la NCAA'!$D$6:$L$358,9,FALSE)","v":124},{"$f":"VLOOKUP(C68,'Anotación de ataque'!$C$6:$F$356,4,FALSE)","v":76.9},{"$f":"VLOOKUP(C68,'Anotación de defensa'!$C$6:$F$356,4,FALSE)","v":{"v":69,"d":"69.0"}},{"$f":"VLOOKUP(C68,'% de ganados y perdidos'!$C$6:$F$356,4,FALSE)/100","v":{"v":0.742,"d":"74.2%"}},5,0,0,0,null,null,{"v":3.5023620162425306,"d":"3.50"},null,{"v":1.4705882352941178,"d":"1.47"},{"v":1.4705882352941178,"d":"1.47"},{"v":4.803493449781661,"d":"4.80"},{"v":3.1428571428571415,"d":"3.14"},{"v":5.382775119617223,"d":"5.38"},5,0,0,0,null,null,{"v":3.5023620162425306,"d":"3.50"}]
[null,60,"Colgate",60,{"$f":"VLOOKUP(C69,'Ranking de la NCAA'!$D$6:$L$358,9,FALSE)","v":132},{"$f":"VLOOKUP(C69,'Anotación de ataque'!$C$6:$F$356,4,FALSE)","v":75.3},{"$f":"VLOOKUP(C69,'Anotación de defensa'!$C$6:$F$356,4,FALSE)","v":{"v":70,"d":"70.0"}},{"$f":"VLOOKUP(C69,'% de ganados y perdidos'!$C$6:$F$356,4,FALSE)/100","v":{"v":0.706,"d":"70.6%"}},5,0,0,0,null,null,{"v":3.250380588777441,"d":"3.25"},null,{"v":1.3235294117647058,"d":"1.32"},{"v":1.3235294117647058,"d":"1.32"},{"v":4.104803493449779,"d":"4.10"},{"v":2.666666666666665,"d":"2.67"},{"v":4.521531100478467,"d":"4.52"},5,0,0,0,null,null,{"v":3.250380588777441,"d":"3.25"}]
[null,61,"Bradley",61,{"$f":"VLOOKUP(C70,'Ranking de la NCAA'!$D$6:$L$358,9,FALSE)","v":176},{"$f":"VLOOKUP(C70,'Anotación de ataque'!$C$6:$F$356,4,FALSE)","v":66.6},{"$f":"VLOOKUP(C70,'Anotación de defensa'!$C$6:$F$356,4,FALSE)","v":{"v":65,"d":"65.0"}},{"$f":"VLOOKUP(C70,'% de ganados y perdidos'!$C$6:$F$356,4,FALSE)/100","v":{"v":0.588,"d":"58.8%"}},5,0,0,0,null,null,{"v":2.701008731498003,"d":"2.70"},null,{"v":1.1764705882352942,"d":"1.18"},{"v":0.8823529411764707,"d":"0.88"},{"v":0.30567685589519167,"d":"0.31"},{"v":5.047619047619047,"d":"5.05"},{"v":1.698564593301434,"d":"1.70"},5,0,0,0,null,null,{"v":2.701008731498003,"d":"2.70"}]
[null,62,"Abilene Christian",62,{"$f":"VLOOKUP(C71,'Ranking de la NCAA'!$D$6:$L$358,9,FALSE)","v":154},{"$f":"VLOOKUP(C71,'Anotación de ataque'!$C$6:$F$356,4,FALSE)","v":74.6},{"$f":"VLOOKUP(C71,'Anotación de defensa'!$C$6:$F$356,4,FALSE)","v":63.1},{"$f":"VLOOKUP(C71,'% de ganados y perdidos'!$C$6:$F$356,4,FALSE)/100","v":{"v":0.8059999999999999,"d":"80.6%"}},5,0,0,0,null,null,{"v":3.6601858798581657,"d":"3.66"},null,{"v":1.0294117647058822,"d":"1.03"},{"v":1.1764705882352942,"d":"1.18"},{"v":3.799126637554582,"d":"3.80"},{"v":5.952380952380951,"d":"5.95"},{"v":6.913875598086122,"d":"6.91"},5,0,0,0,null,null,{"v":3.6601858798581657,"d":"3.66"}]
[null,63,"Gardner-Webb",63,{"$f":"VLOOKUP(C72,'Ranking de la NCAA'!$D$6:$L$358,9,FALSE)","v":173},{"$f":"VLOOKUP(C72,'Anotación de ataque'!$C$6:$F$356,4,FALSE)","v":78.3},{"$f":"VLOOKUP(C72,'Anotación de defensa'!$C$6:$F$356,4,FALSE)","v":70.5},{"$f":"VLOOKUP(C72,'% de ganados y perdidos'!$C$6:$F$356,4,FALSE)/100","v":{"v":0.6759999999999999,"d":"67.6%"}},5,0,0,0,null,null,{"v":3.0594833708749367,"d":"3.06"},null,{"v":0.8823529411764707,"d":"0.88"},{"v":1.0294117647058822,"d":"1.03"},{"v":5.414847161572051,"d":"5.41"},{"v":2.428571428571427,"d":"2.43"},{"v":3.80382775119617,"d":"3.80"},5,0,0,0,null,null,{"v":3.0594833708749367,"d":"3.06"}]
[null,64,"Iona",64,{"$f":"VLOOKUP(C73,'Ranking de la NCAA'!$D$6:$L$358,9,FALSE)","v":202},{"$f":"VLOOKUP(C73,'Anotación de ataque'!$C$6:$F$356,4,FALSE)","v":76.8},{"$f":"VLOOKUP(C73,'Anotación de defensa'!$C$6:$F$356,4,FALSE)","v":75.6},{"$f":"VLOOKUP(C73,'% de ganados y perdidos'!$C$6:$F$356,4,FALSE)/100","v":{"v":0.531,"d":"53.1%"}},5,0,0,0,null,null,{"v":2.3227630995148942,"d":"2.32"},null,{"v":0.7352941176470589,"d":"0.74"},{"v":0.7352941176470589,"d":"0.74"},{"v":4.759825327510915,"d":"4.76"},{"v":0,"d":"0.00"},{"v":0.3349282296650721,"d":"0.33"},5,0,0,0,null,null,{"v":2.3227630995148942,"d":"2.32"}]
[null,65,"Prairie View",65,{"$f":"VLOOKUP(C74,'Ranking de la NCAA'!$D$6:$L$358,9,FALSE)","v":205},{"$f":"VLOOKUP(C74,'Anotación de ataque'!$C$6:$F$356,4,FALSE)","v":74.3},{"$f":"VLOOKUP(C74,'Anotación de defensa'!$C$6:$F$356,4,FALSE)","v":72.1},{"$f":"VLOOKUP(C74,'% de ganados y perdidos'!$C$6:$F$356,4,FALSE)/100","v":{"v":0.625,"d":"62.5%"}},5,0,0,0,null,null,{"v":2.5923070662278684,"d":"2.59"},null,{"v":0.5882352941176471,"d":"0.59"},{"$f":"_xlfn.RANK.EQ(E74,E$10:E$77,0)/COUNT($B$10:$B$77)*10","v":{"v":0.44117647058823534,"d":"0.44"}},{"v":3.6681222707423555,"d":"3.67"},{"v":1.6666666666666679,"d":"1.67"},{"v":2.5837320574162677,"d":"2.58"},5,{"$f":"+J74","v":0},{"$f":"+K74","v":0},{"$f":"+L74","v":0},null,null,{"v":2.5923070662278684,"d":"2.59"}]
[null,66,"Fairleigh Dickinson",66,{"$f":"VLOOKUP(C75,'Ranking de la NCAA'!$D$6:$L$358,9,FALSE)","v":203},{"$f":"VLOOKUP(C75,'Anotación de ataque'!$C$6:$F$356,4,FALSE)","v":75.4},{"$f":"VLOOKUP(C75,'Anotación de defensa'!$C$6:$F$356,4,FALSE)","v":71.3},{"$f":"VLOOKUP(C75,'% de ganados y perdidos'!$C$6:$F$356,4,FALSE)/100","v":{"v":0.606,"d":"60.6%"}},5,0,0,0,null,null,{"$f":"+AB75","v":{"v":2.5499054344093346,"d":"2.55"}},null,{"$f":"_xlfn.RANK.EQ(D75,D$10:D$77,0)/COUNT($B$10:$B$77)*10","v":{"v":0.44117647058823534,"d":"0.44"}},{"v":0.5882352941176471,"d":"0.59"},{"v":4.148471615720525,"d":"4.15"},{"v":2.0476190476190474,"d":"2.05"},{"v":2.1291866028708126,"d":"2.13"},{"$f":"+I75","v":5},0,0,0,null,null,{"v":2.5499054344093346,"d":"2.55"}]
[null,67,"North Dakota St.",67,{"$f":"VLOOKUP(C76,'Ranking de la NCAA'!$D$6:$L$358,9,FALSE)","v":222},{"$f":"VLOOKUP(C76,'Anotación de ataque'!$C$6:$F$356,4,FALSE)","v":73.2},{"$f":"VLOOKUP(C76,'Anotación de defensa'!$C$6:$F$356,4,FALSE)","v":72.2},{"$f":"VLOOKUP(C76,'% de ganados y perdidos'!$C$6:$F$356,4,FALSE)/100","v":{"v":0.545,"d":"54.5%"}},5,0,0,0,null,null,{"v":2.1940826230550026,"d":"2.19"},null,{"v":0.29411764705882354,"d":"0.29"},{"v":0.29411764705882354,"d":"0.29"},{"v":3.1877729257641922,"d":"3.19"},{"v":1.619047619047615,"d":"1.62"},{"v":0.6698564593301441,"d":"0.67"},5,0,0,0,null,null,{"v":2.1940826230550026,"d":"2.19"}]
[null,68,"N.C. Central",68,{"$f":"VLOOKUP(C77,'Ranking de la NCAA'!$D$6:$L$358,9,FALSE)","v":302},{"$f":"VLOOKUP(C77,'Anotación de ataque'!$C$6:$F$356,4,FALSE)","v":72.9},{"$f":"VLOOKUP(C77,'Anotación de defensa'!$C$6:$F$356,4,FALSE)","v":67.1},{"$f":"VLOOKUP(C77,'% de ganados y perdidos'!$C$6:$F$356,4,FALSE)/100","v":{"v":0.517,"d":"51.7%"}},5,0,0,0,null,null,{"v":2.1991160365164992,"d":"2.20"},null,{"v":0.14705882352941177,"d":"0.15"},{"v":0.14705882352941177,"d":"0.15"},{"v":3.056768558951966,"d":"3.06"},{"v":4.047619047619049,"d":"4.05"},{"v":0,"d":"0.00"},5,0,0,0,null,null,{"v":2.1991160365164992,"d":"2.20"}]

{"sheet":"Llaves","index":2,"n_rows":130,"n_cols":63,"rows_kept":130,"merged":[[3,2,3,3],[3,7,3,8],[3,12,3,13],[3,17,3,18],[3,22,3,23],[3,39,3,40],[3,44,3,45],[3,49,3,50],[3,54,3,55],[3,59,3,60],[5,1,6,1],[5,2,6,2],[5,3,6,3],[5,59,6,59],[5,60,6,60],[5,61,6,61],[7,7,8,7],[7,8,8,8],[7,54,8,54],[7,55,8,55],[9,1,10,1],[9,2,10,2],[9,3,10,3],[9,59,10,59],[9,60,10,60],[9,61,10,61],[11,12,12,12],[11,13,12,13],[11,49,12,49],[11,50,12,50],[13,1,14,1],[13,2,14,2],[13,3,14,3],[13,59,14,59],[13,60,14,60],[13,61,14,61],[15,7,16,7],[15,8,16,8],[15,54,16,54],[15,55,16,55],[17,1,18,1],[17,2,18,2],[17,3,18,3],[17,59,18,59],[17,60,18,60],[17,61,18,61],[19,17,20,17],[19,18,20,18],[19,44,20,44],[19,45,20,45],[21,1,22,1],[21,2,22,2],[21,3,22,3],[21,59,22,59],[21,60,22,60],[21,61,22,61],[23,7,24,7],[23,8,24,8],[23,54,24,54],[23,55,24,55],[25,1,26,1],[25,2,26,2],[25,3,26,3],[25,59,26,59],[25,60,26,60],[25,61,26,61],[27,12,28,12],[27,13,28,13],[27,49,28,49],[27,50,28,50],[29,1,30,1],[29,2,30,2],[29,3,30,3],[29,59,30,59],[29,60,30,60],[29,61,30,61],[31,7,32,7],[31,8,32,8],[31,54,32,54],[31,55,32,55],[33,1,34,1],[33,2,34,2],[33,3,34,3],[33,22,38,22],[33,23,38,23],[33,39,38,39],[33,40,38,40],[33,59,34,59],[33,60,34,60],[33,61,34,61],[37,1,38,1],[37,2,38,2],[37,3,38,3],[37,59,38,59],[37,60,38,60],[37,61,38,61],[39,7,40,7],[39,8,40,8],[39,54,40,54],[39,55,40,55],[41,1,42,1],[41,2,42,2],[41,3,42,3],[41,59,42,59],[41,60,42,60],[41,61,42,61],[43,12,44,12],[43,13,44,13],[43,49,44,49],[43,50,44,50],[45,1,46,1],[45,2,46,2],[45,3,46,3],[45,59,46,59],[45,60,46,60],[45,61,46,61],[47,7,48,7],[47,8,48,8],[47,54,48,54],[47,55,48,55],[49,1,50,1],[49,2,50,2],[49,3,50,3],[49,59,50,59],[49,60,50,60],[49,61,50,61],[51,17,52,17],[51,18,52,18],[51,44,52,44],[51,45,52,45],[53,1,54,1],[53,2,54,2],[53,3,54,3],[53,59,54,59],[53,60,54,60],[53,61,54,61],[55,7,56,7],[55,8,56,8],[55,54,56,54],[55,55,56,55],[57,1,58,1],[57,2,58,2],[57,3,58,3],[57,59,58,59],[57,60,58,60],[57,61,58,61],[58,28,62,34],[59,12,60,12],[59,13,60,13],[59,49,60,49],[59,50,60,50],[61,1,62,1],[61,2,62,2],[61,3,62,3],[61,59,62,59],[61,60,62,60],[61,61,62,61],[63,7,64,7],[63,8,64,8],[63,54,64,54],[63,55,64,55],[65,1,66,1],[65,2,66,2],[65,3,66,3],[65,22,69,23],[65,27,70,27],[65,28,70,28],[65,31,70,31],[65,34,70,34],[65,35,70,35],[65,39,69,40],[65,59,66,59],[65,60,66,60],[65,61,66,61],[69,1,70,1],[69,2,70,2],[69,3,70,3],[69,59,70,59],[69,60,70,60],[69,61,70,61],[71,7,72,7],[71,8,72,8],[71,54,72,54],[71,55,72,55],[73,1,74,1],[73,2,74,2],[73,3,74,3],[73,59,74,59],[73,60,74,60],[73,61,74,61],[75,12,76,12],[75,13,76,13],[75,49,76,49],[75,50,76,50],[77,1,78,1],[77,2,78,2],[77,3,78,3],[77,59,78,59],[77,60,78,60],[77,61,78,61],[79,7,80,7],[79,8,80,8],[79,54,80,54],[79,55,80,55],[81,1,82,1],[81,2,82,2],[81,3,82,3],[81,59,82,59],[81,60,82,60],[81,61,82,61],[83,17,84,17],[83,18,84,18],[83,44,84,44],[83,45,84,45],[85,1,86,1],[85,2,86,2],[85,3,86,3],[85,59,86,59],[85,60,86,60],[85,61,86,61],[87,7,88,7],[87,8,88,8],[87,54,88,54],[87,55,88,55],[89,1,90,1],[89,2,90,2],[89,3,90,3],[89,59,90,59],[89,60,90,60],[89,61,90,61],[91,12,92,12],[91,13,92,13],[91,49,92,49],[91,50,92,50],[93,1,94,1],[93,2,94,2],[93,3,94,3],[93,59,94,59],[93,60,94,60],[93,61,94,61],[95,7,96,7],[95,8,96,8],[95,54,96,54],[95,55,96,55],[97,1,98,1],[97,2,98,2],[97,3,98,3],[97,22,102,22],[97,23,102,23],[97,39,102,39],[97,40,102,40],[97,59,98,59],[97,60,98,60],[97,61,98,61],[101,1,102,1],[101,2,102,2],[101,3,102,3],[101,59,102,59],[101,60,102,60],[101,61,102,61],[103,7,104,7],[103,8,104,8],[103,54,104,54],[103,55,104,55],[105,1,106,1],[105,2,106,2],[105,3,106,3],[105,59,106,59],[105,60,106,60],[105,61,106,61],[107,12,108,12],[107,13,108,13],[107,49,108,49],[107,50,108,50],[109,1,110,1],[109,2,110,2],[109,3,110,3],[109,59,110,59],[109,60,110,60],[109,61,110,61],[111,7,112,7],[111,8,112,8],[111,54,112,54],[111,55,112,55],[113,1,114,1],[113,2,114,2],[113,3,114,3],[113,59,114,59],[113,60,114,60],[113,61,114,61],[115,17,116,17],[115,18,116,18],[115,44,116,44],[115,45,116,45],[117,1,118,1],[117,2,118,2],[117,3,118,3],[117,59,118,59],[117,60,118,60],[117,61,118,61],[119,7,120,7],[119,8,120,8],[119,54,120,54],[119,55,120,55],[121,1,122,1],[121,2,122,2],[121,3,122,3],[121,22,124,22],[121,23,124,23],[121,27,124,27],[121,28,124,28],[121,31,129,31],[121,34,124,34],[121,35,124,35],[121,39,124,39],[121,40,124,40],[121,59,122,59],[121,60,122,60],[121,61,122,61],[123,12,124,12],[123,13,124,13],[123,49,124,49],[123,50,124,50],[125,1,126,1],[125,2,126,2],[125,3,126,3],[125,59,126,59],[125,60,126,60],[125,61,126,61],[126,22,129,22],[126,23,129,23],[126,27,129,27],[126,28,129,28],[126,34,129,34],[126,35,129,35],[126,39,129,39],[126,40,129,40],[127,7,128,7],[127,8,128,8],[127,54,128,54],[127,55,128,55],[129,1,130,1],[129,2,130,2],[129,3,130,3],[129,59,130,59],[129,60,130,60],[129,61,130,61]]}
[{"$nulls":62}," "]
[]
[]
[null,null,"Primera ronda",{"$nulls":4},"Segunda ronda",{"$nulls":4},"Semifinales regionales",{"$nulls":4},"Finales regionales",{"$nulls":4},"Nacional \nSemifinales",{"$nulls":16},"Nacional \nSemifinales",{"$nulls":4},"Finales regionales",{"$nulls":4},"Semifinales regionales",{"$nulls":4},"Segunda ronda",{"$nulls":4},"Primera ronda"]
[]
[null,1,"Duke",{"$f":"IF(E6>E10,\"G\",\"P\")","v":"G"},{"$f":"VLOOKUP(C6,Estadísticas_Equipo,13,FALSE)","v":{"v":7.464329405038098,"d":"7.46"}},{"$nulls":53},{"$f":"VLOOKUP(BI6,Estadísticas_Equipo,13,FALSE)","v":{"v":7.791762378882311,"d":"7.79"}},{"$f":"IF(BG6>BG10,\"G\",\"P\")","v":"G"},"Virginia",1]
[]
[{"$nulls":7},{"$f":"IF(E6>E10,C6,C10)","v":"Duke"},{"$f":"IF(J8>J16,\"G\",\"P\")","v":"G"},{"$f":"VLOOKUP(H8,Estadísticas_Equipo,13,FALSE)","v":{"v":7.464329405038098,"d":"7.46"}},{"$nulls":43},{"$f":"VLOOKUP(BD8,Estadísticas_Equipo,13,FALSE)","v":{"v":7.791762378882311,"d":"7.79"}},{"$f":"IF(BB8>BB16,\"G\",\"P\")","v":"G"},{"$f":"IF(BG6>BG10,BI6,BI10)","v":"Virginia"}]
[]
[null,16,{"$f":"IF(AH122>AH127,AJ122,AJ127)","v":"N.C. Central"},{"$f":"IF(NOT(E6>E10),\"G\",\"P\")","v":"P"},{"$f":"VLOOKUP(C10,Estadísticas_Equipo,13,FALSE)","v":{"v":2.1991160365164992,"d":"2.20"}},{"$nulls":53},{"$f":"VLOOKUP(BI10,Estadísticas_Equipo,13,FALSE)","v":{"v":3.0594833708749367,"d":"3.06"}},{"$f":"IF(NOT(BG6>BG10),\"G\",\"P\")","v":"P"},"Gardner-Webb",16]
[]
[{"$nulls":12},{"$f":"IF(J8>J16,H8,H16)","v":"Duke"},{"$f":"IF(O12>O28,\"G\",\"P\")","v":"G"},{"$f":"VLOOKUP(M12,Estadísticas_Equipo,13,FALSE)","v":{"v":7.464329405038098,"d":"7.46"}},{"$nulls":33},{"$f":"VLOOKUP(AY12,Estadísticas_Equipo,13,FALSE)","v":{"v":7.791762378882311,"d":"7.79"}},{"$f":"IF(AW12>AW28,\"G\",\"P\")","v":"G"},{"$f":"IF(BB8>BB16,BD8,BD16)","v":"Virginia"}]
[]
[null,8,"VCU",{"$f":"IF(E14>E18,\"G\",\"P\")","v":"G"},{"$f":"VLOOKUP(C14,Estadísticas_Equipo,13,FALSE)","v":{"v":5.522412750227857,"d":"5.52"}},{"$nulls":53},{"$f":"VLOOKUP(BI14,Estadísticas_Equipo,13,FALSE)","v":{"v":4.733604662552707,"d":"4.73"}},{"$f":"IF(BG14>BG18,\"G\",\"P\")","v":"G"},"Ole Miss",8]
[]
[{"$nulls":7},{"$f":"IF(E14>E18,C14,C18)","v":"VCU"},{"$f":"IF(NOT(J8>J16),\"G\",\"P\")","v":"P"},{"$f":"VLOOKUP(H16,Estadísticas_Equipo,13,FALSE)","v":{"v":5.522412750227857,"d":"5.52"}},{"$nulls":43},{"$f":"VLOOKUP(BD16,Estadísticas_Equipo,13,FALSE)","v":{"v":4.733604662552707,"d":"4.73"}},{"$f":"IF(NOT(BB8>BB16),\"G\",\"P\")","v":"P"},{"$f":"IF(BG14>BG18,BI14,BI18)","v":"Ole Miss"}]
[]
[null,9,"UCF",{"$f":"IF(NOT(E14>E18),\"G\",\"P\")","v":"P"},{"$f":"VLOOKUP(C18,Estadísticas_Equipo,13,FALSE)","v":{"v":5.134719377119366,"d":"5.13"}},{"$nulls":53},{"$f":"VLOOKUP(BI18,Estadísticas_Equipo,13,FALSE)","v":{"v":4.252475760855173,"d":"4.25"}},{"$f":"IF(NOT(BG14>BG18),\"G\",\"P\")","v":"P"},"Oklahoma",9]
[]
[{"$nulls":17},{"$f":"IF(O12>O28,M12,M28)","v":"Duke"},{"$f":"IF(T20>T52,\"G\",\"P\")","v":"G"},{"$f":"VLOOKUP(R20,Estadísticas_Equipo,13,FALSE)","v":{"v":7.464329405038098,"d":"7.46"}},{"$nulls":23},{"$f":"VLOOKUP(AT20,Estadísticas_Equipo,13,FALSE)","v":{"v":7.791762378882311,"d":"7.79"}},{"$f":"IF(AR20>AR52,\"G\",\"P\")","v":"G"},{"$f":"IF(AW12>AW28,AY12,AY28)","v":"Virginia"}]
[]
[null,5,"Mississippi St.",{"$f":"IF(E22>E26,\"G\",\"P\")","v":"G"},{"$f":"VLOOKUP(C22,Estadísticas_Equipo,13,FALSE)","v":{"v":5.677759814149014,"d":"5.68"}},{"$nulls":53},{"$f":"VLOOKUP(BI22,Estadísticas_Equipo,13,FALSE)","v":{"v":5.807938523187215,"d":"5.81"}},{"$f":"IF(BG22>BG26,\"G\",\"P\")","v":"G"},"Wisconsin",5]
[]
[{"$nulls":7},{"$f":"IF(E22>E26,C22,C26)","v":"Mississippi St."},{"$f":"IF(J24>J32,\"G\",\"P\")","v":"P"},{"$f":"VLOOKUP(H24,Estadísticas_Equipo,13,FALSE)","v":{"v":5.677759814149014,"d":"5.68"}},{"$nulls":43},{"$f":"VLOOKUP(BD24,Estadísticas_Equipo,13,FALSE)","v":{"v":5.807938523187215,"d":"5.81"}},{"$f":"IF(BB24>BB32,\"G\",\"P\")","v":"P"},{"$f":"IF(BG22>BG26,BI22,BI26)","v":"Wisconsin"}]
[]
[null,12,"Liberty",{"$f":"IF(NOT(E22>E26),\"G\",\"P\")","v":"P"},{"$f":"VLOOKUP(C26,Estadísticas_Equipo,13,FALSE)","v":{"v":4.498640967986757,"d":"4.50"}},{"$nulls":53},{"$f":"VLOOKUP(BI26,Estadísticas_Equipo,13,FALSE)","v":{"v":3.8053137244952513,"d":"3.81"}},{"$f":"IF(NOT(BG22>BG26),\"G\",\"P\")","v":"P"},"Oregon",12]
[]
[{"$nulls":12},{"$f":"IF(J24>J32,H24,H32)","v":"Virginia Tech"},{"$f":"IF(NOT(O12>O28),\"G\",\"P\")","v":"P"},{"$f":"VLOOKUP(M28,Estadísticas_Equipo,13,FALSE)","v":{"v":6.335219980611844,"d":"6.34"}},{"$nulls":33},{"$f":"VLOOKUP(AY28,Estadísticas_Equipo,13,FALSE)","v":{"v":6.098488199107393,"d":"6.10"}},{"$f":"IF(NOT(AW12>AW28),\"G\",\"P\")","v":"P"},{"$f":"IF(BB24>BB32,BD24,BD32)","v":"Kansas St."}]
[]
[null,4,"Virginia Tech",{"$f":"IF(E30>E34,\"G\",\"P\")","v":"G"},{"$f":"VLOOKUP(C30,Estadísticas_Equipo,13,FALSE)","v":{"v":6.335219980611844,"d":"6.34"}},{"$nulls":53},{"$f":"VLOOKUP(BI30,Estadísticas_Equipo,13,FALSE)","v":{"v":6.098488199107393,"d":"6.10"}},{"$f":"IF(BG30>BG34,\"G\",\"P\")","v":"G"},"Kansas St.",4]
[]
[{"$nulls":7},{"$f":"IF(E30>E34,C30,C34)","v":"Virginia Tech"},{"$f":"IF(NOT(J24>J32),\"G\",\"P\")","v":"G"},{"$f":"VLOOKUP(H32,Estadísticas_Equipo,13,FALSE)","v":{"v":6.335219980611844,"d":"6.34"}},{"$nulls":43},{"$f":"VLOOKUP(BD32,Estadísticas_Equipo,13,FALSE)","v":{"v":6.098488199107393,"d":"6.10"}},{"$f":"IF(NOT(BB24>BB32),\"G\",\"P\")","v":"G"},{"$f":"IF(BG30>BG34,BI30,BI34)","v":"Kansas St."}]
[]
[null,13,"Saint Louis",{"$f":"IF(NOT(E30>E34),\"G\",\"P\")","v":"P"},{"$f":"VLOOKUP(C34,Estadísticas_Equipo,13,FALSE)","v":{"v":3.2680021301960815,"d":"3.27"}},{"$nulls":17},{"$f":"IF(T20>T52,R20,R52)","v":"Duke"},{"$f":"IF(Y34>Y98,\"G\",\"P\")","v":"P"},{"$f":"VLOOKUP(W34,Estadísticas_Equipo,13,FALSE)","v":{"v":7.464329405038098,"d":"7.46"}},{"$nulls":13},{"$f":"VLOOKUP(AO34,Estadísticas_Equipo,13,FALSE)","v":{"v":7.791762378882311,"d":"7.79"}},{"$f":"IF(AM34>AM100,\"G\",\"P\")","v":"G"},{"$f":"IF(AR20>AR52,AT20,AT52)","v":"Virginia"},{"$nulls":17},{"$f":"VLOOKUP(BI34,Estadísticas_Equipo,13,FALSE)","v":{"v":4.345099231198437,"d":"4.35"}},{"$f":"IF(NOT(BG30>BG34),\"G\",\"P\")","v":"P"},"UC Irvine",13]
[]
[]
[]
[null,6,"Maryland",{"$f":"IF(E38>E42,\"G\",\"P\")","v":"G"},{"$f":"VLOOKUP(C38,Estadísticas_Equipo,13,FALSE)","v":{"v":5.506515537690251,"d":"5.51"}},{"$nulls":53},{"$f":"VLOOKUP(BI38,Estadísticas_Equipo,13,FALSE)","v":{"v":5.579922833650847,"d":"5.58"}},{"$f":"IF(BG38>BG42,\"G\",\"P\")","v":"G"},"Villanova",6]
[]
[{"$nulls":7},{"$f":"IF(E38>E42,C38,C42)","v":"Maryland"},{"$f":"IF(J40>J48,\"G\",\"P\")","v":"P"},{"$f":"VLOOKUP(H40,Estadísticas_Equipo,13,FALSE)","v":{"v":5.506515537690251,"d":"5.51"}},{"$nulls":43},{"$f":"VLOOKUP(BD40,Estadísticas_Equipo,13,FALSE)","v":{"v":5.579922833650847,"d":"5.58"}},{"$f":"IF(BB40>BB48,\"G\",\"P\")","v":"P"},{"$f":"IF(BG38>BG42,BI38,BI42)","v":"Villanova"}]
[]
[null,11,{"$f":"IF(AD122>AD127,AB122,AB127)","v":"Belmont"},{"$f":"IF(NOT(E38>E42),\"G\",\"P\")","v":"P"},{"$f":"VLOOKUP(C42,Estadísticas_Equipo,13,FALSE)","v":{"v":4.961893204939428,"d":"4.96"}},{"$nulls":53},{"$f":"VLOOKUP(BI42,Estadísticas_Equipo,13,FALSE)","v":{"v":4.292710986458198,"d":"4.29"}},{"$f":"IF(NOT(BG38>BG42),\"G\",\"P\")","v":"P"},"Saint Mary's (CA)",11]
[]
[{"$nulls":12},{"$f":"IF(J40>J48,H40,H48)","v":"LSU"},{"$f":"IF(O44>O60,\"G\",\"P\")","v":"P"},{"$f":"VLOOKUP(M44,Estadísticas_Equipo,13,FALSE)","v":{"v":6.618906810964079,"d":"6.62"}},{"$nulls":33},{"$f":"VLOOKUP(AY44,Estadísticas_Equipo,13,FALSE)","v":{"v":6.328965729052253,"d":"6.33"}},{"$f":"IF(AW44>AW60,\"G\",\"P\")","v":"P"},{"$f":"IF(BB40>BB48,BD40,BD48)","v":"Purdue"}]
[]
[null,3,"LSU",{"$f":"IF(E46>E50,\"G\",\"P\")","v":"G"},{"$f":"VLOOKUP(C46,Estadísticas_Equipo,13,FALSE)","v":{"v":6.618906810964079,"d":"6.62"}},{"$nulls":53},{"$f":"VLOOKUP(BI46,Estadísticas_Equipo,13,FALSE)","v":{"v":6.328965729052253,"d":"6.33"}},{"$f":"IF(BG46>BG50,\"G\",\"P\")","v":"G"},"Purdue",3]
[]
[{"$nulls":7},{"$f":"IF(E46>E50,C46,C50)","v":"LSU"},{"$f":"IF(NOT(J40>J48),\"G\",\"P\")","v":"G"},{"$f":"VLOOKUP(H48,Estadísticas_Equipo,13,FALSE)","v":{"v":6.618906810964079,"d":"6.62"}},{"$nulls":43},{"$f":"VLOOKUP(BD48,Estadísticas_Equipo,13,FALSE)","v":{"v":6.328965729052253,"d":"6.33"}},{"$f":"IF(NOT(BB40>BB48),\"G\",\"P\")","v":"G"},{"$f":"IF(BG46>BG50,BI46,BI50)","v":"Purdue"}]
[]
[null,14,"Yale",{"$f":"IF(NOT(E46>E50),\"G\",\"P\")","v":"P"},{"$f":"VLOOKUP(C50,Estadísticas_Equipo,13,FALSE)","v":{"v":3.7347880419588075,"d":"3.73"}},{"$nulls":53},{"$f":"VLOOKUP(BI50,Estadísticas_Equipo,13,FALSE)","v":{"v":3.642223550375834,"d":"3.64"}},{"$f":"IF(NOT(BG46>BG50),\"G\",\"P\")","v":"P"},"Old Dominion",14]
[]
[{"$nulls":17},{"$f":"IF(O44>O60,M44,M60)","v":"Michigan St."},{"$f":"IF(NOT(T20>T52),\"G\",\"P\")","v":"P"},{"$f":"VLOOKUP(R52,Estadísticas_Equipo,13,FALSE)","v":{"v":6.984474489042742,"d":"6.98"}},{"$nulls":23},{"$f":"VLOOKUP(AT52,Estadísticas_Equipo,13,FALSE)","v":{"v":7.291965542685459,"d":"7.29"}},{"$f":"IF(NOT(AR20>AR52),\"G\",\"P\")","v":"P"},{"$f":"IF(AW44>AW60,AY44,AY60)","v":"Tennessee"}]
[]
[null,7,"Louisville",{"$f":"IF(E54>E58,\"G\",\"P\")","v":"G"},{"$f":"VLOOKUP(C54,Estadísticas_Equipo,13,FALSE)","v":{"v":5.14848971395945,"d":"5.15"}},{"$nulls":53},{"$f":"VLOOKUP(BI54,Estadísticas_Equipo,13,FALSE)","v":{"v":5.6763977212177075,"d":"5.68"}},{"$f":"IF(BG54>BG58,\"G\",\"P\")","v":"G"},"Cincinnati",7]
[]
[{"$nulls":7},{"$f":"IF(E54>E58,C54,C58)","v":"Louisville"},{"$f":"IF(J56>J64,\"G\",\"P\")","v":"P"},{"$f":"VLOOKUP(H56,Estadísticas_Equipo,13,FALSE)","v":{"v":5.14848971395945,"d":"5.15"}},{"$nulls":43},{"$f":"VLOOKUP(BD56,Estadísticas_Equipo,13,FALSE)","v":{"v":5.6763977212177075,"d":"5.68"}},{"$f":"IF(BB56>BB64,\"G\",\"P\")","v":"P"},{"$f":"IF(BG54>BG58,BI54,BI58)","v":"Cincinnati"}]
[]
[null,10,"Minnesota",{"$f":"IF(NOT(E54>E58),\"G\",\"P\")","v":"P"},{"$f":"VLOOKUP(C58,Estadísticas_Equipo,13,FALSE)","v":{"v":4.022699001666649,"d":"4.02"}},{"$nulls":53},{"$f":"VLOOKUP(BI58,Estadísticas_Equipo,13,FALSE)","v":{"v":4.471940509486983,"d":"4.47"}},{"$f":"IF(NOT(BG54>BG58),\"G\",\"P\")","v":"P"},"Iowa",10]
[{"$nulls":28},"Campeonato Nacional"]
[{"$nulls":12},{"$f":"IF(J56>J64,H56,H64)","v":"Michigan St."},{"$f":"IF(NOT(O44>O60),\"G\",\"P\")","v":"G"},{"$f":"VLOOKUP(M60,Estadísticas_Equipo,13,FALSE)","v":{"v":6.984474489042742,"d":"6.98"}},{"$nulls":33},{"$f":"VLOOKUP(AY60,Estadísticas_Equipo,13,FALSE)","v":{"v":7.291965542685459,"d":"7.29"}},{"$f":"IF(NOT(AW44>AW60),\"G\",\"P\")","v":"G"},{"$f":"IF(BB56>BB64,BD56,BD64)","v":"Tennessee"}]
[]
[null,2,"Michigan St.",{"$f":"IF(E62>E66,\"G\",\"P\")","v":"G"},{"$f":"VLOOKUP(C62,Estadísticas_Equipo,13,FALSE)","v":{"v":6.984474489042742,"d":"6.98"}},{"$nulls":53},{"$f":"VLOOKUP(BI62,Estadísticas_Equipo,13,FALSE)","v":{"v":7.291965542685459,"d":"7.29"}},{"$f":"IF(BG62>BG66,\"G\",\"P\")","v":"G"},"Tennessee",2]
[]
[{"$nulls":7},{"$f":"IF(E62>E66,C62,C66)","v":"Michigan St."},{"$f":"IF(NOT(J56>J64),\"G\",\"P\")","v":"G"},{"$f":"VLOOKUP(H64,Estadísticas_Equipo,13,FALSE)","v":{"v":6.984474489042742,"d":"6.98"}},{"$nulls":43},{"$f":"VLOOKUP(BD64,Estadísticas_Equipo,13,FALSE)","v":{"v":7.291965542685459,"d":"7.29"}},{"$f":"IF(NOT(BB56>BB64),\"G\",\"P\")","v":"G"},{"$f":"IF(BG62>BG66,BI62,BI66)","v":"Tennessee"}]
[]
[null,15,"Bradley",{"$f":"IF(NOT(E62>E66),\"G\",\"P\")","v":"P"},{"$f":"VLOOKUP(C66,Estadísticas_Equipo,13,FALSE)","v":{"v":2.701008731498003,"d":"2.70"}},{"$nulls":22},{"$f":"IF(Y34>Y98,W34,W98)","v":"Gonzaga"},{"$f":"IF(AD66>AH66,\"G\",\"P\")","v":"P"},{"$f":"VLOOKUP(AB66,Estadísticas_Equipo,13,FALSE)","v":{"v":7.760202645651562,"d":"7.76"}},null,{"$f":"IF(AD66>AH66,AB66,AJ66)","v":"Virginia"},null,{"$f":"VLOOKUP(AJ66,Estadísticas_Equipo,13,FALSE)","v":{"v":7.791762378882311,"d":"7.79"}},{"$f":"IF(NOT(AD66>AH66),\"G\",\"P\")","v":"G"},{"$f":"IF(AM34>AM100,AO34,AO98)","v":"Virginia"},{"$nulls":22},{"$f":"VLOOKUP(BI66,Estadísticas_Equipo,13,FALSE)","v":{"v":3.250380588777441,"d":"3.25"}},{"$f":"IF(NOT(BG62>BG66),\"G\",\"P\")","v":"P"},"Colgate",15]
[]
[]
[]
[null,1,"Gonzaga",{"$f":"IF(E70>E74,\"G\",\"P\")","v":"G"},{"$f":"VLOOKUP(C70,Estadísticas_Equipo,13,FALSE)","v":{"v":7.760202645651562,"d":"7.76"}},{"$nulls":53},{"$f":"VLOOKUP(BI70,Estadísticas_Equipo,13,FALSE)","v":{"v":7.22525153225871,"d":"7.23"}},{"$f":"IF(BG70>BG74,\"G\",\"P\")","v":"G"},"North Carolina",1]
[]
[{"$nulls":7},{"$f":"IF(E70>E74,C70,C74)","v":"Gonzaga"},{"$f":"IF(J72>J80,\"G\",\"P\")","v":"G"},{"$f":"VLOOKUP(H72,Estadísticas_Equipo,13,FALSE)","v":{"v":7.760202645651562,"d":"7.76"}},{"$nulls":43},{"$f":"VLOOKUP(BD72,Estadísticas_Equipo,13,FALSE)","v":{"v":7.22525153225871,"d":"7.23"}},{"$f":"IF(BB72>BB80,\"G\",\"P\")","v":"G"},{"$f":"IF(BG70>BG74,BI70,BI74)","v":"North Carolina"}]
[]
[null,16,{"$f":"IF(Y122>Y127,W122,W127)","v":"Prairie View"},{"$f":"IF(NOT(E70>E74),\"G\",\"P\")","v":"P"},{"$f":"VLOOKUP(C74,Estadísticas_Equipo,13,FALSE)","v":{"v":2.5923070662278684,"d":"2.59"}},{"$nulls":53},{"$f":"VLOOKUP(BI74,Estadísticas_Equipo,13,FALSE)","v":{"v":2.3227630995148942,"d":"2.32"}},{"$f":"IF(NOT(BG70>BG74),\"G\",\"P\")","v":"P"},"Iona",16]
[]
[{"$nulls":12},{"$f":"IF(J72>J80,H72,H80)","v":"Gonzaga"},{"$f":"IF(O76>O92,\"G\",\"P\")","v":"G"},{"$f":"VLOOKUP(M76,Estadísticas_Equipo,13,FALSE)","v":{"v":7.760202645651562,"d":"7.76"}},{"$nulls":33},{"$f":"VLOOKUP(AY76,Estadísticas_Equipo,13,FALSE)","v":{"v":7.22525153225871,"d":"7.23"}},{"$f":"IF(AW76>AW92,\"G\",\"P\")","v":"G"},{"$f":"IF(BB72>BB80,BD72,BD80)","v":"North Carolina"}]
[]
[null,8,"Syracuse",{"$f":"IF(E78>E82,\"G\",\"P\")","v":"G"},{"$f":"VLOOKUP(C78,Estadísticas_Equipo,13,FALSE)","v":{"v":4.6649873756150875,"d":"4.66"}},{"$nulls":53},{"$f":"VLOOKUP(BI78,Estadísticas_Equipo,13,FALSE)","v":{"v":5.455132446548888,"d":"5.46"}},{"$f":"IF(BG78>BG82,\"G\",\"P\")","v":"G"},"Utah St.",8]
[]
[{"$nulls":7},{"$f":"IF(E78>E82,C78,C82)","v":"Syracuse"},{"$f":"IF(NOT(J72>J80),\"G\",\"P\")","v":"P"},{"$f":"VLOOKUP(H80,Estadísticas_Equipo,13,FALSE)","v":{"v":4.6649873756150875,"d":"4.66"}},{"$nulls":43},{"$f":"VLOOKUP(BD80,Estadísticas_Equipo,13,FALSE)","v":{"v":5.455132446548888,"d":"5.46"}},{"$f":"IF(NOT(BB72>BB80),\"G\",\"P\")","v":"P"},{"$f":"IF(BG78>BG82,BI78,BI82)","v":"Utah St."}]
[]
[null,9,"Baylor",{"$f":"IF(NOT(E78>E82),\"G\",\"P\")","v":"P"},{"$f":"VLOOKUP(C82,Estadísticas_Equipo,13,FALSE)","v":{"v":4.417383804263087,"d":"4.42"}},{"$nulls":53},{"$f":"VLOOKUP(BI82,Estadísticas_Equipo,13,FALSE)","v":{"v":5.024917402520928,"d":"5.02"}},{"$f":"IF(NOT(BG78>BG82),\"G\",\"P\")","v":"P"},"Washington",9]
[]
[{"$nulls":17},{"$f":"IF(O76>O92,M76,M92)","v":"Gonzaga"},{"$f":"IF(T84>T116,\"G\",\"P\")","v":"G"},{"$f":"VLOOKUP(R84,Estadísticas_Equipo,13,FALSE)","v":{"v":7.760202645651562,"d":"7.76"}},{"$nulls":23},{"$f":"VLOOKUP(AT84,Estadísticas_Equipo,13,FALSE)","v":{"v":7.22525153225871,"d":"7.23"}},{"$f":"IF(AR84>AR116,\"G\",\"P\")","v":"P"},{"$f":"IF(AW76>AW92,AY76,AY92)","v":"North Carolina"}]
[]
[null,5,"Marquette",{"$f":"IF(E86>E90,\"G\",\"P\")","v":"G"},{"$f":"VLOOKUP(C86,Estadísticas_Equipo,13,FALSE)","v":{"v":5.873313948689454,"d":"5.87"}},{"$nulls":53},{"$f":"VLOOKUP(BI86,Estadísticas_Equipo,13,FALSE)","v":{"v":5.92108503361089,"d":"5.92"}},{"$f":"IF(BG86>BG90,\"G\",\"P\")","v":"G"},"Auburn",5]
[]
[{"$nulls":7},{"$f":"IF(E86>E90,C86,C90)","v":"Marquette"},{"$f":"IF(J88>J96,\"G\",\"P\")","v":"P"},{"$f":"VLOOKUP(H88,Estadísticas_Equipo,13,FALSE)","v":{"v":5.873313948689454,"d":"5.87"}},{"$nulls":43},{"$f":"VLOOKUP(BD88,Estadísticas_Equipo,13,FALSE)","v":{"v":5.92108503361089,"d":"5.92"}},{"$f":"IF(BB88>BB96,\"G\",\"P\")","v":"P"},{"$f":"IF(BG86>BG90,BI86,BI90)","v":"Auburn"}]
[]
[null,12,"Murray St.",{"$f":"IF(NOT(E86>E90),\"G\",\"P\")","v":"P"},{"$f":"VLOOKUP(C90,Estadísticas_Equipo,13,FALSE)","v":{"v":4.961787241379493,"d":"4.96"}},{"$nulls":53},{"$f":"VLOOKUP(BI90,Estadísticas_Equipo,13,FALSE)","v":{"v":4.776877411363061,"d":"4.78"}},{"$f":"IF(NOT(BG86>BG90),\"G\",\"P\")","v":"P"},"New Mexico St.",12]
[]
[{"$nulls":12},{"$f":"IF(J88>J96,H88,H96)","v":"Florida St."},{"$f":"IF(NOT(O76>O92),\"G\",\"P\")","v":"P"},{"$f":"VLOOKUP(M92,Estadísticas_Equipo,13,FALSE)","v":{"v":6.35590469140025,"d":"6.36"}},{"$nulls":33},{"$f":"VLOOKUP(AY92,Estadísticas_Equipo,13,FALSE)","v":{"v":6.066850577314702,"d":"6.07"}},{"$f":"IF(NOT(AW76>AW92),\"G\",\"P\")","v":"P"},{"$f":"IF(BB88>BB96,BD88,BD96)","v":"Kansas"}]
[]
[null,4,"Florida St.",{"$f":"IF(E94>E98,\"G\",\"P\")","v":"G"},{"$f":"VLOOKUP(C94,Estadísticas_Equipo,13,FALSE)","v":{"v":6.35590469140025,"d":"6.36"}},{"$nulls":53},{"$f":"VLOOKUP(BI94,Estadísticas_Equipo,13,FALSE)","v":{"v":6.066850577314702,"d":"6.07"}},{"$f":"IF(BG94>BG98,\"G\",\"P\")","v":"G"},"Kansas",4]
[]
[{"$nulls":7},{"$f":"IF(E94>E98,C94,C98)","v":"Florida St."},{"$f":"IF(NOT(J88>J96),\"G\",\"P\")","v":"G"},{"$f":"VLOOKUP(H96,Estadísticas_Equipo,13,FALSE)","v":{"v":6.35590469140025,"d":"6.36"}},{"$nulls":43},{"$f":"VLOOKUP(BD96,Estadísticas_Equipo,13,FALSE)","v":{"v":6.066850577314702,"d":"6.07"}},{"$f":"IF(NOT(BB88>BB96),\"G\",\"P\")","v":"G"},{"$f":"IF(BG94>BG98,BI94,BI98)","v":"Kansas"}]
[]
[null,13,"Vermont",{"$f":"IF(NOT(E94>E98),\"G\",\"P\")","v":"P"},{"$f":"VLOOKUP(C98,Estadísticas_Equipo,13,FALSE)","v":{"v":4.25910489001462,"d":"4.26"}},{"$nulls":17},{"$f":"IF(T84>T116,R84,R116)","v":"Gonzaga"},{"$f":"IF(NOT(Y34>Y98),\"G\",\"P\")","v":"G"},{"$f":"VLOOKUP(W98,Estadísticas_Equipo,13,FALSE)","v":{"v":7.760202645651562,"d":"7.76"}},{"$nulls":14},{"$f":"IF(NOT(AM34>AM100),\"G\",\"P\")","v":"P"},{"$f":"IF(AR84>AR116,AT84,AT116)","v":"Houston"},{"$nulls":17},{"$f":"VLOOKUP(BI98,Estadísticas_Equipo,13,FALSE)","v":{"v":3.5981834085326185,"d":"3.60"}},{"$f":"IF(NOT(BG94>BG98),\"G\",\"P\")","v":"P"},"Northeastern",13]
[]
[{"$nulls":23},{"$f":"IF(NOT(Y68>Y100),\"G\",\"P\")","v":"G"},{"$nulls":14},{"$f":"VLOOKUP(AO98,Estadísticas_Equipo,13,FALSE)","v":{"v":7.328552672888661,"d":"7.33"}}]
[]
[null,6,"Buffalo",{"$f":"IF(E102>E106,\"G\",\"P\")","v":"G"},{"$f":"VLOOKUP(C102,Estadísticas_Equipo,13,FALSE)","v":{"v":6.387487466379404,"d":"6.39"}},{"$nulls":18},{"$f":"IF(NOT(Y70>Y102),\"G\",\"P\")","v":"G"},{"$nulls":34},{"$f":"VLOOKUP(BI102,Estadísticas_Equipo,13,FALSE)","v":{"v":5.31082629356319,"d":"5.31"}},{"$f":"IF(BG102>BG106,\"G\",\"P\")","v":"G"},"Iowa St.",6]
[]
[{"$nulls":7},{"$f":"IF(E102>E106,C102,C106)","v":"Buffalo"},{"$f":"IF(J104>J112,\"G\",\"P\")","v":"P"},{"$f":"VLOOKUP(H104,Estadísticas_Equipo,13,FALSE)","v":{"v":6.387487466379404,"d":"6.39"}},{"$nulls":43},{"$f":"VLOOKUP(BD104,Estadísticas_Equipo,13,FALSE)","v":{"v":5.31082629356319,"d":"5.31"}},{"$f":"IF(BB104>BB112,\"G\",\"P\")","v":"P"},{"$f":"IF(BG102>BG106,BI102,BI106)","v":"Iowa St."}]
[]
[null,11,{"$f":"IF(AN122>AN127,AO122,AO127)","v":"St. John's (NY)"},{"$f":"IF(NOT(E102>E106),\"G\",\"P\")","v":"P"},{"$f":"VLOOKUP(C106,Estadísticas_Equipo,13,FALSE)","v":{"v":3.7484085186695797,"d":"3.75"}},{"$nulls":53},{"$f":"VLOOKUP(BI106,Estadísticas_Equipo,13,FALSE)","v":{"v":3.9049018505600492,"d":"3.90"}},{"$f":"IF(NOT(BG102>BG106),\"G\",\"P\")","v":"P"},"Ohio St.",11]
[]
[{"$nulls":12},{"$f":"IF(J104>J112,H104,H112)","v":"Texas Tech"},{"$f":"IF(O108>O124,\"G\",\"P\")","v":"P"},{"$f":"VLOOKUP(M108,Estadísticas_Equipo,13,FALSE)","v":{"v":6.9136576661824405,"d":"6.91"}},{"$nulls":33},{"$f":"VLOOKUP(AY108,Estadísticas_Equipo,13,FALSE)","v":{"v":7.328552672888661,"d":"7.33"}},{"$f":"IF(AW108>AW124,\"G\",\"P\")","v":"G"},{"$f":"IF(BB104>BB112,BD104,BD112)","v":"Houston"}]
[]
[null,3,"Texas Tech",{"$f":"IF(E110>E114,\"G\",\"P\")","v":"G"},{"$f":"VLOOKUP(C110,Estadísticas_Equipo,13,FALSE)","v":{"v":6.9136576661824405,"d":"6.91"}},{"$nulls":53},{"$f":"VLOOKUP(BI110,Estadísticas_Equipo,13,FALSE)","v":{"v":7.328552672888661,"d":"7.33"}},{"$f":"IF(BG110>BG114,\"G\",\"P\")","v":"G"},"Houston",3]
[]
[{"$nulls":7},{"$f":"IF(E110>E114,C110,C114)","v":"Texas Tech"},{"$f":"IF(NOT(J104>J112),\"G\",\"P\")","v":"G"},{"$f":"VLOOKUP(H112,Estadísticas_Equipo,13,FALSE)","v":{"v":6.9136576661824405,"d":"6.91"}},{"$nulls":43},{"$f":"VLOOKUP(BD112,Estadísticas_Equipo,13,FALSE)","v":{"v":7.328552672888661,"d":"7.33"}},{"$f":"IF(NOT(BB104>BB112),\"G\",\"P\")","v":"G"},{"$f":"IF(BG110>BG114,BI110,BI114)","v":"Houston"}]
[]
[null,14,"Northern Ky.",{"$f":"IF(NOT(E110>E114),\"G\",\"P\")","v":"P"},{"$f":"VLOOKUP(C114,Estadísticas_Equipo,13,FALSE)","v":{"v":3.7147504841625194,"d":"3.71"}},{"$nulls":53},{"$f":"VLOOKUP(BI114,Estadísticas_Equipo,13,FALSE)","v":{"v":3.3724278997238555,"d":"3.37"}},{"$f":"IF(NOT(BG110>BG114),\"G\",\"P\")","v":"P"},"Georgia St.",14]
[]
[{"$nulls":17},{"$f":"IF(O108>O124,M108,M124)","v":"Michigan"},{"$f":"IF(NOT(T84>T116),\"G\",\"P\")","v":"P"},{"$f":"VLOOKUP(R116,Estadísticas_Equipo,13,FALSE)","v":{"v":6.9365489770007995,"d":"6.94"}},{"$nulls":23},{"$f":"VLOOKUP(AT116,Estadísticas_Equipo,13,FALSE)","v":{"v":7.328552672888661,"d":"7.33"}},{"$f":"IF(NOT(AR84>AR116),\"G\",\"P\")","v":"G"},{"$f":"IF(AW108>AW124,AY108,AY124)","v":"Houston"}]
[]
[null,7,"Nevada",{"$f":"IF(E118>E122,\"G\",\"P\")","v":"G"},{"$f":"VLOOKUP(C118,Estadísticas_Equipo,13,FALSE)","v":{"v":6.199524129661893,"d":"6.20"}},{"$nulls":53},{"$f":"VLOOKUP(BI118,Estadísticas_Equipo,13,FALSE)","v":{"v":6.195472051603841,"d":"6.20"}},{"$f":"IF(BG118>BG122,\"G\",\"P\")","v":"G"},"Wofford",7]
[]
[{"$nulls":7},{"$f":"IF(E118>E122,C118,C122)","v":"Nevada"},{"$f":"IF(J120>J128,\"G\",\"P\")","v":"P"},{"$f":"VLOOKUP(H120,Estadísticas_Equipo,13,FALSE)","v":{"v":6.199524129661893,"d":"6.20"}},{"$nulls":43},{"$f":"VLOOKUP(BD120,Estadísticas_Equipo,13,FALSE)","v":{"v":6.195472051603841,"d":"6.20"}},{"$f":"IF(BB120>BB128,\"G\",\"P\")","v":"P"},{"$f":"IF(BG118>BG122,BI118,BI122)","v":"Wofford"}]
[]
[null,10,"Florida",{"$f":"IF(NOT(E118>E122),\"G\",\"P\")","v":"P"},{"$f":"VLOOKUP(C122,Estadísticas_Equipo,13,FALSE)","v":{"v":4.007314659704238,"d":"4.01"}},{"$nulls":17},"Fairleigh Dickinson",{"$f":"IF(Y122>Y127,\"G\",\"P\")","v":"P"},{"$f":"VLOOKUP(W122,Estadísticas_Equipo,13,FALSE)","v":{"v":2.5499054344093346,"d":"2.55"}},null,null,"Belmont",{"$f":"IF(AD122>AD129,\"G\",\"P\")","v":"G"},{"$f":"VLOOKUP(AB122,Estadísticas_Equipo,13,FALSE)","v":{"v":4.961893204939428,"d":"4.96"}},null,"Cuatro primeros",null,{"$f":"VLOOKUP(AJ122,Estadísticas_Equipo,13,FALSE)","v":{"v":2.1940826230550026,"d":"2.19"}},{"$f":"IF(AH122>AH127,\"G\",\"P\")","v":"P"},"North Dakota St.",null,null,{"$f":"VLOOKUP(AO122,Estadísticas_Equipo,13,FALSE)","v":{"v":4.052184591268236,"d":"4.05"}},{"$f":"IF(AM122>AM127,\"G\",\"P\")","v":"G"},"Arizona St.",{"$nulls":17},{"$f":"VLOOKUP(BI122,Estadísticas_Equipo,13,FALSE)","v":{"v":4.033487067894304,"d":"4.03"}},{"$f":"IF(NOT(BG118>BG122),\"G\",\"P\")","v":"P"},"Seton Hall",10]
[]
[{"$nulls":12},{"$f":"IF(J120>J128,H120,H128)","v":"Michigan"},{"$f":"IF(NOT(O108>O124),\"G\",\"P\")","v":"G"},{"$f":"VLOOKUP(M124,Estadísticas_Equipo,13,FALSE)","v":{"v":6.9365489770007995,"d":"6.94"}},{"$nulls":33},{"$f":"VLOOKUP(AY124,Estadísticas_Equipo,13,FALSE)","v":{"v":6.998123068063717,"d":"7.00"}},{"$f":"IF(NOT(AW108>AW124),\"G\",\"P\")","v":"P"},{"$f":"IF(BB120>BB128,BD120,BD128)","v":"Kentucky"}]
[]
[null,2,"Michigan",{"$f":"IF(E126>E130,\"G\",\"P\")","v":"G"},{"$f":"VLOOKUP(C126,Estadísticas_Equipo,13,FALSE)","v":{"v":6.9365489770007995,"d":"6.94"}},{"$nulls":53},{"$f":"VLOOKUP(BI126,Estadísticas_Equipo,13,FALSE)","v":{"v":6.998123068063717,"d":"7.00"}},{"$f":"IF(BG126>BG130,\"G\",\"P\")","v":"G"},"Kentucky",2]
[{"$nulls":22},"Prairie View",{"$f":"IF(NOT(Y122>Y127),\"G\",\"P\")","v":"G"},{"$f":"VLOOKUP(W127,Estadísticas_Equipo,13,FALSE)","v":{"v":2.5923070662278684,"d":"2.59"}},null,null,"Temple",{"$f":"IF(NOT(AD122>AD127),\"G\",\"P\")","v":"P"},{"$nulls":4},{"$f":"VLOOKUP(AJ127,Estadísticas_Equipo,13,FALSE)","v":{"v":2.1991160365164992,"d":"2.20"}},{"$f":"IF(NOT(AH122>AH127),\"G\",\"P\")","v":"G"},"N.C. Central",null,null,{"$f":"VLOOKUP(AO127,Estadísticas_Equipo,13,FALSE)","v":{"v":3.7484085186695797,"d":"3.75"}},{"$f":"IF(NOT(AM122>AM127),\"G\",\"P\")","v":"P"},"St. John's (NY)"]
[{"$nulls":7},{"$f":"IF(E126>E130,C126,C130)","v":"Michigan"},{"$f":"IF(NOT(J120>J128),\"G\",\"P\")","v":"G"},{"$f":"VLOOKUP(H128,Estadísticas_Equipo,13,FALSE)","v":{"v":6.9365489770007995,"d":"6.94"}},{"$nulls":43},{"$f":"VLOOKUP(BD128,Estadísticas_Equipo,13,FALSE)","v":{"v":6.998123068063717,"d":"7.00"}},{"$f":"IF(NOT(BB120>BB128),\"G\",\"P\")","v":"G"},{"$f":"IF(BG126>BG130,BI126,BI130)","v":"Kentucky"}]
[{"$nulls":29},{"$f":"VLOOKUP(AB127,Estadísticas_Equipo,13,FALSE)","v":{"v":4.305389020348394,"d":"4.31"}}]
[null,15,"Montana",{"$f":"IF(NOT(E126>E130),\"G\",\"P\")","v":"P"},{"$f":"VLOOKUP(C130,Estadísticas_Equipo,13,FALSE)","v":{"v":3.5023620162425306,"d":"3.50"}},{"$nulls":53},{"$f":"VLOOKUP(BI130,Estadísticas_Equipo,13,FALSE)","v":{"v":3.6601858798581657,"d":"3.66"}},{"$f":"IF(NOT(BG126>BG130),\"G\",\"P\")","v":"P"},"Abilene Christian",15]

{"sheet":"Ranking de la NCAA","index":3,"n_rows":358,"n_cols":12,"rows_kept":358}
[{"$nulls":10}," "]
[]
[null,"Hasta partidos del 17 de marzo de 2019"]
[]
[null,"Clasificación","Anterior","Universidad","Conferencia","Récord","Visitante","Neutral","Local","Non Div I",null,"Clasificación"]
[null,1,1,"Virginia","ACC","29-3","10-1","4-1","15-1","0-0",null,{"$f":"+Tabla_Ránking_NCAA[[#This Row],[Clasificación]]","v":1}]
[null,2,2,"Gonzaga","WCC","30-3","9-1","4-2","17-0","0-0",null,{"$f":"+Tabla_Ránking_NCAA[[#This Row],[Clasificación]]","v":2}]
[null,3,3,"Duke","ACC","29-5","7-2","7-1","15-2","0-0",null,{"$f":"+Tabla_Ránking_NCAA[[#This Row],[Clasificación]]","v":3}]
[null,4,4,"Houston","AAC","31-3","11-1","1-1","19-1","0-0",null,{"$f":"+Tabla_Ránking_NCAA[[#This Row],[Clasificación]]","v":4}]
[null,5,5,"Tennessee","SEC","29-5","7-3","4-2","17-0","1-0",null,{"$f":"+Tabla_Ránking_NCAA[[#This Row],[Clasificación]]","v":5}]
[null,6,6,"Kentucky","SEC","27-6","8-2","2-3","17-1","0-0",null,{"$f":"+Tabla_Ránking_NCAA[[#This Row],[Clasificación]]","v":6}]
[null,7,7,"North Carolina","ACC","27-6","11-1","2-3","14-2","0-0",null,{"$f":"+Tabla_Ránking_NCAA[[#This Row],[Clasificación]]","v":7}]
[null,8,8,"Michigan St.","Big Ten","28-6","8-4","5-1","15-1","0-0",null,{"$f":"+Tabla_Ránking_NCAA[[#This Row],[Clasificación]]","v":8}]
[null,9,9,"Michigan","Big Ten","28-6","7-4","4-1","17-1","0-0",null,{"$f":"+Tabla_Ránking_NCAA[[#This Row],[Clasificación]]","v":9}]
[null,10,10,"Texas Tech","Big 12","26-6","6-3","3-2","17-1","0-0",null,{"$f":"+Tabla_Ránking_NCAA[[#This Row],[Clasificación]]","v":10}]
[null,11,11,"Virginia Tech","ACC","24-8","5-5","5-1","14-2","0-0",null,{"$f":"+Tabla_Ránking_NCAA[[#This Row],[Clasificación]]","v":11}]
[null,12,12,"Purdue","Big Ten","23-9","6-6","2-3","15-0","0-0",null,{"$f":"+Tabla_Ránking_NCAA[[#This Row],[Clasificación]]","v":12}]
[null,13,13,"Wofford","SoCon","29-4","11-3","3-0","12-1","3-0",null,{"$f":"+Tabla_Ránking_NCAA[[#This Row],[Clasificación]]","v":13}]
[null,14,14,"LSU","SEC","26-6","9-1","2-3","15-2","0-0",null,{"$f":"+Tabla_Ránking_NCAA[[#This Row],[Clasificación]]","v":14}]
[null,15,15,"Buffalo","MAC","31-3","12-3","5-0","13-0","1-0",null,{"$f":"+Tabla_Ránking_NCAA[[#This Row],[Clasificación]]","v":15}]
[null,16,16,"Florida St.","ACC","27-7","6-4","6-2","15-1","0-0",null,{"$f":"+Tabla_Ránking_NCAA[[#This Row],[Clasificación]]","v":16}]
[null,17,17,"Wisconsin","Big Ten","23-10","8-5","3-2","12-3","0-0",null,{"$f":"+Tabla_Ránking_NCAA[[#This Row],[Clasificación]]","v":17}]
[null,18,18,"Auburn","SEC","26-9","4-6","7-1","14-2","1-0",null,{"$f":"+Tabla_Ránking_NCAA[[#This Row],[Clasificación]]","v":18}]
[null,19,19,"Mississippi St.","SEC","23-10","5-5","4-2","14-3","0-0",null,{"$f":"+Tabla_Ránking_NCAA[[#This Row],[Clasificación]]","v":19}]
[null,20,20,"Kansas","Big 12","25-9","3-8","5-1","17-0","0-0",null,{"$f":"+Tabla_Ránking_NCAA[[#This Row],[Clasificación]]","v":20}]
[null,21,21,"Iowa St.","Big 12","23-11","5-6","6-1","12-4","0-0",null,{"$f":"+Tabla_Ránking_NCAA[[#This Row],[Clasificación]]","v":21}]
[null,22,22,"Louisville","ACC","20-13","5-6","1-3","14-4","0-0",null,{"$f":"+Tabla_Ránking_NCAA[[#This Row],[Clasificación]]","v":22}]
[null,23,23,"Nevada","MWC","29-4","9-3","5-1","15-0","0-0",null,{"$f":"+Tabla_Ránking_NCAA[[#This Row],[Clasificación]]","v":23}]
[null,24,24,"Kansas St.","Big 12","25-8","7-5","4-1","14-2","0-0",null,{"$f":"+Tabla_Ránking_NCAA[[#This Row],[Clasificación]]","v":24}]
[null,25,25,"Cincinnati","AAC","28-6","7-4","5-0","16-2","0-0",null,{"$f":"+Tabla_Ránking_NCAA[[#This Row],[Clasificación]]","v":25}]
[null,26,26,"Villanova","Big East","25-9","5-7","7-0","13-2","0-0",null,{"$f":"+Tabla_Ránking_NCAA[[#This Row],[Clasificación]]","v":26}]
[null,27,27,"Maryland","Big Ten","22-10","6-5","1-2","15-3","0-0",null,{"$f":"+Tabla_Ránking_NCAA[[#This Row],[Clasificación]]","v":27}]
[null,28,28,"Marquette","Big East","24-9","7-4","1-2","16-3","0-0",null,{"$f":"+Tabla_Ránking_NCAA[[#This Row],[Clasificación]]","v":28}]
[null,29,29,"Utah St.","MWC","28-6","9-4","5-1","13-1","1-0",null,{"$f":"+Tabla_Ránking_NCAA[[#This Row],[Clasificación]]","v":29}]
[null,30,30,"UCF","AAC","23-8","5-6","3-0","15-2","0-0",null,{"$f":"+Tabla_Ránking_NCAA[[#This Row],[Clasificación]]","v":30}]
[null,31,31,"Florida","SEC","19-15","5-6","5-3","9-6","0-0",null,{"$f":"+Tabla_Ránking_NCAA[[#This Row],[Clasificación]]","v":31}]
[null,32,32,"Saint Mary's (CA)","WCC","22-11","5-5","3-3","14-3","0-0",null,{"$f":"+Tabla_Ránking_NCAA[[#This Row],[Clasificación]]","v":32}]
[null,33,33,"NC State","ACC","22-11","4-6","3-1","15-4","0-0",null,{"$f":"+Tabla_Ránking_NCAA[[#This Row],[Clasificación]]","v":33}]
[null,34,34,"VCU","Atlantic 10","25-7","8-4","1-2","16-1","0-0",null,{"$f":"+Tabla_Ránking_NCAA[[#This Row],[Clasificación]]","v":34}]
[null,35,35,"Clemson","ACC","19-13","4-6","2-3","13-4","0-0",null,{"$f":"+Tabla_Ránking_NCAA[[#This Row],[Clasificación]]","v":35}]
[null,36,36,"Ole Miss","SEC","20-12","6-5","3-2","11-5","0-0",null,{"$f":"+Tabla_Ránking_NCAA[[#This Row],[Clasificación]]","v":36}]
[null,37,37,"Oklahoma","Big 12","19-13","5-7","3-2","11-4","0-0",null,{"$f":"+Tabla_Ránking_NCAA[[#This Row],[Clasificación]]","v":37}]
[null,38,38,"Texas","Big 12","16-16","2-8","2-2","12-6","0-0",null,{"$f":"+Tabla_Ránking_NCAA[[#This Row],[Clasificación]]","v":38}]
[null,39,39,"Baylor","Big 12","19-13","5-6","1-2","13-5","0-0",null,{"$f":"+Tabla_Ránking_NCAA[[#This Row],[Clasificación]]","v":39}]
[null,40,40,"New Mexico St.","WAC","30-4","10-2","4-1","14-1","2-0",null,{"$f":"+Tabla_Ránking_NCAA[[#This Row],[Clasificación]]","v":40}]
[null,41,41,"Furman","SoCon","25-7","11-4","1-1","10-2","3-0",null,{"$f":"+Tabla_Ránking_NCAA[[#This Row],[Clasificación]]","v":41}]
[null,42,42,"Syracuse","ACC","20-13","6-4","1-3","13-6","0-0",null,{"$f":"+Tabla_Ránking_NCAA[[#This Row],[Clasificación]]","v":42}]
[null,43,43,"Iowa","Big Ten","22-11","4-6","4-1","14-4","0-0",null,{"$f":"+Tabla_Ránking_NCAA[[#This Row],[Clasificación]]","v":43}]
[null,44,44,"Murray St.","OVC","27-4","10-3","2-0","13-1","2-0",null,{"$f":"+Tabla_Ránking_NCAA[[#This Row],[Clasificación]]","v":44}]
[null,45,45,"Washington","Pac-12","26-8","7-4","4-3","15-1","0-0",null,{"$f":"+Tabla_Ránking_NCAA[[#This Row],[Clasificación]]","v":45}]
[null,46,46,"Memphis","AAC","21-13","3-7","1-3","17-3","0-0",null,{"$f":"+Tabla_Ránking_NCAA[[#This Row],[Clasificación]]","v":46}]
[null,47,47,"Belmont","OVC","26-5","12-3","1-1","12-1","1-0",null,{"$f":"+Tabla_Ránking_NCAA[[#This Row],[Clasificación]]","v":47}]
[null,48,48,"Nebraska","Big Ten","18-16","2-9","4-2","11-5","1-0",null,{"$f":"+Tabla_Ránking_NCAA[[#This Row],[Clasificación]]","v":48}]
[null,49,49,"Lipscomb","ASUN","25-7","11-4","0-0","12-3","2-0",null,{"$f":"+Tabla_Ránking_NCAA[[#This Row],[Clasificación]]","v":49}]
[null,50,50,"Penn St.","Big Ten","14-18","4-9","1-3","9-6","0-0",null,{"$f":"+Tabla_Ránking_NCAA[[#This Row],[Clasificación]]","v":50}]
[null,51,51,"Oregon","Pac-12","23-12","5-7","5-1","13-4","0-0",null,{"$f":"+Tabla_Ránking_NCAA[[#This Row],[Clasificación]]","v":51}]
[null,52,52,"TCU","Big 12","20-13","3-7","5-1","12-5","0-0",null,{"$f":"+Tabla_Ránking_NCAA[[#This Row],[Clasificación]]","v":52}]
[null,53,53,"Creighton","Big East","18-14","4-7","3-1","10-6","1-0",null,{"$f":"+Tabla_Ránking_NCAA[[#This Row],[Clasificación]]","v":53}]
[null,54,54,"Indiana","Big Ten","17-15","3-9","1-1","13-5","0-0",null,{"$f":"+Tabla_Ránking_NCAA[[#This Row],[Clasificación]]","v":54}]
[null,55,55,"Ohio St.","Big Ten","19-14","5-7","2-1","12-6","0-0",null,{"$f":"+Tabla_Ránking_NCAA[[#This Row],[Clasificación]]","v":55}]
[null,56,56,"Temple","AAC","23-9","8-5","2-2","13-2","0-0",null,{"$f":"+Tabla_Ránking_NCAA[[#This Row],[Clasificación]]","v":56}]
[null,57,57,"Seton Hall","Big East","20-13","3-8","6-1","11-4","0-0",null,{"$f":"+Tabla_Ránking_NCAA[[#This Row],[Clasificación]]","v":57}]
[null,58,58,"Liberty","ASUN","28-6","11-3","1-2","13-1","3-0",null,{"$f":"+Tabla_Ránking_NCAA[[#This Row],[Clasificación]]","v":58}]
[null,59,59,"Alabama","SEC","18-15","4-8","4-2","10-5","0-0",null,{"$f":"+Tabla_Ránking_NCAA[[#This Row],[Clasificación]]","v":59}]
[null,60,60,"UNC Greensboro","SoCon","28-6","11-4","3-1","12-1","2-0",null,{"$f":"+Tabla_Ránking_NCAA[[#This Row],[Clasificación]]","v":60}]
[null,61,61,"Minnesota","Big Ten","21-13","2-9","6-1","13-3","0-0",null,{"$f":"+Tabla_Ránking_NCAA[[#This Row],[Clasificación]]","v":61}]
[null,62,62,"Toledo","MAC","25-7","8-4","3-1","13-2","1-0",null,{"$f":"+Tabla_Ránking_NCAA[[#This Row],[Clasificación]]","v":62}]
[null,63,63,"Arizona St.","Pac-12","22-10","6-5","3-2","13-3","0-0",null,{"$f":"+Tabla_Ránking_NCAA[[#This Row],[Clasificación]]","v":63}]
[null,64,64,"Butler","Big East","16-16","2-9","2-3","12-4","0-0",null,{"$f":"+Tabla_Ránking_NCAA[[#This Row],[Clasificación]]","v":64}]
[null,65,65,"Arkansas","SEC","17-15","4-7","1-2","12-6","0-0",null,{"$f":"+Tabla_Ránking_NCAA[[#This Row],[Clasificación]]","v":65}]
[null,66,66,"Colorado","Pac-12","21-12","5-8","3-2","13-2","0-0",null,{"$f":"+Tabla_Ránking_NCAA[[#This Row],[Clasificación]]","v":66}]
[null,67,67,"Xavier","Big East","18-15","4-7","2-3","12-5","0-0",null,{"$f":"+Tabla_Ránking_NCAA[[#This Row],[Clasificación]]","v":67}]
[null,68,68,"UC Irvine","Big West","30-5","13-2","5-1","11-2","1-0",null,{"$f":"+Tabla_Ránking_NCAA[[#This Row],[Clasificación]]","v":68}]
[null,69,69,"Dayton","Atlantic 10","21-11","7-3","1-4","13-4","0-0",null,{"$f":"+Tabla_Ránking_NCAA[[#This Row],[Clasificación]]","v":69}]
[null,70,70,"Providence","Big East","18-15","5-6","2-3","11-6","0-0",null,{"$f":"+Tabla_Ránking_NCAA[[#This Row],[Clasificación]]","v":70}]
[null,71,71,"Vermont","America East","27-6","11-4","0-0","15-2","1-0",null,{"$f":"+Tabla_Ránking_NCAA[[#This Row],[Clasificación]]","v":71}]
[null,72,72,"ETSU","SoCon","24-9","8-6","3-1","11-2","2-0",null,{"$f":"+Tabla_Ránking_NCAA[[#This Row],[Clasificación]]","v":72}]
[null,73,73,"St. John's (NY)","Big East","21-12","4-7","3-0","14-5","0-0",null,{"$f":"+Tabla_Ránking_NCAA[[#This Row],[Clasificación]]","v":73}]
[null,74,74,"San Francisco","WCC","21-10","6-5","1-2","13-3","1-0",null,{"$f":"+Tabla_Ránking_NCAA[[#This Row],[Clasificación]]","v":74}]
[null,75,75,"Davidson","Atlantic 10","24-9","7-5","3-3","13-1","1-0",null,{"$f":"+Tabla_Ránking_NCAA[[#This Row],[Clasificación]]","v":75}]
[null,76,76,"Hofstra","CAA","27-7","10-5","2-1","14-1","1-0",null,{"$f":"+Tabla_Ránking_NCAA[[#This Row],[Clasificación]]","v":76}]
[null,77,77,"Missouri","SEC","15-17","2-8","4-2","9-7","0-0",null,{"$f":"+Tabla_Ránking_NCAA[[#This Row],[Clasificación]]","v":77}]
[null,78,78,"Northeastern","CAA","23-10","8-6","4-2","11-2","0-0",null,{"$f":"+Tabla_Ránking_NCAA[[#This Row],[Clasificación]]","v":78}]
[null,79,79,"Oklahoma St.","Big 12","12-20","2-9","2-4","8-7","0-0",null,{"$f":"+Tabla_Ránking_NCAA[[#This Row],[Clasificación]]","v":79}]
[null,80,80,"Fresno St.","MWC","23-9","7-3","3-2","12-4","1-0",null,{"$f":"+Tabla_Ránking_NCAA[[#This Row],[Clasificación]]","v":80}]
[null,81,81,"South Carolina","SEC","16-16","4-8","1-2","10-6","1-0",null,{"$f":"+Tabla_Ránking_NCAA[[#This Row],[Clasificación]]","v":81}]
[null,82,82,"Georgetown","Big East","19-13","5-6","1-2","13-5","0-0",null,{"$f":"+Tabla_Ránking_NCAA[[#This Row],[Clasificación]]","v":82}]
[null,83,83,"Wichita St.","AAC","19-14","4-7","4-3","11-4","0-0",null,{"$f":"+Tabla_Ránking_NCAA[[#This Row],[Clasificación]]","v":83}]
[null,84,84,"Texas A&M","SEC","14-18","4-7","1-3","9-8","0-0",null,{"$f":"+Tabla_Ránking_NCAA[[#This Row],[Clasificación]]","v":84}]
[null,85,85,"BYU","WCC","19-13","5-8","1-2","13-3","0-0",null,{"$f":"+Tabla_Ránking_NCAA[[#This Row],[Clasificación]]","v":85}]
[null,86,86,"Yale","Ivy League","22-7","8-5","2-0","11-2","1-0",null,{"$f":"+Tabla_Ránking_NCAA[[#This Row],[Clasificación]]","v":86}]
[null,87,87,"Oregon St.","Pac-12","18-13","6-5","2-2","10-6","0-0",null,{"$f":"+Tabla_Ránking_NCAA[[#This Row],[Clasificación]]","v":87}]
[null,88,88,"Southern California","Pac-12","16-17","2-9","2-3","12-5","0-0",null,{"$f":"+Tabla_Ránking_NCAA[[#This Row],[Clasificación]]","v":88}]
[null,89,89,"Northwestern","Big Ten","13-19","1-9","2-2","10-8","0-0",null,{"$f":"+Tabla_Ránking_NCAA[[#This Row],[Clasificación]]","v":89}]
[null,90,90,"Utah Valley","WAC","24-9","8-7","3-1","11-1","2-0",null,{"$f":"+Tabla_Ránking_NCAA[[#This Row],[Clasificación]]","v":90}]
[null,91,91,"Southern Miss.","C-USA","20-12","7-7","2-2","8-2","3-1",null,{"$f":"+Tabla_Ránking_NCAA[[#This Row],[Clasificación]]","v":91}]
[null,92,92,"Miami (FL)","ACC","14-18","0-10","3-3","11-5","0-0",null,{"$f":"+Tabla_Ránking_NCAA[[#This Row],[Clasificación]]","v":92}]
[null,93,93,"Arizona","Pac-12","17-15","4-7","1-3","12-5","0-0",null,{"$f":"+Tabla_Ránking_NCAA[[#This Row],[Clasificación]]","v":93}]
[null,94,94,"Tulsa","AAC","18-14","3-8","1-3","14-3","0-0",null,{"$f":"+Tabla_Ránking_NCAA[[#This Row],[Clasificación]]","v":94}]
[null,95,95,"UConn","AAC","16-17","1-8","2-4","13-5","0-0",null,{"$f":"+Tabla_Ránking_NCAA[[#This Row],[Clasificación]]","v":95}]
[null,96,96,"Grand Canyon","WAC","20-13","5-7","3-4","11-2","1-0",null,{"$f":"+Tabla_Ránking_NCAA[[#This Row],[Clasificación]]","v":96}]
[null,97,97,"San Diego","WCC","21-14","5-8","4-2","11-4","1-0",null,{"$f":"+Tabla_Ránking_NCAA[[#This Row],[Clasificación]]","v":97}]
[null,98,98,"SMU","AAC","15-17","3-7","2-2","10-8","0-0",null,{"$f":"+Tabla_Ránking_NCAA[[#This Row],[Clasificación]]","v":98}]
[null,99,99,"South Fla.","AAC","19-13","4-6","1-2","13-5","1-0",null,{"$f":"+Tabla_Ránking_NCAA[[#This Row],[Clasificación]]","v":99}]
[null,100,100,"Old Dominion","C-USA","26-8","8-4","4-2","14-2","0-0",null,{"$f":"+Tabla_Ránking_NCAA[[#This Row],[Clasificación]]","v":100}]
[null,101,101,"Rutgers","Big Ten","14-17","4-9","0-1","10-7","0-0",null,{"$f":"+Tabla_Ránking_NCAA[[#This Row],[Clasificación]]","v":101}]
[null,102,102,"DePaul","Big East","15-15","3-9","0-0","12-6","0-0",null,{"$f":"+Tabla_Ránking_NCAA[[#This Row],[Clasificación]]","v":102}]
[null,103,103,"Saint Louis","Atlantic 10","23-12","4-8","4-2","15-2","0-0",null,{"$f":"+Tabla_Ránking_NCAA[[#This Row],[Clasificación]]","v":103}]
[null,104,104,"South Dakota St.","Summit League","24-8","7-5","3-2","13-1","1-0",null,{"$f":"+Tabla_Ránking_NCAA[[#This Row],[Clasificación]]","v":104}]
[null,105,105,"Utah","Pac-12","17-14","6-5","1-4","10-5","0-0",null,{"$f":"+Tabla_Ránking_NCAA[[#This Row],[Clasificación]]","v":105}]
[null,106,106,"West Virginia","Big 12","14-20","0-10","4-4","10-6","0-0",null,{"$f":"+Tabla_Ránking_NCAA[[#This Row],[Clasificación]]","v":106}]
[null,107,107,"Col. of Charleston","CAA","24-9","8-5","3-2","12-2","1-0",null,{"$f":"+Tabla_Ránking_NCAA[[#This Row],[Clasificación]]","v":107}]
[null,108,108,"Stanford","Pac-12","15-16","4-9","1-3","10-4","0-0",null,{"$f":"+Tabla_Ránking_NCAA[[#This Row],[Clasificación]]","v":108}]
[null,109,109,"Illinois","Big Ten","12-21","1-9","2-5","9-7","0-0",null,{"$f":"+Tabla_Ránking_NCAA[[#This Row],[Clasificación]]","v":109}]
[null,110,110,"Penn","Ivy League","19-12","9-5","1-3","8-4","1-0",null,{"$f":"+Tabla_Ránking_NCAA[[#This Row],[Clasificación]]","v":110}]
[null,111,111,"Western Ky.","C-USA","20-14","6-8","4-2","10-4","0-0",null,{"$f":"+Tabla_Ránking_NCAA[[#This Row],[Clasificación]]","v":111}]
[null,112,112,"Notre Dame","ACC","14-19","1-9","2-2","11-8","0-0",null,{"$f":"+Tabla_Ránking_NCAA[[#This Row],[Clasificación]]","v":112}]
[null,113,113,"Central Mich.","MAC","23-11","7-5","3-2","10-4","3-0",null,{"$f":"+Tabla_Ránking_NCAA[[#This Row],[Clasificación]]","v":113}]
[null,114,114,"Akron","MAC","17-16","1-10","2-3","12-3","2-0",null,{"$f":"+Tabla_Ránking_NCAA[[#This Row],[Clasificación]]","v":114}]
[null,115,115,"Northern Ky.","Horizon","26-8","7-7","2-0","15-1","2-0",null,{"$f":"+Tabla_Ránking_NCAA[[#This Row],[Clasificación]]","v":115}]
[null,116,116,"San Diego St.","MWC","21-13","5-7","2-3","13-3","1-0",null,{"$f":"+Tabla_Ránking_NCAA[[#This Row],[Clasificación]]","v":116}]
[null,117,117,"Bowling Green","MAC","22-12","5-9","3-1","12-2","2-0",null,{"$f":"+Tabla_Ránking_NCAA[[#This Row],[Clasificación]]","v":117}]
[null,118,118,"St. Bonaventure","Atlantic 10","18-16","6-7","2-4","10-5","0-0",null,{"$f":"+Tabla_Ránking_NCAA[[#This Row],[Clasificación]]","v":118}]
[null,119,119,"Louisiana Tech","C-USA","20-13","4-10","1-2","13-1","2-0",null,{"$f":"+Tabla_Ránking_NCAA[[#This Row],[Clasificación]]","v":119}]
[null,120,120,"UCLA","Pac-12","17-16","3-7","1-4","13-5","0-0",null,{"$f":"+Tabla_Ránking_NCAA[[#This Row],[Clasificación]]","v":120}]
[null,121,121,"Georgia St.","Sun Belt","24-9","7-7","4-1","12-1","1-0",null,{"$f":"+Tabla_Ránking_NCAA[[#This Row],[Clasificación]]","v":121}]
[null,122,122,"Georgia","SEC","11-21","2-9","1-3","8-9","0-0",null,{"$f":"+Tabla_Ránking_NCAA[[#This Row],[Clasificación]]","v":122}]
[null,123,123,"Pittsburgh","ACC","14-19","0-11","3-1","11-7","0-0",null,{"$f":"+Tabla_Ránking_NCAA[[#This Row],[Clasificación]]","v":123}]
[null,124,124,"Montana","Big Sky","26-8","9-5","5-1","10-2","2-0",null,{"$f":"+Tabla_Ránking_NCAA[[#This Row],[Clasificación]]","v":124}]
[null,125,125,"Ga. Southern","Sun Belt","21-12","7-7","4-1","8-4","2-0",null,{"$f":"+Tabla_Ránking_NCAA[[#This Row],[Clasificación]]","v":125}]
[null,126,126,"Georgia Tech","ACC","14-18","3-9","0-2","11-7","0-0",null,{"$f":"+Tabla_Ránking_NCAA[[#This Row],[Clasificación]]","v":126}]
[null,127,127,"Drake","MVC","24-9","7-5","4-2","11-2","2-0",null,{"$f":"+Tabla_Ránking_NCAA[[#This Row],[Clasificación]]","v":127}]
[null,128,128,"Loyola Chicago","MVC","20-13","5-6","2-3","12-4","1-0",null,{"$f":"+Tabla_Ránking_NCAA[[#This Row],[Clasificación]]","v":128}]
[null,129,129,"Harvard","Ivy League","18-11","7-9","2-0","8-2","1-0",null,{"$f":"+Tabla_Ránking_NCAA[[#This Row],[Clasificación]]","v":129}]
[null,130,130,"Jacksonville St.","OVC","24-9","10-7","3-1","9-1","2-0",null,{"$f":"+Tabla_Ránking_NCAA[[#This Row],[Clasificación]]","v":130}]
[null,131,131,"Ball St.","MAC","16-17","8-7","1-3","6-7","1-0",null,{"$f":"+Tabla_Ránking_NCAA[[#This Row],[Clasificación]]","v":131}]
[null,132,132,"Colgate","Patriot","24-10","9-9","0-0","14-1","1-0",null,{"$f":"+Tabla_Ránking_NCAA[[#This Row],[Clasificación]]","v":132}]
[null,133,133,"UAB","C-USA","20-14","6-5","3-4","9-5","2-0",null,{"$f":"+Tabla_Ránking_NCAA[[#This Row],[Clasificación]]","v":133}]
[null,134,134,"Texas St.","Sun Belt","24-9","10-5","3-1","9-3","2-0",null,{"$f":"+Tabla_Ránking_NCAA[[#This Row],[Clasificación]]","v":134}]
[null,135,135,"Austin Peay","OVC","22-11","8-7","4-2","8-2","2-0",null,{"$f":"+Tabla_Ránking_NCAA[[#This Row],[Clasificación]]","v":135}]
[null,136,136,"Boston College","ACC","14-17","2-8","2-1","10-8","0-0",null,{"$f":"+Tabla_Ránking_NCAA[[#This Row],[Clasificación]]","v":136}]
[null,137,137,"Rhode Island","Atlantic 10","18-15","5-8","4-2","9-5","0-0",null,{"$f":"+Tabla_Ránking_NCAA[[#This Row],[Clasificación]]","v":137}]
[null,138,138,"Kent St.","MAC","22-10","8-6","0-1","12-3","2-0",null,{"$f":"+Tabla_Ránking_NCAA[[#This Row],[Clasificación]]","v":138}]
[null,139,139,"Northern Ill.","MAC","17-17","5-9","2-2","8-6","2-0",null,{"$f":"+Tabla_Ránking_NCAA[[#This Row],[Clasificación]]","v":139}]
[null,140,140,"Wright St.","Horizon","21-13","5-7","1-4","13-2","2-0",null,{"$f":"+Tabla_Ránking_NCAA[[#This Row],[Clasificación]]","v":140}]
[null,141,141,"UTSA","C-USA","17-15","5-7","1-4","8-3","3-1",null,{"$f":"+Tabla_Ránking_NCAA[[#This Row],[Clasificación]]","v":141}]
[null,142,142,"Loyola Marymount","WCC","20-11","7-6","2-1","9-4","2-0",null,{"$f":"+Tabla_Ránking_NCAA[[#This Row],[Clasificación]]","v":142}]
[null,143,143,"Southern Ill.","MVC","17-15","7-7","1-2","9-6","0-0",null,{"$f":"+Tabla_Ránking_NCAA[[#This Row],[Clasificación]]","v":143}]
[null,144,144,"Radford","Big South","22-11","9-7","2-1","8-3","3-0",null,{"$f":"+Tabla_Ránking_NCAA[[#This Row],[Clasificación]]","v":144}]
[null,145,145,"Brown","Ivy League","19-11","7-8","0-0","10-3","2-0",null,{"$f":"+Tabla_Ránking_NCAA[[#This Row],[Clasificación]]","v":145}]
[null,146,146,"Miami (OH)","MAC","15-17","4-10","1-2","8-5","2-0",null,{"$f":"+Tabla_Ránking_NCAA[[#This Row],[Clasificación]]","v":146}]
[null,147,147,"North Texas","C-USA","21-12","6-7","2-1","10-4","3-0",null,{"$f":"+Tabla_Ránking_NCAA[[#This Row],[Clasificación]]","v":147}]
[null,148,148,"Marshall","C-USA","19-14","6-10","1-1","12-3","0-0",null,{"$f":"+Tabla_Ránking_NCAA[[#This Row],[Clasificación]]","v":148}]
[null,149,149,"Boise St.","MWC","13-20","3-10","2-3","7-7","1-0",null,{"$f":"+Tabla_Ránking_NCAA[[#This Row],[Clasificación]]","v":149}]
[null,150,150,"Fla. Atlantic","C-USA","17-15","6-8","2-2","6-5","3-0",null,{"$f":"+Tabla_Ránking_NCAA[[#This Row],[Clasificación]]","v":150}]
[null,151,151,"La.-Monroe","Sun Belt","18-15","4-12","1-1","12-2","1-0",null,{"$f":"+Tabla_Ránking_NCAA[[#This Row],[Clasificación]]","v":151}]
[null,152,152,"Bucknell","Patriot","21-12","7-8","2-1","12-3","0-0",null,{"$f":"+Tabla_Ránking_NCAA[[#This Row],[Clasificación]]","v":152}]
[null,153,153,"George Mason","Atlantic 10","18-15","6-6","1-3","11-6","0-0",null,{"$f":"+Tabla_Ránking_NCAA[[#This Row],[Clasificación]]","v":153}]
[null,154,154,"Abilene Christian","Southland","27-6","10-4","4-0","9-2","4-0",null,{"$f":"+Tabla_Ránking_NCAA[[#This Row],[Clasificación]]","v":154}]
[null,155,155,"Vanderbilt","SEC","9-23","1-11","0-2","8-10","0-0",null,{"$f":"+Tabla_Ránking_NCAA[[#This Row],[Clasificación]]","v":155}]
[null,156,156,"Stony Brook","America East","24-8","13-3","1-1","9-4","1-0",null,{"$f":"+Tabla_Ránking_NCAA[[#This Row],[Clasificación]]","v":156}]
[null,157,157,"UNLV","MWC","17-14","6-5","1-2","10-7","0-0",null,{"$f":"+Tabla_Ránking_NCAA[[#This Row],[Clasificación]]","v":157}]
[null,158,158,"Eastern Mich.","MAC","15-17","4-10","0-0","7-7","4-0",null,{"$f":"+Tabla_Ránking_NCAA[[#This Row],[Clasificación]]","v":158}]
[null,159,159,"Lehigh","Patriot","20-11","9-8","0-0","11-3","0-0",null,{"$f":"+Tabla_Ránking_NCAA[[#This Row],[Clasificación]]","v":159}]
[null,160,160,"Samford","SoCon","17-16","5-9","1-1","10-6","1-0",null,{"$f":"+Tabla_Ránking_NCAA[[#This Row],[Clasificación]]","v":160}]
[null,161,161,"UT Arlington","Sun Belt","17-16","7-10","1-1","8-5","1-0",null,{"$f":"+Tabla_Ránking_NCAA[[#This Row],[Clasificación]]","v":161}]
[null,162,162,"Missouri St.","MVC","16-16","5-9","0-3","10-4","1-0",null,{"$f":"+Tabla_Ránking_NCAA[[#This Row],[Clasificación]]","v":162}]
[null,163,163,"Coastal Caro.","Sun Belt","15-16","5-10","1-2","7-4","2-0",null,{"$f":"+Tabla_Ránking_NCAA[[#This Row],[Clasificación]]","v":163}]
[null,164,164,"UC Santa Barbara","Big West","22-10","7-6","3-1","10-3","2-0",null,{"$f":"+Tabla_Ránking_NCAA[[#This Row],[Clasificación]]","v":164}]
[null,165,165,"California Baptist","WAC","16-14","8-6","0-2","4-6","4-0",null,{"$f":"+Tabla_Ránking_NCAA[[#This Row],[Clasificación]]","v":165}]
[null,166,166,"Pepperdine","WCC","16-18","2-11","5-2","8-5","1-0",null,{"$f":"+Tabla_Ránking_NCAA[[#This Row],[Clasificación]]","v":166}]
[null,167,167,"UNI","MVC","16-18","3-9","4-4","7-5","2-0",null,{"$f":"+Tabla_Ránking_NCAA[[#This Row],[Clasificación]]","v":167}]
[null,168,168,"UTRGV","WAC","19-16","8-7","1-1","8-8","2-0",null,{"$f":"+Tabla_Ránking_NCAA[[#This Row],[Clasificación]]","v":168}]
[null,169,169,"Northern Colo.","Big Sky","21-11","11-5","0-3","8-3","2-0",null,{"$f":"+Tabla_Ránking_NCAA[[#This Row],[Clasificación]]","v":169}]
[null,170,170,"Duquesne","Atlantic 10","19-13","4-6","1-2","14-5","0-0",null,{"$f":"+Tabla_Ránking_NCAA[[#This Row],[Clasificación]]","v":170}]
[null,171,171,"Saint Joseph's","Atlantic 10","14-19","2-10","2-3","10-6","0-0",null,{"$f":"+Tabla_Ránking_NCAA[[#This Row],[Clasificación]]","v":171}]
[null,172,172,"NJIT","ASUN","21-12","11-8","0-0","9-4","1-0",null,{"$f":"+Tabla_Ránking_NCAA[[#This Row],[Clasificación]]","v":172}]
[null,173,173,"Gardner-Webb","Big South","23-11","8-9","2-2","10-0","3-0",null,{"$f":"+Tabla_Ránking_NCAA[[#This Row],[Clasificación]]","v":173}]
[null,174,174,"Sam Houston St.","Southland","21-11","8-8","1-1","9-2","3-0",null,{"$f":"+Tabla_Ránking_NCAA[[#This Row],[Clasificación]]","v":174}]
[null,175,175,"Ohio","MAC","14-17","3-10","0-2","10-5","1-0",null,{"$f":"+Tabla_Ránking_NCAA[[#This Row],[Clasificación]]","v":175}]
[null,176,176,"Bradley","MVC","20-14","5-8","5-0","9-6","1-0",null,{"$f":"+Tabla_Ránking_NCAA[[#This Row],[Clasificación]]","v":176}]
[null,177,177,"American","Patriot","15-15","7-8","0-0","8-7","0-0",null,{"$f":"+Tabla_Ránking_NCAA[[#This Row],[Clasificación]]","v":177}]
[null,178,178,"Omaha","Summit League","21-11","9-8","2-1","9-2","1-0",null,{"$f":"+Tabla_Ránking_NCAA[[#This Row],[Clasificación]]","v":178}]
[null,179,179,"Winthrop","Big South","18-12","7-8","0-1","8-3","3-0",null,{"$f":"+Tabla_Ránking_NCAA[[#This Row],[Clasificación]]","v":179}]
[null,180,180,"Princeton","Ivy League","16-12","8-7","1-0","5-5","2-0",null,{"$f":"+Tabla_Ránking_NCAA[[#This Row],[Clasificación]]","v":180}]
[null,181,181,"Santa Clara","WCC","16-15","5-6","0-3","10-6","1-0",null,{"$f":"+Tabla_Ránking_NCAA[[#This Row],[Clasificación]]","v":181}]
[null,182,182,"Weber St.","Big Sky","18-15","5-7","3-3","8-5","2-0",null,{"$f":"+Tabla_Ránking_NCAA[[#This Row],[Clasificación]]","v":182}]
[null,183,183,"Hartford","America East","18-15","8-9","0-2","9-4","1-0",null,{"$f":"+Tabla_Ránking_NCAA[[#This Row],[Clasificación]]","v":183}]
[null,184,184,"Wake Forest","ACC","11-20","1-10","2-2","8-8","0-0",null,{"$f":"+Tabla_Ránking_NCAA[[#This Row],[Clasificación]]","v":184}]
[null,185,185,"New Mexico","MWC","14-18","3-9","1-2","9-7","1-0",null,{"$f":"+Tabla_Ránking_NCAA[[#This Row],[Clasificación]]","v":185}]
[null,186,186,"Seattle U","WAC","18-14","4-8","0-1","12-5","2-0",null,{"$f":"+Tabla_Ránking_NCAA[[#This Row],[Clasificación]]","v":186}]
[null,187,187,"FIU","C-USA","19-13","5-8","2-1","8-4","4-0",null,{"$f":"+Tabla_Ránking_NCAA[[#This Row],[Clasificación]]","v":187}]
[null,188,188,"Hawaii","Big West","18-13","4-5","1-3","11-5","2-0",null,{"$f":"+Tabla_Ránking_NCAA[[#This Row],[Clasificación]]","v":188}]
[null,189,189,"Colorado St.","MWC","12-20","3-8","1-3","7-9","1-0",null,{"$f":"+Tabla_Ránking_NCAA[[#This Row],[Clasificación]]","v":189}]
[null,190,190,"North Florida","ASUN","16-17","5-13","1-1","8-3","2-0",null,{"$f":"+Tabla_Ránking_NCAA[[#This Row],[Clasificación]]","v":190}]
[null,191,191,"Valparaiso","MVC","15-18","5-8","2-3","6-7","2-0",null,{"$f":"+Tabla_Ránking_NCAA[[#This Row],[Clasificación]]","v":191}]
[null,192,192,"Louisiana","Sun Belt","19-13","7-7","2-2","8-4","2-0",null,{"$f":"+Tabla_Ránking_NCAA[[#This Row],[Clasificación]]","v":192}]
[null,193,193,"William & Mary","CAA","14-17","5-11","0-1","8-5","1-0",null,{"$f":"+Tabla_Ránking_NCAA[[#This Row],[Clasificación]]","v":193}]
[null,194,194,"Richmond","Atlantic 10","13-20","4-7","2-3","7-10","0-0",null,{"$f":"+Tabla_Ránking_NCAA[[#This Row],[Clasificación]]","v":194}]
[null,195,195,"Cornell","Ivy League","15-15","6-11","0-0","7-4","2-0",null,{"$f":"+Tabla_Ránking_NCAA[[#This Row],[Clasificación]]","v":195}]
[null,196,196,"Columbia","Ivy League","10-18","4-9","1-2","3-7","2-0",null,{"$f":"+Tabla_Ránking_NCAA[[#This Row],[Clasificación]]","v":196}]
[null,197,197,"Charleston So.","Big South","17-15","4-10","2-1","7-4","4-0",null,{"$f":"+Tabla_Ránking_NCAA[[#This Row],[Clasificación]]","v":197}]
[null,198,198,"Indiana St.","MVC","15-16","4-9","2-2","7-5","2-0",null,{"$f":"+Tabla_Ránking_NCAA[[#This Row],[Clasificación]]","v":198}]
[null,199,199,"Illinois St.","MVC","17-16","2-10","3-2","11-4","1-0",null,{"$f":"+Tabla_Ránking_NCAA[[#This Row],[Clasificación]]","v":199}]
[null,200,200,"Cal St. Fullerton","Big West","16-17","4-11","3-3","7-3","2-0",null,{"$f":"+Tabla_Ránking_NCAA[[#This Row],[Clasificación]]","v":200}]
[null,201,201,"Rider","MAAC","16-15","6-11","1-1","9-3","0-0",null,{"$f":"+Tabla_Ránking_NCAA[[#This Row],[Clasificación]]","v":201}]
[null,202,202,"Iona","MAAC","17-15","6-9","3-3","8-3","0-0",null,{"$f":"+Tabla_Ránking_NCAA[[#This Row],[Clasificación]]","v":202}]
[null,203,203,"Fairleigh Dickinson","NEC","20-13","7-9","0-0","11-4","2-0",null,{"$f":"+Tabla_Ránking_NCAA[[#This Row],[Clasificación]]","v":203}]
[null,204,204,"Presbyterian","Big South","18-15","6-11","0-1","9-3","3-0",null,{"$f":"+Tabla_Ránking_NCAA[[#This Row],[Clasificación]]","v":204}]
[null,205,205,"Prairie View","SWAC","22-12","9-12","2-0","10-0","1-0",null,{"$f":"+Tabla_Ránking_NCAA[[#This Row],[Clasificación]]","v":205}]
[null,206,206,"Washington St.","Pac-12","11-21","2-9","0-4","9-8","0-0",null,{"$f":"+Tabla_Ránking_NCAA[[#This Row],[Clasificación]]","v":206}]
[null,207,207,"IUPUI","Horizon","16-16","3-12","2-0","9-4","2-0",null,{"$f":"+Tabla_Ránking_NCAA[[#This Row],[Clasificación]]","v":207}]
[null,208,208,"Evansville","MVC","11-21","2-13","0-1","7-7","2-0",null,{"$f":"+Tabla_Ránking_NCAA[[#This Row],[Clasificación]]","v":208}]
[null,209,209,"Hampton","Big South","15-16","4-11","1-2","7-3","3-0",null,{"$f":"+Tabla_Ránking_NCAA[[#This Row],[Clasificación]]","v":209}]
[null,210,210,"Pacific","WCC","14-18","5-10","0-1","7-7","2-0",null,{"$f":"+Tabla_Ránking_NCAA[[#This Row],[Clasificación]]","v":210}]
[null,211,211,"Oakland","Horizon","16-17","6-10","0-1","9-6","1-0",null,{"$f":"+Tabla_Ránking_NCAA[[#This Row],[Clasificación]]","v":211}]
[null,212,212,"Rice","C-USA","13-19","4-11","0-1","7-7","2-0",null,{"$f":"+Tabla_Ránking_NCAA[[#This Row],[Clasificación]]","v":212}]
[null,213,213,"Appalachian St.","Sun Belt","11-21","2-13","0-3","6-5","3-0",null,{"$f":"+Tabla_Ránking_NCAA[[#This Row],[Clasificación]]","v":213}]
[null,214,214,"La Salle","Atlantic 10","10-21","3-8","2-4","5-9","0-0",null,{"$f":"+Tabla_Ránking_NCAA[[#This Row],[Clasificación]]","v":214}]
[null,215,215,"UIC","Horizon","16-16","4-12","0-0","10-4","2-0",null,{"$f":"+Tabla_Ránking_NCAA[[#This Row],[Clasificación]]","v":215}]
[null,216,216,"Mercer","SoCon","11-20","2-12","0-2","7-6","2-0",null,{"$f":"+Tabla_Ránking_NCAA[[#This Row],[Clasificación]]","v":216}]
[null,217,217,"Dartmouth","Ivy League","11-19","2-12","1-1","6-6","2-0",null,{"$f":"+Tabla_Ránking_NCAA[[#This Row],[Clasificación]]","v":217}]
[null,218,218,"CSU Bakersfield","WAC","16-15","5-9","2-2","6-4","3-0",null,{"$f":"+Tabla_Ránking_NCAA[[#This Row],[Clasificación]]","v":218}]
[null,219,219,"Purdue Fort Wayne","Summit League","18-15","6-9","1-1","8-5","3-0",null,{"$f":"+Tabla_Ránking_NCAA[[#This Row],[Clasificación]]","v":219}]
[null,220,220,"Lamar University","Southland","20-13","6-10","1-1","9-2","4-0",null,{"$f":"+Tabla_Ránking_NCAA[[#This Row],[Clasificación]]","v":220}]
[null,221,221,"Green Bay","Horizon","17-16","4-12","1-1","10-3","2-0",null,{"$f":"+Tabla_Ránking_NCAA[[#This Row],[Clasificación]]","v":221}]
[null,222,222,"North Dakota St.","Summit League","18-15","4-9","4-3","8-3","2-0",null,{"$f":"+Tabla_Ránking_NCAA[[#This Row],[Clasificación]]","v":222}]
[null,223,223,"Campbell","Big South","20-12","5-7","3-1","9-4","3-0",null,{"$f":"+Tabla_Ránking_NCAA[[#This Row],[Clasificación]]","v":223}]
[null,224,224,"Massachusetts","Atlantic 10","11-21","1-11","1-2","9-8","0-0",null,{"$f":"+Tabla_Ránking_NCAA[[#This Row],[Clasificación]]","v":224}]
[null,225,225,"UMKC","WAC","11-21","3-14","0-2","7-5","1-0",null,{"$f":"+Tabla_Ránking_NCAA[[#This Row],[Clasificación]]","v":225}]
[null,226,226,"UMBC","America East","21-13","6-8","2-1","10-4","3-0",null,{"$f":"+Tabla_Ránking_NCAA[[#This Row],[Clasificación]]","v":226}]
[null,227,227,"FGCU","ASUN","14-18","4-10","0-4","8-4","2-0",null,{"$f":"+Tabla_Ránking_NCAA[[#This Row],[Clasificación]]","v":227}]
[null,228,228,"Boston U.","Patriot","15-18","8-10","0-0","6-8","1-0",null,{"$f":"+Tabla_Ránking_NCAA[[#This Row],[Clasificación]]","v":228}]
[null,229,229,"California","Pac-12","8-23","1-10","0-4","7-9","0-0",null,{"$f":"+Tabla_Ránking_NCAA[[#This Row],[Clasificación]]","v":229}]
[null,230,230,"Texas Southern","SWAC","21-13","10-10","1-1","8-2","2-0",null,{"$f":"+Tabla_Ránking_NCAA[[#This Row],[Clasificación]]","v":230}]
[null,231,231,"South Dakota","Summit League","13-17","4-8","1-3","6-6","2-0",null,{"$f":"+Tabla_Ránking_NCAA[[#This Row],[Clasificación]]","v":231}]
[null,232,232,"Holy Cross","Patriot","16-17","6-11","2-0","8-6","0-0",null,{"$f":"+Tabla_Ránking_NCAA[[#This Row],[Clasificación]]","v":232}]
[null,233,233,"Drexel","CAA","13-19","3-11","1-1","8-7","1-0",null,{"$f":"+Tabla_Ránking_NCAA[[#This Row],[Clasificación]]","v":233}]
[null,234,234,"Long Beach St.","Big West","15-19","4-12","2-2","7-5","2-0",null,{"$f":"+Tabla_Ránking_NCAA[[#This Row],[Clasificación]]","v":234}]
[null,235,235,"Detroit Mercy","Horizon","11-20","4-14","0-0","7-6","0-0",null,{"$f":"+Tabla_Ránking_NCAA[[#This Row],[Clasificación]]","v":235}]
[null,236,236,"Little Rock","Sun Belt","10-21","3-12","0-0","5-9","2-0",null,{"$f":"+Tabla_Ránking_NCAA[[#This Row],[Clasificación]]","v":236}]
[null,237,237,"South Alabama","Sun Belt","17-17","3-10","1-1","11-6","2-0",null,{"$f":"+Tabla_Ránking_NCAA[[#This Row],[Clasificación]]","v":237}]
[null,238,238,"Delaware","CAA","17-16","7-8","1-1","7-7","2-0",null,{"$f":"+Tabla_Ránking_NCAA[[#This Row],[Clasificación]]","v":238}]
[null,239,239,"Army West Point","Patriot","13-19","3-13","0-2","9-4","1-0",null,{"$f":"+Tabla_Ránking_NCAA[[#This Row],[Clasificación]]","v":239}]
[null,240,240,"High Point","Big South","16-15","5-8","2-3","7-4","2-0",null,{"$f":"+Tabla_Ránking_NCAA[[#This Row],[Clasificación]]","v":240}]
[null,241,241,"Sacred Heart","NEC","15-17","4-13","1-1","9-3","1-0",null,{"$f":"+Tabla_Ránking_NCAA[[#This Row],[Clasificación]]","v":241}]
[null,242,242,"Air Force","MWC","14-18","3-9","2-3","8-6","1-0",null,{"$f":"+Tabla_Ránking_NCAA[[#This Row],[Clasificación]]","v":242}]
[null,243,243,"Fordham","Atlantic 10","12-20","3-9","0-1","8-10","1-0",null,{"$f":"+Tabla_Ránking_NCAA[[#This Row],[Clasificación]]","v":243}]
[null,244,244,"Quinnipiac","MAAC","16-14","9-5","0-2","7-7","0-0",null,{"$f":"+Tabla_Ránking_NCAA[[#This Row],[Clasificación]]","v":244}]
[null,245,245,"Eastern Wash.","Big Sky","16-18","4-13","2-1","9-4","1-0",null,{"$f":"+Tabla_Ránking_NCAA[[#This Row],[Clasificación]]","v":245}]
[null,246,246,"Montana St.","Big Sky","15-17","4-12","2-1","8-4","1-0",null,{"$f":"+Tabla_Ránking_NCAA[[#This Row],[Clasificación]]","v":246}]
[null,247,247,"UC Davis","Big West","11-20","3-12","1-2","5-6","2-0",null,{"$f":"+Tabla_Ránking_NCAA[[#This Row],[Clasificación]]","v":247}]
[null,248,248,"Middle Tenn.","C-USA","11-21","2-11","0-5","7-5","2-0",null,{"$f":"+Tabla_Ránking_NCAA[[#This Row],[Clasificación]]","v":248}]
[null,249,249,"Southeastern La.","Southland","17-16","7-9","1-2","7-5","2-0",null,{"$f":"+Tabla_Ránking_NCAA[[#This Row],[Clasificación]]","v":249}]
[null,250,250,"LIU Brooklyn","NEC","16-16","7-10","1-1","7-5","1-0",null,{"$f":"+Tabla_Ránking_NCAA[[#This Row],[Clasificación]]","v":250}]
[null,251,251,"Arkansas St.","Sun Belt","13-19","2-13","1-2","8-4","2-0",null,{"$f":"+Tabla_Ránking_NCAA[[#This Row],[Clasificación]]","v":251}]
[null,252,252,"James Madison","CAA","14-19","4-11","2-2","6-6","2-0",null,{"$f":"+Tabla_Ránking_NCAA[[#This Row],[Clasificación]]","v":252}]
[null,253,253,"Siena","MAAC","17-16","8-7","1-1","8-8","0-0",null,{"$f":"+Tabla_Ránking_NCAA[[#This Row],[Clasificación]]","v":253}]
[null,254,254,"St. Francis Brooklyn","NEC","17-15","6-11","0-1","9-3","2-0",null,{"$f":"+Tabla_Ránking_NCAA[[#This Row],[Clasificación]]","v":254}]
[null,255,255,"Towson","CAA","10-22","4-8","1-6","4-8","1-0",null,{"$f":"+Tabla_Ránking_NCAA[[#This Row],[Clasificación]]","v":255}]
[null,256,256,"Troy","Sun Belt","12-18","4-10","0-0","6-8","2-0",null,{"$f":"+Tabla_Ránking_NCAA[[#This Row],[Clasificación]]","v":256}]
[null,257,257,"UMass Lowell","America East","15-17","5-12","2-0","6-5","2-0",null,{"$f":"+Tabla_Ránking_NCAA[[#This Row],[Clasificación]]","v":257}]
[null,258,258,"East Carolina","AAC","10-21","1-11","0-1","9-9","0-0",null,{"$f":"+Tabla_Ránking_NCAA[[#This Row],[Clasificación]]","v":258}]
[null,259,259,"Eastern Ky.","OVC","13-18","3-11","1-2","7-5","2-0",null,{"$f":"+Tabla_Ránking_NCAA[[#This Row],[Clasificación]]","v":259}]
[null,260,260,"Norfolk St.","MEAC","21-13","8-7","2-4","8-2","3-0",null,{"$f":"+Tabla_Ránking_NCAA[[#This Row],[Clasificación]]","v":260}]
[null,261,261,"Southern Utah","Big Sky","16-16","4-12","2-1","8-3","2-0",null,{"$f":"+Tabla_Ránking_NCAA[[#This Row],[Clasificación]]","v":261}]
[null,262,262,"Charlotte","C-USA","8-21","3-9","0-3","5-9","0-0",null,{"$f":"+Tabla_Ránking_NCAA[[#This Row],[Clasificación]]","v":262}]
[null,263,263,"UNCW","CAA","10-23","2-12","3-2","4-9","1-0",null,{"$f":"+Tabla_Ránking_NCAA[[#This Row],[Clasificación]]","v":263}]
[null,264,264,"Morehead St.","OVC","13-20","4-11","2-2","5-7","2-0",null,{"$f":"+Tabla_Ránking_NCAA[[#This Row],[Clasificación]]","v":264}]
[null,265,265,"Saint Francis (PA)","NEC","18-14","6-10","0-0","10-4","2-0",null,{"$f":"+Tabla_Ránking_NCAA[[#This Row],[Clasificación]]","v":265}]
[null,266,266,"New Orleans","Southland","19-13","5-9","2-1","8-3","4-0",null,{"$f":"+Tabla_Ránking_NCAA[[#This Row],[Clasificación]]","v":266}]
[null,267,267,"Robert Morris","NEC","17-16","5-13","0-0","10-3","2-0",null,{"$f":"+Tabla_Ránking_NCAA[[#This Row],[Clasificación]]","v":267}]
[null,268,268,"Portland St.","Big Sky","16-16","3-10","0-2","10-4","3-0",null,{"$f":"+Tabla_Ránking_NCAA[[#This Row],[Clasificación]]","v":268}]
[null,269,269,"Youngstown St.","Horizon","12-20","5-11","1-2","4-7","2-0",null,{"$f":"+Tabla_Ránking_NCAA[[#This Row],[Clasificación]]","v":269}]
[null,270,270,"A&M-Corpus Christi","Southland","14-18","5-9","0-2","5-7","4-0",null,{"$f":"+Tabla_Ránking_NCAA[[#This Row],[Clasificación]]","v":270}]
[null,271,271,"Albany (NY)","America East","12-20","6-10","0-2","5-8","1-0",null,{"$f":"+Tabla_Ránking_NCAA[[#This Row],[Clasificación]]","v":271}]
[null,272,272,"Sacramento St.","Big Sky","15-16","4-10","2-1","6-5","3-0",null,{"$f":"+Tabla_Ránking_NCAA[[#This Row],[Clasificación]]","v":272}]
[null,273,273,"CSUN","Big West","13-20","4-10","2-1","6-9","1-0",null,{"$f":"+Tabla_Ránking_NCAA[[#This Row],[Clasificación]]","v":273}]
[null,274,274,"The Citadel","SoCon","12-18","4-10","0-1","5-7","3-0",null,{"$f":"+Tabla_Ránking_NCAA[[#This Row],[Clasificación]]","v":274}]
[null,275,275,"Chattanooga","SoCon","12-20","4-11","0-3","5-6","3-0",null,{"$f":"+Tabla_Ránking_NCAA[[#This Row],[Clasificación]]","v":275}]
[null,276,276,"Western Mich.","MAC","8-24","2-14","1-1","4-9","1-0",null,{"$f":"+Tabla_Ránking_NCAA[[#This Row],[Clasificación]]","v":276}]
[null,277,277,"Elon","CAA","11-21","6-7","0-3","3-11","2-0",null,{"$f":"+Tabla_Ránking_NCAA[[#This Row],[Clasificación]]","v":277}]
[null,278,278,"Marist","MAAC","12-19","6-11","2-1","4-7","0-0",null,{"$f":"+Tabla_Ránking_NCAA[[#This Row],[Clasificación]]","v":278}]
[null,279,279,"Navy","Patriot","12-19","4-13","0-0","8-6","0-0",null,{"$f":"+Tabla_Ránking_NCAA[[#This Row],[Clasificación]]","v":279}]
[null,280,280,"Lafayette","Patriot","10-20","6-9","0-0","3-11","1-0",null,{"$f":"+Tabla_Ránking_NCAA[[#This Row],[Clasificación]]","v":280}]
[null,281,281,"Loyola Maryland","Patriot","11-21","3-16","1-0","7-5","0-0",null,{"$f":"+Tabla_Ránking_NCAA[[#This Row],[Clasificación]]","v":281}]
[null,282,282,"Canisius","MAAC","15-17","9-5","1-4","5-8","0-0",null,{"$f":"+Tabla_Ránking_NCAA[[#This Row],[Clasificación]]","v":282}]
[null,283,283,"George Washington","Atlantic 10","9-24","2-10","1-3","6-11","0-0",null,{"$f":"+Tabla_Ránking_NCAA[[#This Row],[Clasificación]]","v":283}]
[null,284,284,"Cleveland St.","Horizon","10-21","2-12","0-0","6-9","2-0",null,{"$f":"+Tabla_Ránking_NCAA[[#This Row],[Clasificación]]","v":284}]
[null,285,285,"North Dakota","Summit League","12-18","4-11","0-1","4-6","4-0",null,{"$f":"+Tabla_Ránking_NCAA[[#This Row],[Clasificación]]","v":285}]
[null,286,286,"Northern Ariz.","Big Sky","10-21","5-13","0-1","5-7","0-0",null,{"$f":"+Tabla_Ránking_NCAA[[#This Row],[Clasificación]]","v":286}]
[null,287,287,"Monmouth","MAAC","14-21","5-11","3-4","6-6","0-0",null,{"$f":"+Tabla_Ránking_NCAA[[#This Row],[Clasificación]]","v":287}]
[null,288,288,"UTEP","C-USA","8-21","0-13","0-0","6-8","2-0",null,{"$f":"+Tabla_Ránking_NCAA[[#This Row],[Clasificación]]","v":288}]
[null,289,289,"Jacksonville","ASUN","12-20","6-11","1-1","3-8","2-0",null,{"$f":"+Tabla_Ránking_NCAA[[#This Row],[Clasificación]]","v":289}]
[null,290,290,"Houston Baptist","Southland","12-18","3-13","0-1","7-4","2-0",null,{"$f":"+Tabla_Ránking_NCAA[[#This Row],[Clasificación]]","v":290}]
[null,291,291,"Longwood","Big South","15-17","5-11","1-1","6-5","3-0",null,{"$f":"+Tabla_Ránking_NCAA[[#This Row],[Clasificación]]","v":291}]
[null,292,292,"Fairfield","MAAC","9-22","3-13","1-2","5-7","0-0",null,{"$f":"+Tabla_Ránking_NCAA[[#This Row],[Clasificación]]","v":292}]
[null,293,293,"Grambling","SWAC","17-16","6-11","0-2","8-3","3-0",null,{"$f":"+Tabla_Ránking_NCAA[[#This Row],[Clasificación]]","v":293}]
[null,294,294,"N.C. A&T","MEAC","19-13","7-10","1-1","9-2","2-0",null,{"$f":"+Tabla_Ránking_NCAA[[#This Row],[Clasificación]]","v":294}]
[null,295,295,"Western Caro.","SoCon","7-25","3-14","0-3","3-8","1-0",null,{"$f":"+Tabla_Ránking_NCAA[[#This Row],[Clasificación]]","v":295}]
[null,296,296,"Oral Roberts","Summit League","11-21","3-13","1-2","5-6","2-0",null,{"$f":"+Tabla_Ránking_NCAA[[#This Row],[Clasificación]]","v":296}]
[null,297,297,"Central Ark.","Southland","14-19","5-13","1-1","5-5","3-0",null,{"$f":"+Tabla_Ránking_NCAA[[#This Row],[Clasificación]]","v":297}]
[null,298,298,"Tulane","AAC","4-27","0-11","1-4","3-12","0-0",null,{"$f":"+Tabla_Ránking_NCAA[[#This Row],[Clasificación]]","v":298}]
[null,299,299,"Milwaukee","Horizon","9-22","3-12","0-2","5-8","1-0",null,{"$f":"+Tabla_Ránking_NCAA[[#This Row],[Clasificación]]","v":299}]
[null,300,300,"Wagner","NEC","13-17","6-10","0-0","5-7","2-0",null,{"$f":"+Tabla_Ránking_NCAA[[#This Row],[Clasificación]]","v":300}]
[null,301,301,"Niagara","MAAC","13-19","5-10","0-1","8-8","0-0",null,{"$f":"+Tabla_Ránking_NCAA[[#This Row],[Clasificación]]","v":301}]
[null,302,302,"N.C. Central","MEAC","18-15","4-12","4-1","7-2","3-0",null,{"$f":"+Tabla_Ránking_NCAA[[#This Row],[Clasificación]]","v":302}]
[null,303,303,"Western Ill.","Summit League","10-21","2-14","1-1","5-6","2-0",null,{"$f":"+Tabla_Ránking_NCAA[[#This Row],[Clasificación]]","v":303}]
[null,304,304,"Bethune-Cookman","MEAC","14-17","4-12","0-1","8-4","2-0",null,{"$f":"+Tabla_Ránking_NCAA[[#This Row],[Clasificación]]","v":304}]
[null,305,305,"VMI","SoCon","11-21","2-13","1-1","5-7","3-0",null,{"$f":"+Tabla_Ránking_NCAA[[#This Row],[Clasificación]]","v":305}]
[null,306,306,"Howard","MEAC","17-16","9-7","2-2","3-7","3-0",null,{"$f":"+Tabla_Ránking_NCAA[[#This Row],[Clasificación]]","v":306}]
[null,307,307,"Idaho St.","Big Sky","11-19","5-11","0-1","4-7","2-0",null,{"$f":"+Tabla_Ránking_NCAA[[#This Row],[Clasificación]]","v":307}]
[null,308,308,"Eastern Ill.","OVC","14-18","5-10","2-2","6-6","1-0",null,{"$f":"+Tabla_Ránking_NCAA[[#This Row],[Clasificación]]","v":308}]
[null,309,309,"SFA","Southland","14-16","3-9","1-1","6-6","4-0",null,{"$f":"+Tabla_Ránking_NCAA[[#This Row],[Clasificación]]","v":309}]
[null,310,310,"North Ala.","ASUN","10-22","2-18","0-0","5-4","3-0",null,{"$f":"+Tabla_Ránking_NCAA[[#This Row],[Clasificación]]","v":310}]
[null,311,311,"UT Martin","OVC","12-19","1-14","1-1","8-4","2-0",null,{"$f":"+Tabla_Ránking_NCAA[[#This Row],[Clasificación]]","v":311}]
[null,312,312,"Central Conn. St.","NEC","11-20","5-12","1-1","3-7","2-0",null,{"$f":"+Tabla_Ránking_NCAA[[#This Row],[Clasificación]]","v":312}]
[null,313,313,"Nicholls St.","Southland","14-17","3-13","2-0","5-4","4-0",null,{"$f":"+Tabla_Ránking_NCAA[[#This Row],[Clasificación]]","v":313}]
[null,314,314,"UC Riverside","Big West","10-23","2-14","1-2","4-7","3-0",null,{"$f":"+Tabla_Ránking_NCAA[[#This Row],[Clasificación]]","v":314}]
[null,315,315,"Florida A&M","MEAC","12-19","6-13","0-2","4-4","2-0",null,{"$f":"+Tabla_Ránking_NCAA[[#This Row],[Clasificación]]","v":315}]
[null,316,316,"Tennessee St.","OVC","9-21","3-14","0-0","4-7","2-0",null,{"$f":"+Tabla_Ránking_NCAA[[#This Row],[Clasificación]]","v":316}]
[null,317,317,"Saint Peter's","MAAC","10-22","2-14","1-1","7-7","0-0",null,{"$f":"+Tabla_Ránking_NCAA[[#This Row],[Clasificación]]","v":317}]
[null,318,318,"Manhattan","MAAC","11-21","4-11","3-1","4-9","0-0",null,{"$f":"+Tabla_Ránking_NCAA[[#This Row],[Clasificación]]","v":318}]
[null,319,319,"Mount St. Mary's","NEC","9-22","5-13","0-0","2-9","2-0",null,{"$f":"+Tabla_Ránking_NCAA[[#This Row],[Clasificación]]","v":319}]
[null,320,320,"Southeast Mo. St.","OVC","10-21","2-13","2-0","4-8","2-0",null,{"$f":"+Tabla_Ránking_NCAA[[#This Row],[Clasificación]]","v":320}]
[null,321,321,"Wyoming","MWC","8-24","1-11","1-3","5-10","1-0",null,{"$f":"+Tabla_Ránking_NCAA[[#This Row],[Clasificación]]","v":321}]
[null,322,322,"Bryant","NEC","10-20","2-14","0-0","8-6","0-0",null,{"$f":"+Tabla_Ránking_NCAA[[#This Row],[Clasificación]]","v":322}]
[null,323,323,"Ark.-Pine Bluff","SWAC","13-19","4-17","1-0","7-2","1-0",null,{"$f":"+Tabla_Ránking_NCAA[[#This Row],[Clasificación]]","v":323}]
[null,324,324,"Denver","Summit League","8-22","1-14","1-1","5-7","1-0",null,{"$f":"+Tabla_Ránking_NCAA[[#This Row],[Clasificación]]","v":324}]
[null,325,325,"Binghamton","America East","10-23","5-12","0-0","3-11","2-0",null,{"$f":"+Tabla_Ránking_NCAA[[#This Row],[Clasificación]]","v":325}]
[null,326,326,"McNeese","Southland","9-22","2-14","0-0","4-7","3-1",null,{"$f":"+Tabla_Ránking_NCAA[[#This Row],[Clasificación]]","v":326}]
[null,327,327,"Portland","WCC","7-25","1-12","0-2","4-11","2-0",null,{"$f":"+Tabla_Ránking_NCAA[[#This Row],[Clasificación]]","v":327}]
[null,328,328,"Jackson St.","SWAC","13-19","3-14","1-1","7-4","2-0",null,{"$f":"+Tabla_Ránking_NCAA[[#This Row],[Clasificación]]","v":328}]
[null,329,329,"SIUE","OVC","10-21","2-11","1-2","5-8","2-0",null,{"$f":"+Tabla_Ránking_NCAA[[#This Row],[Clasificación]]","v":329}]
[null,330,330,"Alabama St.","SWAC","12-19","4-13","0-3","6-3","2-0",null,{"$f":"+Tabla_Ránking_NCAA[[#This Row],[Clasificación]]","v":330}]
[null,331,331,"Tennessee Tech","OVC","8-23","3-13","0-0","3-10","2-0",null,{"$f":"+Tabla_Ránking_NCAA[[#This Row],[Clasificación]]","v":331}]
[null,332,332,"Cal Poly","Big West","6-23","1-14","1-1","2-8","2-0",null,{"$f":"+Tabla_Ránking_NCAA[[#This Row],[Clasificación]]","v":332}]
[null,333,333,"Morgan St.","MEAC","9-21","2-13","1-1","5-6","1-1",null,{"$f":"+Tabla_Ránking_NCAA[[#This Row],[Clasificación]]","v":333}]
[null,334,334,"Northwestern St.","Southland","11-20","3-13","1-0","4-7","3-0",null,{"$f":"+Tabla_Ránking_NCAA[[#This Row],[Clasificación]]","v":334}]
[null,335,335,"Maine","America East","5-27","2-18","0-0","2-9","1-0",null,{"$f":"+Tabla_Ránking_NCAA[[#This Row],[Clasificación]]","v":335}]
[null,336,336,"South Carolina St.","MEAC","8-26","2-19","1-1","3-6","2-0",null,{"$f":"+Tabla_Ránking_NCAA[[#This Row],[Clasificación]]","v":336}]
[null,337,337,"Stetson","ASUN","7-24","0-16","0-0","5-8","2-0",null,{"$f":"+Tabla_Ránking_NCAA[[#This Row],[Clasificación]]","v":337}]
[null,338,338,"Idaho","Big Sky","5-27","1-13","0-2","2-11","2-1",null,{"$f":"+Tabla_Ránking_NCAA[[#This Row],[Clasificación]]","v":338}]
[null,339,339,"Savannah St.","MEAC","11-20","4-14","1-1","5-5","1-0",null,{"$f":"+Tabla_Ránking_NCAA[[#This Row],[Clasificación]]","v":339}]
[null,340,340,"Southern U.","SWAC","7-25","1-17","0-3","5-5","1-0",null,{"$f":"+Tabla_Ránking_NCAA[[#This Row],[Clasificación]]","v":340}]
[null,341,341,"San Jose St.","MWC","4-27","0-12","0-4","3-11","1-0",null,{"$f":"+Tabla_Ránking_NCAA[[#This Row],[Clasificación]]","v":341}]
[null,342,342,"Coppin St.","MEAC","8-25","4-16","1-2","3-7","0-0",null,{"$f":"+Tabla_Ránking_NCAA[[#This Row],[Clasificación]]","v":342}]
[null,343,343,"Kennesaw St.","ASUN","6-26","0-15","0-3","4-8","2-0",null,{"$f":"+Tabla_Ránking_NCAA[[#This Row],[Clasificación]]","v":343}]
[null,344,344,"USC Upstate","Big South","6-26","1-15","0-2","2-9","3-0",null,{"$f":"+Tabla_Ránking_NCAA[[#This Row],[Clasificación]]","v":344}]
[null,345,345,"New Hampshire","America East","5-24","1-14","0-0","2-10","2-0",null,{"$f":"+Tabla_Ránking_NCAA[[#This Row],[Clasificación]]","v":345}]
[null,346,346,"Alabama A&M","SWAC","5-27","0-18","1-1","4-8","0-0",null,{"$f":"+Tabla_Ránking_NCAA[[#This Row],[Clasificación]]","v":346}]
[null,347,347,"Incarnate Word","Southland","6-25","0-14","1-2","1-9","4-0",null,{"$f":"+Tabla_Ránking_NCAA[[#This Row],[Clasificación]]","v":347}]
[null,348,348,"Alcorn","SWAC","10-21","0-17","0-1","6-3","4-0",null,{"$f":"+Tabla_Ránking_NCAA[[#This Row],[Clasificación]]","v":348}]
[null,349,349,"Mississippi Val.","SWAC","6-26","0-20","0-0","5-6","1-0",null,{"$f":"+Tabla_Ránking_NCAA[[#This Row],[Clasificación]]","v":349}]
[null,350,350,"UNC Asheville","Big South","4-27","1-15","0-2","1-9","2-1",null,{"$f":"+Tabla_Ránking_NCAA[[#This Row],[Clasificación]]","v":350}]
[null,351,351,"Delaware St.","MEAC","6-25","2-15","1-1","1-9","2-0",null,{"$f":"+Tabla_Ránking_NCAA[[#This Row],[Clasificación]]","v":351}]
[null,352,352,"UMES","MEAC","7-25","2-17","0-1","3-7","2-0",null,{"$f":"+Tabla_Ránking_NCAA[[#This Row],[Clasificación]]","v":352}]
[null,353,353,"Chicago St.","WAC","3-29","0-19","0-2","1-8","2-0",null,{"$f":"+Tabla_Ránking_NCAA[[#This Row],[Clasificación]]","v":353}]

{"sheet":"Anotación de ataque","index":4,"n_rows":356,"n_cols":7,"rows_kept":356}
[{"$nulls":6}," "]
[]
[null,"Hasta partidos del 12 de marzo de 2019"]
[]
[null,"Clasificación","Equipo","Part.","Pts.","PPP"]
[null,1,"Gonzaga",33,{"v":2932,"d":"2,932"},88.8]
[null,2,"Belmont",31,{"v":2710,"d":"2,710"},87.4]
[null,3,"North Carolina",31,{"v":2684,"d":"2,684"},86.6]
[null,4,"The Citadel",30,{"v":2553,"d":"2,553"},85.1]
[null,5,"Buffalo",31,{"v":2634,"d":"2,634"},{"v":85,"d":"85.0"}]
[null,6,"South Dakota St.",32,{"v":2716,"d":"2,716"},84.9]
[null,7,"Duke",31,{"v":2608,"d":"2,608"},84.1]
[null,8,"Hofstra",34,{"v":2841,"d":"2,841"},83.6]
[null,9,"Ga. Southern",31,{"v":2587,"d":"2,587"},83.5]
[null,10,"Lipscomb",32,{"v":2670,"d":"2,670"},83.4]
[null,11,"FIU",31,{"v":2586,"d":"2,586"},83.4]
[null,12,"Winthrop",30,{"v":2499,"d":"2,499"},83.3]
[null,13,"Murray St.",31,{"v":2582,"d":"2,582"},83.3]
[null,14,"Wofford",33,{"v":2739,"d":"2,739"},{"v":83,"d":"83.0"}]
[null,15,"Purdue Fort Wayne",33,{"v":2728,"d":"2,728"},82.7]
[null,16,"Eastern Ky.",31,{"v":2562,"d":"2,562"},82.6]
[null,17,"Central Mich.",32,{"v":2640,"d":"2,640"},82.5]
[null,18,"Tennessee",31,{"v":2552,"d":"2,552"},82.3]
[null,19,"Houston Baptist",29,{"v":2386,"d":"2,386"},82.3]
[null,20,"Austin Peay",33,{"v":2712,"d":"2,712"},82.2]
[null,21,"Louisiana",31,{"v":2543,"d":"2,543"},{"v":82,"d":"82.0"}]
[null,22,"LSU",31,{"v":2531,"d":"2,531"},81.6]
[null,"-","Hampton",31,{"v":2531,"d":"2,531"},81.6]
[null,24,"Nevada",31,{"v":2529,"d":"2,529"},81.6]
[null,25,"Memphis",31,{"v":2521,"d":"2,521"},81.3]
[null,26,"NC State",31,{"v":2512,"d":"2,512"},{"v":81,"d":"81.0"}]
[null,27,"Georgetown",31,{"v":2500,"d":"2,500"},80.6]
[null,28,"Yale",27,{"v":2173,"d":"2,173"},80.5]
[null,29,"Green Bay",33,{"v":2653,"d":"2,653"},80.4]
[null,30,"Marshall",31,{"v":2492,"d":"2,492"},80.4]
[null,31,"Weber St.",31,{"v":2487,"d":"2,487"},80.2]
[null,32,"Auburn",31,{"v":2482,"d":"2,482"},80.1]
[null,33,"Lehigh",31,{"v":2479,"d":"2,479"},{"v":80,"d":"80.0"}]
[null,34,"Sacred Heart",32,{"v":2558,"d":"2,558"},79.9]
[null,35,"Appalachian St.",32,{"v":2557,"d":"2,557"},79.9]
[null,36,"Texas Southern",32,{"v":2553,"d":"2,553"},79.8]
[null,37,"Michigan St.",31,{"v":2471,"d":"2,471"},79.7]
[null,38,"Howard",31,{"v":2463,"d":"2,463"},79.5]
[null,39,"Creighton",31,{"v":2459,"d":"2,459"},79.3]
[null,40,"ETSU",33,{"v":2613,"d":"2,613"},79.2]
[null,41,"Northern Ky.",34,{"v":2690,"d":"2,690"},79.1]
[null,42,"Utah St.",31,{"v":2450,"d":"2,450"},{"v":79,"d":"79.0"}]
[null,43,"BYU",32,{"v":2527,"d":"2,527"},{"v":79,"d":"79.0"}]
[null,44,"Iowa",31,{"v":2448,"d":"2,448"},{"v":79,"d":"79.0"}]
[null,45,"Omaha",32,{"v":2523,"d":"2,523"},78.8]
[null,46,"Lamar University",31,{"v":2444,"d":"2,444"},78.8]
[null,47,"Presbyterian",33,{"v":2601,"d":"2,601"},78.8]
[null,48,"La.-Monroe",31,{"v":2437,"d":"2,437"},78.6]
[null,49,"UCLA",31,{"v":2429,"d":"2,429"},78.4]
[null,50,"Gardner-Webb",34,{"v":2662,"d":"2,662"},78.3]
[null,51,"Samford",33,{"v":2583,"d":"2,583"},78.3]
[null,52,"Bowling Green",31,{"v":2425,"d":"2,425"},78.2]
[null,53,"St. John's (NY)",31,{"v":2422,"d":"2,422"},78.1]
[null,54,"Montana St.",30,{"v":2343,"d":"2,343"},78.1]
[null,55,"Jacksonville St.",33,{"v":2574,"d":"2,574"},{"v":78,"d":"78.0"}]
[null,56,"Furman",32,{"v":2492,"d":"2,492"},77.9]
[null,57,"Georgia St.",31,{"v":2411,"d":"2,411"},77.8]
[null,58,"Arizona St.",30,{"v":2332,"d":"2,332"},77.7]
[null,59,"Iowa St.",31,{"v":2409,"d":"2,409"},77.7]
[null,60,"UTSA",31,{"v":2405,"d":"2,405"},77.6]
[null,61,"Portland St.",31,{"v":2404,"d":"2,404"},77.5]
[null,62,"Utah Valley",31,{"v":2403,"d":"2,403"},77.5]
[null,"-","New Mexico St.",31,{"v":2403,"d":"2,403"},77.5]
[null,64,"Marquette",31,{"v":2400,"d":"2,400"},77.4]
[null,65,"Toledo",31,{"v":2397,"d":"2,397"},77.3]
[null,66,"Mississippi St.",31,{"v":2396,"d":"2,396"},77.3]
[null,67,"Coastal Caro.",30,{"v":2314,"d":"2,314"},77.1]
[null,68,"Fresno St.",30,{"v":2312,"d":"2,312"},77.1]
[null,69,"Northern Colo.",31,{"v":2386,"d":"2,386"},{"v":77,"d":"77.0"}]
[null,70,"DePaul",29,{"v":2232,"d":"2,232"},{"v":77,"d":"77.0"}]
[null,71,"Montana",31,{"v":2385,"d":"2,385"},76.9]
[null,72,"Iona",32,{"v":2459,"d":"2,459"},76.8]
[null,73,"Kentucky",31,{"v":2381,"d":"2,381"},76.8]
[null,"-","Rider",31,{"v":2381,"d":"2,381"},76.8]
[null,75,"UMass Lowell",32,{"v":2456,"d":"2,456"},76.8]
[null,76,"Oakland",33,{"v":2532,"d":"2,532"},76.7]
[null,77,"Bucknell",32,{"v":2454,"d":"2,454"},76.7]
[null,78,"CSUN",32,{"v":2449,"d":"2,449"},76.5]
[null,79,"Houston",31,{"v":2369,"d":"2,369"},76.4]
[null,80,"Saint Francis (PA)",32,{"v":2445,"d":"2,445"},76.4]
[null,81,"Utah",30,{"v":2289,"d":"2,289"},76.3]
[null,82,"Purdue",31,{"v":2365,"d":"2,365"},76.3]
[null,"-","Arkansas",31,{"v":2365,"d":"2,365"},76.3]
[null,"-","Southern California",31,{"v":2365,"d":"2,365"},76.3]
[null,85,"Charleston So.",32,{"v":2439,"d":"2,439"},76.2]
[null,86,"UNCW",33,{"v":2513,"d":"2,513"},76.2]
[null,87,"Savannah St.",31,{"v":2360,"d":"2,360"},76.1]
[null,88,"Northeastern",33,{"v":2511,"d":"2,511"},76.1]
[null,89,"New Mexico",30,{"v":2282,"d":"2,282"},76.1]
[null,90,"San Francisco",31,{"v":2358,"d":"2,358"},76.1]
[null,91,"IUPUI",32,{"v":2434,"d":"2,434"},76.1]
[null,92,"VMI",32,{"v":2433,"d":"2,433"},{"v":76,"d":"76.0"}]
[null,93,"UNC Greensboro",34,{"v":2585,"d":"2,585"},{"v":76,"d":"76.0"}]
[null,94,"Ole Miss",31,{"v":2356,"d":"2,356"},{"v":76,"d":"76.0"}]
[null,"-","UT Martin",31,{"v":2356,"d":"2,356"},{"v":76,"d":"76.0"}]
[null,96,"Grand Canyon",30,{"v":2276,"d":"2,276"},75.9]
[null,97,"Campbell",32,{"v":2426,"d":"2,426"},75.8]
[null,98,"Florida St.",31,{"v":2350,"d":"2,350"},75.8]
[null,99,"Drexel",32,{"v":2425,"d":"2,425"},75.8]
[null,100,"Pepperdine",34,{"v":2572,"d":"2,572"},75.6]
[null,101,"Kansas",31,{"v":2344,"d":"2,344"},75.6]
[null,102,"Washington St.",31,{"v":2342,"d":"2,342"},75.5]
[null,103,"Youngstown St.",32,{"v":2415,"d":"2,415"},75.5]
[null,104,"Drake",33,{"v":2490,"d":"2,490"},75.5]
[null,105,"Southern Utah",29,{"v":2188,"d":"2,188"},75.4]
[null,106,"Fairleigh Dickinson",33,{"v":2489,"d":"2,489"},75.4]
[null,107,"Colorado St.",31,{"v":2336,"d":"2,336"},75.4]
[null,108,"Long Beach St.",32,{"v":2410,"d":"2,410"},75.3]
[null,109,"North Florida",33,{"v":2485,"d":"2,485"},75.3]
[null,110,"Colgate",33,{"v":2484,"d":"2,484"},75.3]
[null,111,"Sam Houston St.",31,{"v":2331,"d":"2,331"},75.2]
[null,112,"Hartford",33,{"v":2477,"d":"2,477"},75.1]
[null,113,"Colorado",30,{"v":2249,"d":"2,249"},{"v":75,"d":"75.0"}]
[null,114,"Kent St.",31,{"v":2323,"d":"2,323"},74.9]
[null,115,"Temple",31,{"v":2321,"d":"2,321"},74.9]
[null,"-","William & Mary",31,{"v":2321,"d":"2,321"},74.9]
[null,117,"Ball St.",32,{"v":2392,"d":"2,392"},74.8]
[null,118,"UIC",32,{"v":2391,"d":"2,391"},74.7]
[null,119,"Louisville",31,{"v":2315,"d":"2,315"},74.7]
[null,120,"Villanova",31,{"v":2314,"d":"2,314"},74.6]
[null,121,"Abilene Christian",31,{"v":2312,"d":"2,312"},74.6]
[null,"-","Norfolk St.",31,{"v":2312,"d":"2,312"},74.6]
[null,123,"TCU",31,{"v":2311,"d":"2,311"},74.5]
[null,"-","UConn",31,{"v":2311,"d":"2,311"},74.5]
[null,125,"Jacksonville",32,{"v":2385,"d":"2,385"},74.5]
[null,126,"Virginia Tech",30,{"v":2234,"d":"2,234"},74.5]
[null,127,"Col. of Charleston",33,{"v":2453,"d":"2,453"},74.3]
[null,128,"Prairie View",32,{"v":2378,"d":"2,378"},74.3]
[null,129,"Rice",31,{"v":2302,"d":"2,302"},74.3]
[null,130,"Little Rock",31,{"v":2301,"d":"2,301"},74.2]
[null,131,"Cleveland St.",31,{"v":2300,"d":"2,300"},74.2]
[null,132,"LIU Brooklyn",32,{"v":2373,"d":"2,373"},74.2]
[null,"-","Vermont",32,{"v":2373,"d":"2,373"},74.2]
[null,134,"UC Santa Barbara",30,{"v":2221,"d":"2,221"},{"v":74,"d":"74.0"}]
[null,"-","UNLV",30,{"v":2221,"d":"2,221"},{"v":74,"d":"74.0"}]
[null,136,"Liberty",34,{"v":2516,"d":"2,516"},{"v":74,"d":"74.0"}]
[null,"-","North Dakota",30,{"v":2220,"d":"2,220"},{"v":74,"d":"74.0"}]
[null,138,"Bethune-Cookman",30,{"v":2219,"d":"2,219"},{"v":74,"d":"74.0"}]
[null,139,"Radford",33,{"v":2440,"d":"2,440"},73.9]
[null,140,"Oregon St.",30,{"v":2217,"d":"2,217"},73.9]
[null,141,"Seton Hall",30,{"v":2214,"d":"2,214"},73.8]
[null,142,"Quinnipiac",30,{"v":2213,"d":"2,213"},73.8]
[null,143,"Arkansas St.",32,{"v":2359,"d":"2,359"},73.7]
[null,"-","Northern Ill.",32,{"v":2359,"d":"2,359"},73.7]
[null,145,"Morehead St.",33,{"v":2431,"d":"2,431"},73.7]
[null,146,"Brown",30,{"v":2209,"d":"2,209"},73.6]
[null,"-","Lafayette",30,{"v":2209,"d":"2,209"},73.6]
[null,148,"Columbia",28,{"v":2059,"d":"2,059"},73.5]
[null,149,"Detroit Mercy",31,{"v":2279,"d":"2,279"},73.5]
[null,150,"Dayton",31,{"v":2278,"d":"2,278"},73.5]
[null,151,"Seattle U",31,{"v":2277,"d":"2,277"},73.5]
[null,152,"Northern Ariz.",30,{"v":2202,"d":"2,202"},73.4]
[null,153,"Louisiana Tech",31,{"v":2273,"d":"2,273"},73.3]
[null,154,"Wright St.",34,{"v":2492,"d":"2,492"},73.3]
[null,155,"North Dakota St.",33,{"v":2416,"d":"2,416"},73.2]
[null,156,"South Alabama",32,{"v":2341,"d":"2,341"},73.2]
[null,157,"Penn",30,{"v":2192,"d":"2,192"},73.1]
[null,158,"SIUE",31,{"v":2265,"d":"2,265"},73.1]
[null,"-","Texas Tech",31,{"v":2265,"d":"2,265"},73.1]
[null,"-","Duquesne",31,{"v":2265,"d":"2,265"},73.1]
[null,161,"Idaho St.",29,{"v":2118,"d":"2,118"},{"v":73,"d":"73.0"}]
[null,162,"Texas St.",31,{"v":2264,"d":"2,264"},{"v":73,"d":"73.0"}]
[null,163,"South Carolina",31,{"v":2263,"d":"2,263"},{"v":73,"d":"73.0"}]
[null,164,"Illinois",31,{"v":2262,"d":"2,262"},{"v":73,"d":"73.0"}]
[null,"-","West Virginia",31,{"v":2262,"d":"2,262"},{"v":73,"d":"73.0"}]
[null,166,"Saint Mary's (CA)",33,{"v":2406,"d":"2,406"},72.9]
[null,167,"Nicholls St.",31,{"v":2260,"d":"2,260"},72.9]
[null,168,"Loyola Maryland",32,{"v":2332,"d":"2,332"},72.9]
[null,169,"N.C. Central",29,{"v":2113,"d":"2,113"},72.9]
[null,170,"Southern Miss.",30,{"v":2185,"d":"2,185"},72.8]
[null,171,"Stanford",30,{"v":2183,"d":"2,183"},72.8]
[null,172,"Tennessee St.",30,{"v":2182,"d":"2,182"},72.7]
[null,173,"UCF",30,{"v":2181,"d":"2,181"},72.7]
[null,174,"San Diego St.",31,{"v":2252,"d":"2,252"},72.6]
[null,"-","Alabama",31,{"v":2252,"d":"2,252"},72.6]
[null,176,"Troy",30,{"v":2179,"d":"2,179"},72.6]
[null,177,"Cal St. Fullerton",30,{"v":2176,"d":"2,176"},72.5]
[null,178,"UC Irvine",32,{"v":2321,"d":"2,321"},72.5]
[null,179,"Mercer",31,{"v":2248,"d":"2,248"},72.5]
[null,180,"Hawaii",30,{"v":2175,"d":"2,175"},72.5]
[null,181,"Niagara",32,{"v":2318,"d":"2,318"},72.4]
[null,182,"Central Ark.",31,{"v":2245,"d":"2,245"},72.4]
[null,183,"Xavier",31,{"v":2242,"d":"2,242"},72.3]
[null,184,"San Diego",35,{"v":2531,"d":"2,531"},72.3]
[null,185,"Oral Roberts",32,{"v":2314,"d":"2,314"},72.3]
[null,186,"Miami (FL)",31,{"v":2241,"d":"2,241"},72.3]
[null,"-","Butler",31,{"v":2241,"d":"2,241"},72.3]
[null,188,"Boston U.",33,{"v":2385,"d":"2,385"},72.3]
[null,189,"South Fla.",31,{"v":2239,"d":"2,239"},72.2]
[null,190,"Virginia",30,{"v":2164,"d":"2,164"},72.1]
[null,191,"Western Ky.",31,{"v":2236,"d":"2,236"},72.1]
[null,192,"Nebraska",31,{"v":2235,"d":"2,235"},72.1]
[null,193,"American",30,{"v":2161,"d":"2,161"},{"v":72,"d":"72.0"}]
[null,194,"Western Caro.",32,{"v":2304,"d":"2,304"},{"v":72,"d":"72.0"}]
[null,"-","Dartmouth",30,{"v":2160,"d":"2,160"},{"v":72,"d":"72.0"}]
[null,196,"Eastern Wash.",31,{"v":2231,"d":"2,231"},{"v":72,"d":"72.0"}]
[null,"-","Tulsa",31,{"v":2231,"d":"2,231"},{"v":72,"d":"72.0"}]
[null,198,"Morgan St.",30,{"v":2159,"d":"2,159"},{"v":72,"d":"72.0"}]
[null,199,"Boise St.",31,{"v":2229,"d":"2,229"},71.9]
[null,200,"Eastern Ill.",32,{"v":2299,"d":"2,299"},71.8]
[null,201,"Baylor",31,{"v":2227,"d":"2,227"},71.8]
[null,202,"SMU",30,{"v":2155,"d":"2,155"},71.8]
[null,203,"New Orleans",29,{"v":2080,"d":"2,080"},71.7]
[null,204,"Maryland",31,{"v":2222,"d":"2,222"},71.7]
[null,205,"Cincinnati",31,{"v":2221,"d":"2,221"},71.6]
[null,206,"Southeast Mo. St.",31,{"v":2216,"d":"2,216"},71.5]
[null,"-","VCU",31,{"v":2216,"d":"2,216"},71.5]
[null,208,"Providence",31,{"v":2214,"d":"2,214"},71.4]
[null,"-","Indiana",31,{"v":2214,"d":"2,214"},71.4]
[null,"-","Davidson",31,{"v":2214,"d":"2,214"},71.4]
[null,211,"Stony Brook",32,{"v":2285,"d":"2,285"},71.4]
[null,212,"Georgia",31,{"v":2213,"d":"2,213"},71.4]
[null,213,"CSU Bakersfield",30,{"v":2141,"d":"2,141"},71.4]
[null,214,"Grambling",32,{"v":2282,"d":"2,282"},71.3]
[null,215,"Delaware",33,{"v":2352,"d":"2,352"},71.3]
[null,216,"FGCU",32,{"v":2280,"d":"2,280"},71.3]
[null,217,"Harvard",27,{"v":1923,"d":"1,923"},71.2]
[null,218,"Texas",31,{"v":2207,"d":"2,207"},71.2]
[null,219,"Oklahoma",31,{"v":2206,"d":"2,206"},71.2]
[null,"-","Minnesota",31,{"v":2206,"d":"2,206"},71.2]
[null,221,"Central Conn. St.",31,{"v":2205,"d":"2,205"},71.1]
[null,222,"Arizona",31,{"v":2204,"d":"2,204"},71.1]
[null,223,"St. Francis Brooklyn",32,{"v":2273,"d":"2,273"},{"v":71,"d":"71.0"}]
[null,224,"Texas A&M",30,{"v":2130,"d":"2,130"},{"v":71,"d":"71.0"}]
[null,225,"Fla. Atlantic",31,{"v":2200,"d":"2,200"},{"v":71,"d":"71.0"}]
[null,226,"Massachusetts",31,{"v":2199,"d":"2,199"},70.9]
[null,227,"Western Ill.",31,{"v":2198,"d":"2,198"},70.9]
[null,228,"Chattanooga",32,{"v":2268,"d":"2,268"},70.9]
[null,"-","Army West Point",32,{"v":2268,"d":"2,268"},70.9]
[null,230,"Miami (OH)",32,{"v":2267,"d":"2,267"},70.8]
[null,231,"Boston College",31,{"v":2196,"d":"2,196"},70.8]
[null,"-","George Mason",31,{"v":2196,"d":"2,196"},70.8]
[null,233,"Elon",32,{"v":2266,"d":"2,266"},70.8]
[null,234,"Richmond",31,{"v":2194,"d":"2,194"},70.8]
[null,235,"Sacramento St.",29,{"v":2052,"d":"2,052"},70.8]
[null,236,"South Dakota",30,{"v":2118,"d":"2,118"},70.6]
[null,237,"Wichita St.",30,{"v":2117,"d":"2,117"},70.6]
[null,238,"Michigan",31,{"v":2183,"d":"2,183"},70.4]
[null,239,"Washington",31,{"v":2182,"d":"2,182"},70.4]
[null,240,"James Madison",33,{"v":2322,"d":"2,322"},70.4]
[null,241,"North Texas",31,{"v":2180,"d":"2,180"},70.3]
[null,242,"Canisius",32,{"v":2250,"d":"2,250"},70.3]
[null,243,"UAB",31,{"v":2178,"d":"2,178"},70.3]
[null,244,"UTRGV",33,{"v":2318,"d":"2,318"},70.2]
[null,245,"Pittsburgh",32,{"v":2247,"d":"2,247"},70.2]
[null,246,"Saint Joseph's",31,{"v":2176,"d":"2,176"},70.2]
[null,247,"Western Mich.",32,{"v":2246,"d":"2,246"},70.2]
[null,248,"SFA",30,{"v":2105,"d":"2,105"},70.2]
[null,249,"South Carolina St.",33,{"v":2315,"d":"2,315"},70.2]
[null,250,"Ohio",31,{"v":2174,"d":"2,174"},70.1]
[null,251,"NJIT",33,{"v":2310,"d":"2,310"},{"v":70,"d":"70.0"}]
[null,"-","Oregon",31,{"v":2170,"d":"2,170"},{"v":70,"d":"70.0"}]
[null,253,"Evansville",32,{"v":2234,"d":"2,234"},69.8]
[null,254,"N.C. A&T",29,{"v":2022,"d":"2,022"},69.7]
[null,255,"Rhode Island",30,{"v":2091,"d":"2,091"},69.7]
[null,256,"Longwood",32,{"v":2228,"d":"2,228"},69.6]
[null,257,"Wisconsin",31,{"v":2158,"d":"2,158"},69.6]
[null,258,"Bryant",30,{"v":2088,"d":"2,088"},69.6]
[null,259,"Penn St.",31,{"v":2157,"d":"2,157"},69.6]
[null,260,"Syracuse",31,{"v":2156,"d":"2,156"},69.5]
[null,"-","UMKC",31,{"v":2156,"d":"2,156"},69.5]
[null,262,"Denver",30,{"v":2086,"d":"2,086"},69.5]
[null,263,"Akron",32,{"v":2225,"d":"2,225"},69.5]
[null,264,"UT Arlington",31,{"v":2153,"d":"2,153"},69.5]
[null,265,"Stetson",31,{"v":2151,"d":"2,151"},69.4]
[null,"-","Clemson",31,{"v":2151,"d":"2,151"},69.4]
[null,267,"McNeese",31,{"v":2149,"d":"2,149"},69.3]
[null,"-","Ohio St.",31,{"v":2149,"d":"2,149"},69.3]
[null,269,"Princeton",27,{"v":1871,"d":"1,871"},69.3]
[null,270,"Indiana St.",31,{"v":2146,"d":"2,146"},69.2]
[null,"-","Milwaukee",31,{"v":2146,"d":"2,146"},69.2]
[null,272,"Notre Dame",32,{"v":2213,"d":"2,213"},69.2]
[null,273,"Robert Morris",33,{"v":2280,"d":"2,280"},69.1]
[null,274,"California",30,{"v":2070,"d":"2,070"},{"v":69,"d":"69.0"}]
[null,275,"Missouri St.",32,{"v":2206,"d":"2,206"},68.9]
[null,276,"Eastern Mich.",32,{"v":2203,"d":"2,203"},68.8]
[null,277,"Cornell",30,{"v":2060,"d":"2,060"},68.7]
[null,278,"Vanderbilt",31,{"v":2128,"d":"2,128"},68.6]
[null,279,"Southern Ill.",32,{"v":2194,"d":"2,194"},68.6]
[null,280,"Illinois St.",33,{"v":2257,"d":"2,257"},68.4]
[null,281,"Wake Forest",31,{"v":2119,"d":"2,119"},68.4]
[null,282,"Florida",31,{"v":2117,"d":"2,117"},68.3]
[null,283,"Santa Clara",31,{"v":2115,"d":"2,115"},68.2]
[null,"-","High Point",31,{"v":2115,"d":"2,115"},68.2]
[null,285,"Rutgers",30,{"v":2044,"d":"2,044"},68.1]
[null,286,"UMBC",33,{"v":2247,"d":"2,247"},68.1]
[null,287,"Air Force",30,{"v":2042,"d":"2,042"},68.1]
[null,288,"Oklahoma St.",31,{"v":2108,"d":"2,108"},{"v":68,"d":"68.0"}]
[null,289,"Tennessee Tech",31,{"v":2104,"d":"2,104"},67.9]
[null,290,"Idaho",31,{"v":2103,"d":"2,103"},67.8]
[null,291,"Towson",32,{"v":2170,"d":"2,170"},67.8]
[null,292,"La Salle",30,{"v":2034,"d":"2,034"},67.8]
[null,293,"USC Upstate",32,{"v":2169,"d":"2,169"},67.8]
[null,294,"East Carolina",30,{"v":2031,"d":"2,031"},67.7]
[null,295,"Loyola Marymount",31,{"v":2094,"d":"2,094"},67.5]
[null,296,"Mount St. Mary's",31,{"v":2092,"d":"2,092"},67.5]
[null,297,"Saint Louis",31,{"v":2090,"d":"2,090"},67.4]
[null,298,"Alabama St.",30,{"v":2020,"d":"2,020"},67.3]
[null,299,"Marist",31,{"v":2086,"d":"2,086"},67.3]
[null,300,"Albany (NY)",32,{"v":2150,"d":"2,150"},67.2]
[null,301,"Holy Cross",33,{"v":2216,"d":"2,216"},67.2]
[null,302,"Tulane",30,{"v":2014,"d":"2,014"},67.1]
[null,303,"Middle Tenn.",31,{"v":2080,"d":"2,080"},67.1]
[null,304,"Southeastern La.",31,{"v":2079,"d":"2,079"},67.1]
[null,305,"Missouri",30,{"v":2008,"d":"2,008"},66.9]
[null,306,"A&M-Corpus Christi",31,{"v":2073,"d":"2,073"},66.9]
[null,307,"Fairfield",31,{"v":2072,"d":"2,072"},66.8]
[null,308,"Valparaiso",33,{"v":2205,"d":"2,205"},66.8]
[null,309,"Pacific",32,{"v":2138,"d":"2,138"},66.8]
[null,310,"Old Dominion",31,{"v":2070,"d":"2,070"},66.8]
[null,311,"Bradley",34,{"v":2264,"d":"2,264"},66.6]
[null,312,"Cal Poly",29,{"v":1930,"d":"1,930"},66.6]
[null,313,"St. Bonaventure",31,{"v":2061,"d":"2,061"},66.5]
[null,"-","Navy",31,{"v":2061,"d":"2,061"},66.5]
[null,315,"Fordham",31,{"v":2058,"d":"2,058"},66.4]
[null,316,"San Jose St.",30,{"v":1986,"d":"1,986"},66.2]
[null,317,"Northwestern St.",31,{"v":2051,"d":"2,051"},66.2]
[null,318,"Incarnate Word",31,{"v":2044,"d":"2,044"},65.9]
[null,319,"UC Riverside",32,{"v":2109,"d":"2,109"},65.9]
[null,320,"Kansas St.",31,{"v":2043,"d":"2,043"},65.9]
[null,321,"Ark.-Pine Bluff",32,{"v":2108,"d":"2,108"},65.9]
[null,322,"Wagner",30,{"v":1974,"d":"1,974"},65.8]
[null,323,"Northwestern",31,{"v":2039,"d":"2,039"},65.8]
[null,324,"Loyola Chicago",33,{"v":2170,"d":"2,170"},65.8]
[null,325,"Wyoming",31,{"v":2037,"d":"2,037"},65.7]
[null,326,"UC Davis",30,{"v":1967,"d":"1,967"},65.6]
[null,327,"Georgia Tech",32,{"v":2091,"d":"2,091"},65.3]
[null,328,"Monmouth",35,{"v":2286,"d":"2,286"},65.3]
[null,329,"Binghamton",33,{"v":2152,"d":"2,152"},65.2]
[null,330,"UNI",34,{"v":2215,"d":"2,215"},65.1]
[null,331,"Portland",32,{"v":2078,"d":"2,078"},64.9]
[null,332,"Southern U.",32,{"v":2077,"d":"2,077"},64.9]
[null,333,"Siena",33,{"v":2131,"d":"2,131"},64.6]
[null,334,"Alcorn",31,{"v":1995,"d":"1,995"},64.4]
[null,335,"Mississippi Val.",32,{"v":2058,"d":"2,058"},64.3]
[null,336,"UTEP",29,{"v":1859,"d":"1,859"},64.1]
[null,337,"Coppin St.",32,{"v":2039,"d":"2,039"},63.7]
[null,338,"George Washington",31,{"v":1972,"d":"1,972"},63.6]
[null,339,"Kennesaw St.",32,{"v":2030,"d":"2,030"},63.4]
[null,340,"Delaware St.",30,{"v":1899,"d":"1,899"},63.3]
[null,341,"Saint Peter's",32,{"v":2012,"d":"2,012"},62.9]
[null,342,"Florida A&M",31,{"v":1927,"d":"1,927"},62.2]
[null,343,"Maine",32,{"v":1988,"d":"1,988"},62.1]
[null,344,"Chicago St.",31,{"v":1921,"d":"1,921"},{"v":62,"d":"62.0"}]
[null,345,"Jackson St.",32,{"v":1974,"d":"1,974"},61.7]
[null,346,"Charlotte",29,{"v":1776,"d":"1,776"},61.2]
[null,347,"Alabama A&M",32,{"v":1938,"d":"1,938"},60.6]
[null,348,"New Hampshire",29,{"v":1742,"d":"1,742"},60.1]
[null,349,"UNC Asheville",31,{"v":1857,"d":"1,857"},59.9]
[null,350,"UMES",32,{"v":1833,"d":"1,833"},57.3]
[null,"-","Manhattan",32,{"v":1833,"d":"1,833"},57.3]

{"sheet":"Anotación de defensa","index":5,"n_rows":356,"n_cols":7,"rows_kept":356}
[{"$nulls":6}," "]
[]
[null,"Partidos hasta el 13 de marzo de 2019"]
[]
[null,"Clasificación","Equipo","Part."," PTS RIVAL"," PPP RIVAL"]
[null,1,"Virginia",30,{"v":1637,"d":"1,637"},54.6]
[null,2,"Texas Tech",31,{"v":1818,"d":"1,818"},58.6]
[null,3,"Michigan",31,{"v":1824,"d":"1,824"},58.8]
[null,4,"Kansas St.",31,{"v":1831,"d":"1,831"},59.1]
[null,5,"Loyola Chicago",33,{"v":1996,"d":"1,996"},60.5]
[null,6,"Liberty",34,{"v":2066,"d":"2,066"},60.8]
[null,7,"VCU",31,{"v":1896,"d":"1,896"},61.2]
[null,8,"Old Dominion",31,{"v":1898,"d":"1,898"},61.2]
[null,"-","Wisconsin",31,{"v":1898,"d":"1,898"},61.2]
[null,10,"Houston",31,{"v":1910,"d":"1,910"},61.6]
[null,11,"Cincinnati",31,{"v":1921,"d":"1,921"},{"v":62,"d":"62.0"}]
[null,12,"Virginia Tech",31,{"v":1922,"d":"1,922"},{"v":62,"d":"62.0"}]
[null,13,"North Texas",32,{"v":2010,"d":"2,010"},62.8]
[null,14,"Manhattan",32,{"v":2011,"d":"2,011"},62.8]
[null,15,"Loyola Marymount",31,{"v":1951,"d":"1,951"},62.9]
[null,16,"Vermont",32,{"v":2018,"d":"2,018"},63.1]
[null,17,"Abilene Christian",31,{"v":1956,"d":"1,956"},63.1]
[null,18,"Akron",32,{"v":2025,"d":"2,025"},63.3]
[null,19,"Oregon",32,{"v":2026,"d":"2,026"},63.3]
[null,20,"Florida",31,{"v":1976,"d":"1,976"},63.7]
[null,21,"UC Irvine",32,{"v":2041,"d":"2,041"},63.8]
[null,22,"UCF",30,{"v":1914,"d":"1,914"},63.8]
[null,23,"Clemson",32,{"v":2042,"d":"2,042"},63.8]
[null,24,"St. Bonaventure",31,{"v":1982,"d":"1,982"},63.9]
[null,25,"UMBC",33,{"v":2111,"d":"2,111"},{"v":64,"d":"64.0"}]
[null,26,"Washington",31,{"v":1985,"d":"1,985"},{"v":64,"d":"64.0"}]
[null,27,"Southern Miss.",30,{"v":1925,"d":"1,925"},64.2]
[null,28,"Texas St.",31,{"v":1991,"d":"1,991"},64.2]
[null,29,"Saint Mary's (CA)",33,{"v":2124,"d":"2,124"},64.4]
[null,30,"New Mexico St.",31,{"v":2003,"d":"2,003"},64.6]
[null,31,"Saint Louis",31,{"v":2011,"d":"2,011"},64.9]
[null,32,"Davidson",31,{"v":2013,"d":"2,013"},64.9]
[null,"-","Maryland",31,{"v":2013,"d":"2,013"},64.9]
[null,34,"Bradley",34,{"v":2209,"d":"2,209"},{"v":65,"d":"65.0"}]
[null,35,"Gonzaga",33,{"v":2147,"d":"2,147"},65.1]
[null,36,"Northwestern",32,{"v":2082,"d":"2,082"},65.1]
[null,37,"Syracuse",32,{"v":2084,"d":"2,084"},65.1]
[null,38,"Kentucky",31,{"v":2022,"d":"2,022"},65.2]
[null,39,"Ohio St.",31,{"v":2033,"d":"2,033"},65.6]
[null,40,"UNI",34,{"v":2230,"d":"2,230"},65.6]
[null,41,"Wofford",33,{"v":2165,"d":"2,165"},65.6]
[null,42,"Stony Brook",32,{"v":2106,"d":"2,106"},65.8]
[null,"-","Furman",32,{"v":2106,"d":"2,106"},65.8]
[null,44,"Dayton",31,{"v":2041,"d":"2,041"},65.8]
[null,45,"Jackson St.",32,{"v":2107,"d":"2,107"},65.8]
[null,46,"Michigan St.",31,{"v":2043,"d":"2,043"},65.9]
[null,47,"Siena",33,{"v":2178,"d":"2,178"},{"v":66,"d":"66.0"}]
[null,48,"UC Santa Barbara",30,{"v":1982,"d":"1,982"},66.1]
[null,49,"Valparaiso",33,{"v":2187,"d":"2,187"},66.3]
[null,50,"Florida A&M",31,{"v":2057,"d":"2,057"},66.4]
[null,51,"A&M-Corpus Christi",32,{"v":2124,"d":"2,124"},66.4]
[null,52,"Purdue",31,{"v":2063,"d":"2,063"},66.5]
[null,53,"Georgia Tech",32,{"v":2130,"d":"2,130"},66.6]
[null,"-","Nebraska",32,{"v":2130,"d":"2,130"},66.6]
[null,55,"Nevada",31,{"v":2064,"d":"2,064"},66.6]
[null,"-","South Fla.",31,{"v":2064,"d":"2,064"},66.6]
[null,57,"Baylor",31,{"v":2067,"d":"2,067"},66.7]
[null,58,"Utah St.",31,{"v":2071,"d":"2,071"},66.8]
[null,59,"Fordham",32,{"v":2141,"d":"2,141"},66.9]
[null,60,"Southern Ill.",32,{"v":2144,"d":"2,144"},{"v":67,"d":"67.0"}]
[null,61,"Texas",31,{"v":2079,"d":"2,079"},67.1]
[null,62,"Villanova",31,{"v":2080,"d":"2,080"},67.1]
[null,63,"N.C. Central",29,{"v":1947,"d":"1,947"},67.1]
[null,64,"UAB",32,{"v":2150,"d":"2,150"},67.2]
[null,65,"UNC Greensboro",34,{"v":2288,"d":"2,288"},67.3]
[null,66,"Florida St.",31,{"v":2087,"d":"2,087"},67.3]
[null,"-","Missouri",31,{"v":2087,"d":"2,087"},67.3]
[null,68,"Louisville",32,{"v":2155,"d":"2,155"},67.3]
[null,69,"Wright St.",34,{"v":2290,"d":"2,290"},67.4]
[null,70,"Duke",31,{"v":2089,"d":"2,089"},67.4]
[null,71,"Missouri St.",32,{"v":2157,"d":"2,157"},67.4]
[null,72,"Indiana",31,{"v":2090,"d":"2,090"},67.4]
[null,73,"Southeastern La.",31,{"v":2094,"d":"2,094"},67.5]
[null,74,"Fresno St.",30,{"v":2027,"d":"2,027"},67.6]
[null,75,"Tennessee",31,{"v":2096,"d":"2,096"},67.6]
[null,76,"Toledo",31,{"v":2098,"d":"2,098"},67.7]
[null,77,"Murray St.",31,{"v":2101,"d":"2,101"},67.8]
[null,"-","San Francisco",31,{"v":2101,"d":"2,101"},67.8]
[null,79,"Robert Morris",33,{"v":2237,"d":"2,237"},67.8]
[null,80,"NJIT",33,{"v":2238,"d":"2,238"},67.8]
[null,81,"Colorado",31,{"v":2104,"d":"2,104"},67.9]
[null,82,"High Point",31,{"v":2105,"d":"2,105"},67.9]
[null,83,"Grand Canyon",30,{"v":2038,"d":"2,038"},67.9]
[null,84,"Fla. Atlantic",32,{"v":2175,"d":"2,175"},{"v":68,"d":"68.0"}]
[null,85,"San Diego",35,{"v":2381,"d":"2,381"},{"v":68,"d":"68.0"}]
[null,86,"Louisiana Tech",32,{"v":2178,"d":"2,178"},68.1]
[null,87,"Radford",33,{"v":2247,"d":"2,247"},68.1]
[null,88,"Rhode Island",30,{"v":2044,"d":"2,044"},68.1]
[null,"-","Wagner",30,{"v":2044,"d":"2,044"},68.1]
[null,90,"Grambling",32,{"v":2181,"d":"2,181"},68.2]
[null,91,"Brown",30,{"v":2045,"d":"2,045"},68.2]
[null,92,"Oklahoma",32,{"v":2183,"d":"2,183"},68.2]
[null,93,"San Diego St.",31,{"v":2116,"d":"2,116"},68.3]
[null,94,"Boise St.",32,{"v":2186,"d":"2,186"},68.3]
[null,95,"Penn St.",31,{"v":2119,"d":"2,119"},68.4]
[null,96,"Penn",30,{"v":2051,"d":"2,051"},68.4]
[null,97,"UC Davis",30,{"v":2053,"d":"2,053"},68.4]
[null,98,"Auburn",31,{"v":2123,"d":"2,123"},68.5]
[null,99,"Seattle U",31,{"v":2126,"d":"2,126"},68.6]
[null,100,"Arizona",31,{"v":2127,"d":"2,127"},68.6]
[null,101,"New Hampshire",29,{"v":1990,"d":"1,990"},68.6]
[null,102,"Saint Peter's",32,{"v":2196,"d":"2,196"},68.6]
[null,103,"Col. of Charleston",33,{"v":2265,"d":"2,265"},68.6]
[null,104,"Charlotte",29,{"v":1992,"d":"1,992"},68.7]
[null,105,"Pittsburgh",33,{"v":2267,"d":"2,267"},68.7]
[null,106,"Minnesota",31,{"v":2131,"d":"2,131"},68.7]
[null,107,"ETSU",33,{"v":2269,"d":"2,269"},68.8]
[null,108,"Northern Ky.",34,{"v":2338,"d":"2,338"},68.8]
[null,109,"Hawaii",30,{"v":2063,"d":"2,063"},68.8]
[null,110,"Iowa St.",31,{"v":2132,"d":"2,132"},68.8]
[null,"-","Rutgers",31,{"v":2132,"d":"2,132"},68.8]
[null,112,"Notre Dame",33,{"v":2276,"d":"2,276"},{"v":69,"d":"69.0"}]
[null,113,"UTEP",29,{"v":2001,"d":"2,001"},{"v":69,"d":"69.0"}]
[null,"-","American",30,{"v":2070,"d":"2,070"},{"v":69,"d":"69.0"}]
[null,"-","Montana",31,{"v":2139,"d":"2,139"},{"v":69,"d":"69.0"}]
[null,116,"Lipscomb",32,{"v":2209,"d":"2,209"},{"v":69,"d":"69.0"}]
[null,117,"New Orleans",29,{"v":2005,"d":"2,005"},69.1]
[null,118,"Eastern Mich.",32,{"v":2213,"d":"2,213"},69.2]
[null,119,"Jacksonville St.",33,{"v":2283,"d":"2,283"},69.2]
[null,120,"Princeton",27,{"v":1868,"d":"1,868"},69.2]
[null,121,"Marquette",31,{"v":2145,"d":"2,145"},69.2]
[null,122,"Sacramento St.",30,{"v":2076,"d":"2,076"},69.2]
[null,123,"Northern Colo.",31,{"v":2146,"d":"2,146"},69.2]
[null,"-","Sam Houston St.",31,{"v":2146,"d":"2,146"},69.2]
[null,125,"UC Riverside",32,{"v":2216,"d":"2,216"},69.3]
[null,"-","Albany (NY)",32,{"v":2216,"d":"2,216"},69.3]
[null,127,"Marist",31,{"v":2147,"d":"2,147"},69.3]
[null,128,"Providence",32,{"v":2217,"d":"2,217"},69.3]
[null,129,"Harvard",27,{"v":1873,"d":"1,873"},69.4]
[null,130,"Wichita St.",30,{"v":2086,"d":"2,086"},69.5]
[null,131,"Holy Cross",33,{"v":2296,"d":"2,296"},69.6]
[null,132,"Norfolk St.",32,{"v":2229,"d":"2,229"},69.7]
[null,133,"Charleston So.",32,{"v":2230,"d":"2,230"},69.7]
[null,134,"Oregon St.",30,{"v":2092,"d":"2,092"},69.7]
[null,"-","N.C. A&T",30,{"v":2092,"d":"2,092"},69.7]
[null,136,"Miami (OH)",32,{"v":2233,"d":"2,233"},69.8]
[null,137,"George Mason",31,{"v":2164,"d":"2,164"},69.8]
[null,138,"Fairfield",31,{"v":2167,"d":"2,167"},69.9]
[null,139,"UTRGV",33,{"v":2307,"d":"2,307"},69.9]
[null,"-","Drake",33,{"v":2307,"d":"2,307"},69.9]
[null,141,"St. Francis Brooklyn",32,{"v":2239,"d":"2,239"},{"v":70,"d":"70.0"}]
[null,142,"Colgate",34,{"v":2381,"d":"2,381"},{"v":70,"d":"70.0"}]
[null,143,"Longwood",32,{"v":2241,"d":"2,241"},{"v":70,"d":"70.0"}]
[null,"-","Pacific",32,{"v":2241,"d":"2,241"},{"v":70,"d":"70.0"}]
[null,145,"Santa Clara",31,{"v":2172,"d":"2,172"},70.1]
[null,"-","UT Arlington",31,{"v":2172,"d":"2,172"},70.1]
[null,147,"SMU",30,{"v":2102,"d":"2,102"},70.1]
[null,148,"NC State",32,{"v":2243,"d":"2,243"},70.1]
[null,149,"Illinois St.",33,{"v":2314,"d":"2,314"},70.1]
[null,150,"Campbell",32,{"v":2244,"d":"2,244"},70.1]
[null,151,"Kansas",31,{"v":2174,"d":"2,174"},70.1]
[null,152,"Lamar University",32,{"v":2246,"d":"2,246"},70.2]
[null,153,"TCU",32,{"v":2247,"d":"2,247"},70.2]
[null,154,"Mississippi St.",31,{"v":2177,"d":"2,177"},70.2]
[null,155,"Northeastern",33,{"v":2319,"d":"2,319"},70.3]
[null,156,"Utah Valley",31,{"v":2182,"d":"2,182"},70.4]
[null,157,"Western Ky.",31,{"v":2183,"d":"2,183"},70.4]
[null,158,"Cornell",30,{"v":2113,"d":"2,113"},70.4]
[null,159,"Gardner-Webb",34,{"v":2397,"d":"2,397"},70.5]
[null,160,"Butler",32,{"v":2257,"d":"2,257"},70.5]
[null,161,"Dartmouth",30,{"v":2116,"d":"2,116"},70.5]
[null,162,"Ole Miss",31,{"v":2190,"d":"2,190"},70.6]
[null,163,"Richmond",32,{"v":2262,"d":"2,262"},70.7]
[null,164,"Ball St.",32,{"v":2263,"d":"2,263"},70.7]
[null,165,"CSU Bakersfield",30,{"v":2122,"d":"2,122"},70.7]
[null,166,"Alcorn",31,{"v":2194,"d":"2,194"},70.8]
[null,167,"Northern Ill.",32,{"v":2266,"d":"2,266"},70.8]
[null,168,"Tulsa",31,{"v":2197,"d":"2,197"},70.9]
[null,"-","UConn",31,{"v":2197,"d":"2,197"},70.9]
[null,"-","Temple",31,{"v":2197,"d":"2,197"},70.9]
[null,171,"Cal St. Fullerton",30,{"v":2127,"d":"2,127"},70.9]
[null,172,"Buffalo",31,{"v":2198,"d":"2,198"},70.9]
[null,"-","Xavier",31,{"v":2198,"d":"2,198"},70.9]
[null,174,"Ark.-Pine Bluff",32,{"v":2269,"d":"2,269"},70.9]
[null,175,"Maine",32,{"v":2271,"d":"2,271"},{"v":71,"d":"71.0"}]
[null,176,"Miami (FL)",32,{"v":2275,"d":"2,275"},71.1]
[null,177,"Monmouth",35,{"v":2490,"d":"2,490"},71.1]
[null,178,"South Dakota",30,{"v":2136,"d":"2,136"},71.2]
[null,179,"Fairleigh Dickinson",33,{"v":2352,"d":"2,352"},71.3]
[null,180,"Alabama A&M",32,{"v":2285,"d":"2,285"},71.4]
[null,181,"Oklahoma St.",32,{"v":2288,"d":"2,288"},71.5]
[null,182,"Texas A&M",31,{"v":2217,"d":"2,217"},71.5]
[null,183,"Air Force",31,{"v":2218,"d":"2,218"},71.5]
[null,"-","Indiana St.",31,{"v":2218,"d":"2,218"},71.5]
[null,185,"Seton Hall",30,{"v":2147,"d":"2,147"},71.6]
[null,186,"UMES",32,{"v":2291,"d":"2,291"},71.6]
[null,187,"Duquesne",31,{"v":2222,"d":"2,222"},71.7]
[null,188,"Towson",32,{"v":2294,"d":"2,294"},71.7]
[null,189,"Alabama",31,{"v":2223,"d":"2,223"},71.7]
[null,190,"George Washington",32,{"v":2295,"d":"2,295"},71.7]
[null,191,"Alabama St.",30,{"v":2155,"d":"2,155"},71.8]
[null,192,"Stanford",31,{"v":2227,"d":"2,227"},71.8]
[null,193,"Binghamton",33,{"v":2376,"d":"2,376"},{"v":72,"d":"72.0"}]
[null,194,"Army West Point",32,{"v":2305,"d":"2,305"},{"v":72,"d":"72.0"}]
[null,195,"SFA",30,{"v":2161,"d":"2,161"},{"v":72,"d":"72.0"}]
[null,196,"Quinnipiac",30,{"v":2163,"d":"2,163"},72.1]
[null,197,"Delaware",33,{"v":2380,"d":"2,380"},72.1]
[null,198,"Prairie View",32,{"v":2308,"d":"2,308"},72.1]
[null,199,"Bethune-Cookman",30,{"v":2165,"d":"2,165"},72.2]
[null,200,"North Dakota St.",33,{"v":2382,"d":"2,382"},72.2]
[null,201,"La Salle",30,{"v":2167,"d":"2,167"},72.2]
[null,202,"Middle Tenn.",32,{"v":2313,"d":"2,313"},72.3]
[null,203,"Saint Joseph's",31,{"v":2241,"d":"2,241"},72.3]
[null,"-","Kent St.",31,{"v":2241,"d":"2,241"},72.3]
[null,205,"Boston U.",33,{"v":2387,"d":"2,387"},72.3]
[null,206,"Vanderbilt",32,{"v":2315,"d":"2,315"},72.3]
[null,207,"South Carolina",31,{"v":2243,"d":"2,243"},72.4]
[null,208,"Presbyterian",33,{"v":2389,"d":"2,389"},72.4]
[null,209,"Evansville",32,{"v":2317,"d":"2,317"},72.4]
[null,"-","South Alabama",32,{"v":2317,"d":"2,317"},72.4]
[null,211,"Mercer",31,{"v":2246,"d":"2,246"},72.5]
[null,212,"Navy",31,{"v":2250,"d":"2,250"},72.6]
[null,213,"Hofstra",34,{"v":2469,"d":"2,469"},72.6]
[null,214,"Yale",27,{"v":1961,"d":"1,961"},72.6]
[null,215,"UNLV",30,{"v":2179,"d":"2,179"},72.6]
[null,216,"Bowling Green",31,{"v":2256,"d":"2,256"},72.8]
[null,"-","Boston College",31,{"v":2256,"d":"2,256"},72.8]
[null,218,"Arkansas",31,{"v":2257,"d":"2,257"},72.8]
[null,219,"Coastal Caro.",30,{"v":2185,"d":"2,185"},72.8]
[null,220,"Arizona St.",30,{"v":2187,"d":"2,187"},72.9]
[null,221,"LSU",31,{"v":2261,"d":"2,261"},72.9]
[null,"-","North Carolina",31,{"v":2261,"d":"2,261"},72.9]
[null,223,"Hartford",33,{"v":2407,"d":"2,407"},72.9]
[null,224,"James Madison",33,{"v":2409,"d":"2,409"},{"v":73,"d":"73.0"}]
[null,225,"LIU Brooklyn",32,{"v":2337,"d":"2,337"},{"v":73,"d":"73.0"}]
[null,226,"Austin Peay",33,{"v":2413,"d":"2,413"},73.1]
[null,227,"Southern California",31,{"v":2267,"d":"2,267"},73.1]
[null,228,"North Dakota",30,{"v":2196,"d":"2,196"},73.2]
[null,229,"UMKC",31,{"v":2270,"d":"2,270"},73.2]
[null,230,"Bucknell",33,{"v":2418,"d":"2,418"},73.3]
[null,231,"Columbia",28,{"v":2052,"d":"2,052"},73.3]
[null,232,"Western Ill.",31,{"v":2272,"d":"2,272"},73.3]
[null,233,"South Dakota St.",32,{"v":2346,"d":"2,346"},73.3]
[null,234,"IUPUI",32,{"v":2349,"d":"2,349"},73.4]
[null,235,"Northwestern St.",31,{"v":2280,"d":"2,280"},73.5]
[null,236,"Massachusetts",32,{"v":2354,"d":"2,354"},73.6]
[null,237,"Mount St. Mary's",31,{"v":2286,"d":"2,286"},73.7]
[null,238,"Southern U.",32,{"v":2360,"d":"2,360"},73.8]
[null,"-","FGCU",32,{"v":2360,"d":"2,360"},73.8]
[null,240,"Ohio",31,{"v":2288,"d":"2,288"},73.8]
[null,241,"Belmont",31,{"v":2290,"d":"2,290"},73.9]
[null,242,"Georgia",32,{"v":2364,"d":"2,364"},73.9]
[null,243,"Iowa",31,{"v":2294,"d":"2,294"},{"v":74,"d":"74.0"}]
[null,244,"Georgia St.",31,{"v":2297,"d":"2,297"},74.1]
[null,245,"Creighton",31,{"v":2299,"d":"2,299"},74.2]
[null,246,"East Carolina",30,{"v":2226,"d":"2,226"},74.2]
[null,247,"Canisius",32,{"v":2376,"d":"2,376"},74.3]
[null,"-","Chattanooga",32,{"v":2376,"d":"2,376"},74.3]
[null,249,"Nicholls St.",31,{"v":2302,"d":"2,302"},74.3]
[null,250,"McNeese",31,{"v":2303,"d":"2,303"},74.3]
[null,251,"Weber St.",31,{"v":2305,"d":"2,305"},74.4]
[null,252,"Pepperdine",34,{"v":2529,"d":"2,529"},74.4]
[null,253,"St. John's (NY)",32,{"v":2382,"d":"2,382"},74.4]
[null,254,"UIC",32,{"v":2385,"d":"2,385"},74.5]
[null,255,"UNC Asheville",31,{"v":2313,"d":"2,313"},74.6]
[null,256,"Eastern Wash.",31,{"v":2314,"d":"2,314"},74.6]
[null,257,"Portland",32,{"v":2389,"d":"2,389"},74.7]
[null,258,"Milwaukee",31,{"v":2315,"d":"2,315"},74.7]
[null,259,"Troy",30,{"v":2242,"d":"2,242"},74.7]
[null,260,"Utah",30,{"v":2245,"d":"2,245"},74.8]
[null,261,"USC Upstate",32,{"v":2395,"d":"2,395"},74.8]
[null,262,"La.-Monroe",31,{"v":2321,"d":"2,321"},74.9]
[null,263,"UTSA",31,{"v":2322,"d":"2,322"},74.9]
[null,264,"Portland St.",31,{"v":2323,"d":"2,323"},74.9]
[null,265,"Illinois",32,{"v":2400,"d":"2,400"},{"v":75,"d":"75.0"}]
[null,266,"Jacksonville",32,{"v":2402,"d":"2,402"},75.1]
[null,267,"DePaul",30,{"v":2253,"d":"2,253"},75.1]
[null,268,"Colorado St.",32,{"v":2406,"d":"2,406"},75.2]
[null,269,"Rider",31,{"v":2333,"d":"2,333"},75.3]
[null,270,"Cal Poly",29,{"v":2183,"d":"2,183"},75.3]
[null,271,"Wyoming",32,{"v":2411,"d":"2,411"},75.3]
[null,272,"Samford",33,{"v":2487,"d":"2,487"},75.4]
[null,273,"Saint Francis (PA)",32,{"v":2419,"d":"2,419"},75.6]
[null,"-","Central Ark.",32,{"v":2419,"d":"2,419"},75.6]
[null,275,"Wake Forest",31,{"v":2344,"d":"2,344"},75.6]
[null,276,"UMass Lowell",32,{"v":2420,"d":"2,420"},75.6]
[null,"-","Iona",32,{"v":2420,"d":"2,420"},75.6]
[null,278,"Central Mich.",32,{"v":2424,"d":"2,424"},75.8]
[null,279,"Tennessee Tech",31,{"v":2350,"d":"2,350"},75.8]
[null,280,"Little Rock",31,{"v":2353,"d":"2,353"},75.9]
[null,281,"Incarnate Word",31,{"v":2355,"d":"2,355"},{"v":76,"d":"76.0"}]
[null,"-","Ga. Southern",31,{"v":2355,"d":"2,355"},{"v":76,"d":"76.0"}]
[null,283,"Coppin St.",33,{"v":2507,"d":"2,507"},{"v":76,"d":"76.0"}]
[null,284,"Niagara",32,{"v":2432,"d":"2,432"},{"v":76,"d":"76.0"}]
[null,285,"Memphis",31,{"v":2357,"d":"2,357"},{"v":76,"d":"76.0"}]
[null,286,"Southern Utah",30,{"v":2282,"d":"2,282"},76.1]
[null,287,"BYU",32,{"v":2436,"d":"2,436"},76.1]
[null,288,"Oakland",33,{"v":2515,"d":"2,515"},76.2]
[null,289,"Western Mich.",32,{"v":2439,"d":"2,439"},76.2]
[null,290,"New Mexico",31,{"v":2363,"d":"2,363"},76.2]
[null,291,"South Carolina St.",34,{"v":2593,"d":"2,593"},76.3]
[null,292,"Long Beach St.",32,{"v":2443,"d":"2,443"},76.3]
[null,293,"Central Conn. St.",31,{"v":2367,"d":"2,367"},76.4]
[null,294,"Elon",32,{"v":2445,"d":"2,445"},76.4]
[null,295,"Delaware St.",30,{"v":2296,"d":"2,296"},76.5]
[null,296,"West Virginia",32,{"v":2452,"d":"2,452"},76.6]
[null,297,"Omaha",32,{"v":2454,"d":"2,454"},76.7]
[null,298,"North Florida",33,{"v":2531,"d":"2,531"},76.7]
[null,299,"Southeast Mo. St.",31,{"v":2378,"d":"2,378"},76.7]
[null,300,"Kennesaw St.",32,{"v":2455,"d":"2,455"},76.7]
[null,301,"Hampton",31,{"v":2380,"d":"2,380"},76.8]
[null,302,"Eastern Ill.",32,{"v":2457,"d":"2,457"},76.8]
[null,303,"Morgan St.",30,{"v":2304,"d":"2,304"},76.8]
[null,304,"Idaho",32,{"v":2460,"d":"2,460"},76.9]
[null,305,"William & Mary",31,{"v":2385,"d":"2,385"},76.9]
[null,306,"California",31,{"v":2387,"d":"2,387"},{"v":77,"d":"77.0"}]
[null,307,"Morehead St.",33,{"v":2543,"d":"2,543"},77.1]
[null,308,"Bryant",30,{"v":2314,"d":"2,314"},77.1]
[null,309,"Denver",30,{"v":2319,"d":"2,319"},77.3]
[null,310,"Tulane",30,{"v":2320,"d":"2,320"},77.3]
[null,311,"Arkansas St.",32,{"v":2475,"d":"2,475"},77.3]
[null,"-","Drexel",32,{"v":2475,"d":"2,475"},77.3]
[null,313,"Loyola Maryland",32,{"v":2477,"d":"2,477"},77.4]
[null,314,"Purdue Fort Wayne",33,{"v":2556,"d":"2,556"},77.5]
[null,315,"Northern Ariz.",31,{"v":2402,"d":"2,402"},77.5]
[null,316,"Rice",32,{"v":2481,"d":"2,481"},77.5]
[null,317,"Oral Roberts",32,{"v":2483,"d":"2,483"},77.6]
[null,318,"UCLA",32,{"v":2484,"d":"2,484"},77.6]
[null,319,"Texas Southern",32,{"v":2487,"d":"2,487"},77.7]
[null,320,"Tennessee St.",30,{"v":2332,"d":"2,332"},77.7]
[null,321,"Lehigh",31,{"v":2413,"d":"2,413"},77.8]
[null,322,"Mississippi Val.",32,{"v":2498,"d":"2,498"},78.1]
[null,323,"Lafayette",30,{"v":2349,"d":"2,349"},78.3]
[null,324,"Stetson",31,{"v":2429,"d":"2,429"},78.4]
[null,325,"Sacred Heart",32,{"v":2509,"d":"2,509"},78.4]
[null,326,"Georgetown",31,{"v":2432,"d":"2,432"},78.5]
[null,327,"Howard",31,{"v":2434,"d":"2,434"},78.5]
[null,328,"Winthrop",30,{"v":2358,"d":"2,358"},78.6]
[null,329,"Cleveland St.",31,{"v":2437,"d":"2,437"},78.6]
[null,330,"Washington St.",32,{"v":2517,"d":"2,517"},78.7]
[null,331,"Youngstown St.",32,{"v":2526,"d":"2,526"},78.9]
[null,332,"Idaho St.",30,{"v":2369,"d":"2,369"},{"v":79,"d":"79.0"}]
[null,333,"CSUN",32,{"v":2538,"d":"2,538"},79.3]
[null,334,"Appalachian St.",32,{"v":2539,"d":"2,539"},79.3]
[null,335,"Montana St.",31,{"v":2462,"d":"2,462"},79.4]
[null,336,"Detroit Mercy",31,{"v":2464,"d":"2,464"},79.5]
[null,337,"Green Bay",33,{"v":2633,"d":"2,633"},79.8]
[null,338,"FIU",32,{"v":2555,"d":"2,555"},79.8]
[null,339,"Western Caro.",32,{"v":2563,"d":"2,563"},80.1]
[null,340,"UT Martin",31,{"v":2486,"d":"2,486"},80.2]
[null,341,"Louisiana",31,{"v":2505,"d":"2,505"},80.8]
[null,342,"UNCW",33,{"v":2670,"d":"2,670"},80.9]
[null,343,"SIUE",31,{"v":2520,"d":"2,520"},81.3]
[null,344,"Marshall",32,{"v":2610,"d":"2,610"},81.6]
[null,345,"San Jose St.",31,{"v":2534,"d":"2,534"},81.7]
[null,346,"VMI",32,{"v":2617,"d":"2,617"},81.8]
[null,347,"Houston Baptist",30,{"v":2484,"d":"2,484"},82.8]
[null,348,"Eastern Ky.",31,{"v":2577,"d":"2,577"},83.1]
[null,349,"Chicago St.",31,{"v":2624,"d":"2,624"},84.6]
[null,350,"The Citadel",30,{"v":2584,"d":"2,584"},86.1]
[null,351,"Savannah St.",31,{"v":2694,"d":"2,694"},86.9]

{"sheet":"% de ganados y perdidos","index":6,"n_rows":356,"n_cols":7,"rows_kept":356}
[{"$nulls":6}," "]
[]
[null,"Partidos hasta el 13 de marzo de 2019"]
[]
[null,"Clasificación","Equipo","G","P","PTAJE"]
[null,1,"Houston",29,2,93.5]
[null,2,"Virginia",28,2,93.3]
[null,3,"Gonzaga",30,3,90.9]
[null,4,"Buffalo",28,3,90.3]
[null,"-","Nevada",28,3,90.3]
[null,6,"Wofford",29,4,87.9]
[null,7,"Murray St.",27,4,87.1]
[null,"-","New Mexico St.",27,4,87.1]
[null,"-","Tennessee",27,4,87.1]
[null,10,"UC Irvine",27,5,84.4]
[null,11,"Belmont",26,5,83.9]
[null,"-","Texas Tech",26,5,83.9]
[null,"-","North Carolina",26,5,83.9]
[null,"-","Kentucky",26,5,83.9]
[null,"-","Duke",26,5,83.9]
[null,"-","LSU",26,5,83.9]
[null,"-","Michigan",26,5,83.9]
[null,18,"Liberty",28,6,82.4]
[null,"-","UNC Greensboro",28,6,82.4]
[null,20,"Vermont",26,6,81.3]
[null,21,"Utah St.",25,6,80.6]
[null,"-","Toledo",25,6,80.6]
[null,"-","Michigan St.",25,6,80.6]
[null,"-","Abilene Christian",25,6,80.6]
[null,"-","Florida St.",25,6,80.6]
[null,"-","Cincinnati",25,6,80.6]
[null,"-","VCU",25,6,80.6]
[null,28,"Hofstra",27,7,79.4]
[null,29,"Furman",25,7,78.1]
[null,"-","Lipscomb",25,7,78.1]
[null,31,"Virginia Tech",24,7,77.4]
[null,"-","Kansas St.",24,7,77.4]
[null,"-","Washington",24,7,77.4]
[null,34,"UCF",23,7,76.7]
[null,35,"Northern Ky.",26,8,76.5]
[null,36,"South Dakota St.",24,8,{"v":75,"d":"75.0"}]
[null,"-","Stony Brook",24,8,{"v":75,"d":"75.0"}]
[null,38,"Utah Valley",23,8,74.2]
[null,"-","Temple",23,8,74.2]
[null,"-","Texas St.",23,8,74.2]
[null,"-","Purdue",23,8,74.2]
[null,"-","Kansas",23,8,74.2]
[null,"-","Montana",23,8,74.2]
[null,"-","Marquette",23,8,74.2]
[null,"-","Old Dominion",23,8,74.2]
[null,"-","Davidson",23,8,74.2]
[null,47,"Yale",20,7,74.1]
[null,48,"Fresno St.",22,8,73.3]
[null,49,"ETSU",24,9,72.7]
[null,"-","Col. of Charleston",24,9,72.7]
[null,"-","Jacksonville St.",24,9,72.7]
[null,"-","Drake",24,9,72.7]
[null,53,"Mississippi St.",22,9,{"v":71,"d":"71.0"}]
[null,"-","Maryland",22,9,{"v":71,"d":"71.0"}]
[null,"-","Wisconsin",22,9,{"v":71,"d":"71.0"}]
[null,"-","Villanova",22,9,{"v":71,"d":"71.0"}]
[null,"-","Kent St.",22,9,{"v":71,"d":"71.0"}]
[null,"-","Auburn",22,9,{"v":71,"d":"71.0"}]
[null,"-","Georgia St.",22,9,{"v":71,"d":"71.0"}]
[null,60,"Colgate",24,10,70.6]
[null,61,"UC Santa Barbara",21,9,{"v":70,"d":"70.0"}]
[null,"-","Arizona St.",21,9,{"v":70,"d":"70.0"}]
[null,63,"Northeastern",23,10,69.7]
[null,64,"Central Mich.",22,10,68.8]
[null,"-","NC State",22,10,68.8]
[null,66,"San Francisco",21,10,67.7]
[null,"-","Sam Houston St.",21,10,67.7]
[null,"-","Northern Colo.",21,10,67.7]
[null,"-","Dayton",21,10,67.7]
[null,"-","Iowa",21,10,67.7]
[null,71,"Gardner-Webb",23,11,67.6]
[null,72,"Saint Mary's (CA)",22,11,66.7]
[null,"-","Austin Peay",22,11,66.7]
[null,"-","Radford",22,11,66.7]
[null,75,"St. John's (NY)",21,11,65.6]
[null,"-","Omaha",21,11,65.6]
[null,"-","North Texas",21,11,65.6]
[null,78,"Ole Miss",20,11,64.5]
[null,"-","Loyola Marymount",20,11,64.5]
[null,"-","Lehigh",20,11,64.5]
[null,"-","Bowling Green",20,11,64.5]
[null,"-","Ga. Southern",20,11,64.5]
[null,"-","Colorado",20,11,64.5]
[null,"-","Iowa St.",20,11,64.5]
[null,85,"NJIT",21,12,63.6]
[null,"-","UMBC",21,12,63.6]
[null,"-","Bucknell",21,12,63.6]
[null,88,"Brown",19,11,63.3]
[null,"-","Penn",19,11,63.3]
[null,"-","Southern Miss.",19,11,63.3]
[null,91,"Harvard",17,10,{"v":63,"d":"63.0"}]
[null,92,"Texas Southern",20,12,62.5]
[null,"-","Syracuse",20,12,62.5]
[null,"-","Prairie View",20,12,62.5]
[null,"-","Oregon",20,12,62.5]
[null,"-","Campbell",20,12,62.5]
[null,"-","Louisiana Tech",20,12,62.5]
[null,"-","Louisville",20,12,62.5]
[null,"-","Lamar University",20,12,62.5]
[null,"-","TCU",20,12,62.5]
[null,"-","Norfolk St.",20,12,62.5]
[null,102,"Wright St.",21,13,61.8]
[null,103,"South Fla.",19,12,61.3]
[null,"-","San Diego St.",19,12,61.3]
[null,"-","Saint Louis",19,12,61.3]
[null,"-","Baylor",19,12,61.3]
[null,"-","Memphis",19,12,61.3]
[null,"-","Duquesne",19,12,61.3]
[null,"-","Georgetown",19,12,61.3]
[null,"-","Louisiana",19,12,61.3]
[null,"-","Minnesota",19,12,61.3]
[null,112,"Loyola Chicago",20,13,60.6]
[null,"-","Fairleigh Dickinson",20,13,60.6]
[null,114,"San Diego",21,14,{"v":60,"d":"60.0"}]
[null,"-","Oregon St.",18,12,{"v":60,"d":"60.0"}]
[null,"-","N.C. A&T",18,12,{"v":60,"d":"60.0"}]
[null,"-","Grand Canyon",18,12,{"v":60,"d":"60.0"}]
[null,"-","Winthrop",18,12,{"v":60,"d":"60.0"}]
[null,"-","Hawaii",18,12,{"v":60,"d":"60.0"}]
[null,"-","Seton Hall",18,12,{"v":60,"d":"60.0"}]
[null,121,"FIU",19,13,59.4]
[null,"-","Oklahoma",19,13,59.4]
[null,"-","Marshall",19,13,59.4]
[null,"-","UAB",19,13,59.4]
[null,"-","Clemson",19,13,59.4]
[null,"-","BYU",19,13,59.4]
[null,127,"Princeton",16,11,59.3]
[null,128,"Bradley",20,14,58.8]
[null,129,"New Orleans",17,12,58.6]
[null,130,"Ohio St.",18,13,58.1]
[null,"-","Seattle U",18,13,58.1]
[null,"-","Western Ky.",18,13,58.1]
[null,"-","Creighton",18,13,58.1]
[null,"-","Tulsa",18,13,58.1]
[null,135,"UNLV",17,13,56.7]
[null,"-","Utah",17,13,56.7]
[null,"-","Wichita St.",17,13,56.7]
[null,138,"Saint Francis (PA)",18,14,56.3]
[null,"-","Providence",18,14,56.3]
[null,140,"UTSA",17,14,54.8]
[null,"-","Indiana",17,14,54.8]
[null,"-","Arizona",17,14,54.8]
[null,"-","Arkansas",17,14,54.8]
[null,"-","Florida",17,14,54.8]
[null,"-","George Mason",17,14,54.8]
[null,"-","La.-Monroe",17,14,54.8]
[null,"-","Xavier",17,14,54.8]
[null,"-","Weber St.",17,14,54.8]
[null,"-","Alabama",17,14,54.8]
[null,150,"Hartford",18,15,54.5]
[null,"-","Purdue Fort Wayne",18,15,54.5]
[null,"-","North Dakota St.",18,15,54.5]
[null,"-","Presbyterian",18,15,54.5]
[null,"-","UTRGV",18,15,54.5]
[null,155,"CSU Bakersfield",16,14,53.3]
[null,"-","Rhode Island",16,14,53.3]
[null,"-","Quinnipiac",16,14,53.3]
[null,158,"Iona",17,15,53.1]
[null,"-","Grambling",17,15,53.1]
[null,"-","Fla. Atlantic",17,15,53.1]
[null,"-","Charleston So.",17,15,53.1]
[null,"-","Akron",17,15,53.1]
[null,"-","St. Francis Brooklyn",17,15,53.1]
[null,"-","Southern Ill.",17,15,53.1]
[null,"-","UCLA",17,15,53.1]
[null,"-","Nebraska",17,15,53.1]
[null,167,"N.C. Central",15,14,51.7]
[null,168,"High Point",16,15,51.6]
[null,"-","Southeastern La.",16,15,51.6]
[null,"-","South Carolina",16,15,51.6]
[null,"-","Santa Clara",16,15,51.6]
[null,"-","Texas",16,15,51.6]
[null,"-","UT Arlington",16,15,51.6]
[null,"-","Howard",16,15,51.6]
[null,"-","Portland St.",16,15,51.6]
[null,"-","Rider",16,15,51.6]
[null,"-","St. Bonaventure",16,15,51.6]
[null,178,"Siena",17,16,51.5]
[null,"-","Illinois St.",17,16,51.5]
[null,"-","Delaware",17,16,51.5]
[null,"-","Robert Morris",17,16,51.5]
[null,"-","Green Bay",17,16,51.5]
[null,"-","Samford",17,16,51.5]
[null,184,"Ball St.",16,16,{"v":50,"d":"50.0"}]
[null,"-","Butler",16,16,{"v":50,"d":"50.0"}]
[null,"-","Northern Ill.",16,16,{"v":50,"d":"50.0"}]
[null,"-","IUPUI",16,16,{"v":50,"d":"50.0"}]
[null,"-","UIC",16,16,{"v":50,"d":"50.0"}]
[null,"-","South Alabama",16,16,{"v":50,"d":"50.0"}]
[null,"-","Missouri St.",16,16,{"v":50,"d":"50.0"}]
[null,"-","LIU Brooklyn",16,16,{"v":50,"d":"50.0"}]
[null,"-","Coastal Caro.",15,15,{"v":50,"d":"50.0"}]
[null,"-","American",15,15,{"v":50,"d":"50.0"}]
[null,"-","DePaul",15,15,{"v":50,"d":"50.0"}]
[null,"-","Sacramento St.",15,15,{"v":50,"d":"50.0"}]
[null,"-","Southern Utah",15,15,{"v":50,"d":"50.0"}]
[null,"-","Cornell",15,15,{"v":50,"d":"50.0"}]
[null,198,"Holy Cross",16,17,48.5]
[null,"-","North Florida",16,17,48.5]
[null,"-","Oakland",16,17,48.5]
[null,201,"Missouri",15,16,48.4]
[null,"-","UConn",15,16,48.4]
[null,"-","Indiana St.",15,16,48.4]
[null,"-","Hampton",15,16,48.4]
[null,"-","Southern California",15,16,48.4]
[null,"-","Stanford",15,16,48.4]
[null,"-","Montana St.",15,16,48.4]
[null,208,"UNI",16,18,47.1]
[null,"-","Pepperdine",16,18,47.1]
[null,210,"UMass Lowell",15,17,46.9]
[null,"-","Canisius",15,17,46.9]
[null,"-","Longwood",15,17,46.9]
[null,"-","Eastern Mich.",15,17,46.9]
[null,"-","Sacred Heart",15,17,46.9]
[null,"-","Miami (OH)",15,17,46.9]
[null,216,"Cal St. Fullerton",14,16,46.7]
[null,"-","Bethune-Cookman",14,16,46.7]
[null,"-","SMU",14,16,46.7]
[null,"-","SFA",14,16,46.7]
[null,220,"Valparaiso",15,18,45.5]
[null,"-","Boston U.",15,18,45.5]
[null,222,"Penn St.",14,17,45.2]
[null,"-","Ohio",14,17,45.2]
[null,"-","Nicholls St.",14,17,45.2]
[null,"-","Air Force",14,17,45.2]
[null,"-","William & Mary",14,17,45.2]
[null,"-","Eastern Wash.",14,17,45.2]
[null,"-","Boston College",14,17,45.2]
[null,"-","Rutgers",14,17,45.2]
[null,"-","Texas A&M",14,17,45.2]
[null,"-","New Mexico",14,17,45.2]
[null,232,"A&M-Corpus Christi",14,18,43.8]
[null,"-","FGCU",14,18,43.8]
[null,"-","Miami (FL)",14,18,43.8]
[null,"-","Georgia Tech",14,18,43.8]
[null,"-","Pacific",14,18,43.8]
[null,"-","Central Ark.",14,18,43.8]
[null,"-","Eastern Ill.",14,18,43.8]
[null,"-","Long Beach St.",14,18,43.8]
[null,240,"Wagner",13,17,43.3]
[null,"-","South Dakota",13,17,43.3]
[null,242,"Pittsburgh",14,19,42.4]
[null,"-","James Madison",14,19,42.4]
[null,"-","Notre Dame",14,19,42.4]
[null,245,"Eastern Ky.",13,18,41.9]
[null,"-","Saint Joseph's",13,18,41.9]
[null,247,"Ark.-Pine Bluff",13,19,40.6]
[null,"-","Army West Point",13,19,40.6]
[null,"-","Arkansas St.",13,19,40.6]
[null,"-","Boise St.",13,19,40.6]
[null,"-","Jackson St.",13,19,40.6]
[null,"-","Drexel",13,19,40.6]
[null,"-","Richmond",13,19,40.6]
[null,"-","Rice",13,19,40.6]
[null,"-","CSUN",13,19,40.6]
[null,"-","Northwestern",13,19,40.6]
[null,"-","Niagara",13,19,40.6]
[null,"-","West Virginia",13,19,40.6]
[null,259,"Monmouth",14,21,{"v":40,"d":"40.0"}]
[null,"-","Alabama St.",12,18,{"v":40,"d":"40.0"}]
[null,"-","The Citadel",12,18,{"v":40,"d":"40.0"}]
[null,"-","North Dakota",12,18,{"v":40,"d":"40.0"}]
[null,"-","Troy",12,18,{"v":40,"d":"40.0"}]
[null,"-","Houston Baptist",12,18,{"v":40,"d":"40.0"}]
[null,265,"Morehead St.",13,20,39.4]
[null,266,"UT Martin",12,19,38.7]
[null,"-","Florida A&M",12,19,38.7]
[null,"-","Marist",12,19,38.7]
[null,"-","Navy",12,19,38.7]
[null,270,"Chattanooga",12,20,37.5]
[null,"-","Oklahoma St.",12,20,37.5]
[null,"-","Youngstown St.",12,20,37.5]
[null,"-","Jacksonville",12,20,37.5]
[null,"-","Illinois",12,20,37.5]
[null,"-","Fordham",12,20,37.5]
[null,"-","Colorado St.",12,20,37.5]
[null,"-","Albany (NY)",12,20,37.5]
[null,278,"Dartmouth",11,19,36.7]
[null,"-","UC Davis",11,19,36.7]
[null,"-","Idaho St.",11,19,36.7]
[null,281,"Columbia",10,18,35.7]
[null,282,"Northwestern St.",11,20,35.5]
[null,"-","UMKC",11,20,35.5]
[null,"-","Central Conn. St.",11,20,35.5]
[null,"-","Wake Forest",11,20,35.5]
[null,"-","Detroit Mercy",11,20,35.5]
[null,"-","Savannah St.",11,20,35.5]
[null,"-","Mercer",11,20,35.5]
[null,289,"Oral Roberts",11,21,34.4]
[null,"-","Middle Tenn.",11,21,34.4]
[null,"-","Massachusetts",11,21,34.4]
[null,"-","Manhattan",11,21,34.4]
[null,"-","Loyola Maryland",11,21,34.4]
[null,"-","Appalachian St.",11,21,34.4]
[null,"-","VMI",11,21,34.4]
[null,"-","Evansville",11,21,34.4]
[null,"-","Elon",11,21,34.4]
[null,"-","Georgia",11,21,34.4]
[null,"-","Washington St.",11,21,34.4]
[null,300,"East Carolina",10,20,33.3]
[null,"-","Bryant",10,20,33.3]
[null,"-","La Salle",10,20,33.3]
[null,"-","Lafayette",10,20,33.3]
[null,304,"SIUE",10,21,32.3]
[null,"-","Southeast Mo. St.",10,21,32.3]
[null,"-","Northern Ariz.",10,21,32.3]
[null,"-","Alcorn",10,21,32.3]
[null,"-","Cleveland St.",10,21,32.3]
[null,"-","Little Rock",10,21,32.3]
[null,"-","Western Ill.",10,21,32.3]
[null,311,"Towson",10,22,31.3]
[null,"-","UC Riverside",10,22,31.3]
[null,"-","Saint Peter's",10,22,31.3]
[null,314,"UNCW",10,23,30.3]
[null,"-","Binghamton",10,23,30.3]
[null,316,"Morgan St.",9,21,{"v":30,"d":"30.0"}]
[null,"-","Tennessee St.",9,21,{"v":30,"d":"30.0"}]
[null,318,"Mount St. Mary's",9,22,{"v":29,"d":"29.0"}]
[null,"-","Fairfield",9,22,{"v":29,"d":"29.0"}]
[null,"-","Milwaukee",9,22,{"v":29,"d":"29.0"}]
[null,"-","McNeese",9,22,{"v":29,"d":"29.0"}]
[null,322,"George Washington",9,23,28.1]
[null,"-","Vanderbilt",9,23,28.1]
[null,324,"Charlotte",8,21,27.6]
[null,"-","UTEP",8,21,27.6]
[null,326,"Denver",8,22,26.7]
[null,327,"Tennessee Tech",8,23,25.8]
[null,"-","California",8,23,25.8]
[null,329,"Western Mich.",8,24,{"v":25,"d":"25.0"}]
[null,"-","Wyoming",8,24,{"v":25,"d":"25.0"}]
[null,331,"Coppin St.",8,25,24.2]
[null,332,"South Carolina St.",8,26,23.5]
[null,333,"Stetson",7,24,22.6]
[null,334,"Southern U.",7,25,21.9]
[null,"-","Western Caro.",7,25,21.9]
[null,"-","UMES",7,25,21.9]
[null,"-","Portland",7,25,21.9]
[null,338,"Cal Poly",6,23,20.7]
[null,339,"Delaware St.",6,24,{"v":20,"d":"20.0"}]
[null,340,"Incarnate Word",6,25,19.4]
[null,341,"USC Upstate",6,26,18.8]
[null,"-","Kennesaw St.",6,26,18.8]
[null,"-","Mississippi Val.",6,26,18.8]
[null,344,"New Hampshire",5,24,17.2]
[null,345,"Maine",5,27,15.6]
[null,"-","Alabama A&M",5,27,15.6]
[null,"-","Idaho",5,27,15.6]
[null,348,"Tulane",4,26,13.3]
[null,349,"UNC Asheville",4,27,12.9]
[null,"-","San Jose St.",4,27,12.9]
[null,351,"Chicago St.",3,28,9.7]