{"text_format":"3","workbook":"xlsx","n_sheets":7,"sheets":["Introducción","Entrada del usuario","Llaves","Ranking de la NCAA","Anotación de ataque","Anotación de defensa","% de ganados y perdidos"],"not_rendered":{"images":7,"defined_names":8},"read":"whole","date_system":"1900"}

{"sheet":"Introducción","index":0,"n_rows":16,"n_cols":14,"rows_kept":16,"merged":[[5,1,5,11],[6,1,6,11],[7,2,7,11],[13,1,13,3],[15,1,15,11]]}
[{"$nulls":13}," "]
[]
[]
[null,"Te damos la bienvenida a la herramienta de predicción de llaves para torneos de baloncesto."]
[]
[null,"Esta herramienta te permite ingresar tus propias ponderaciones a diferentes rangos y estadísticas establecidos, así como a tus propias predicciones de rendimiento para predecir los ganadores de todos los enfrentamientos en el torneo."]
[null,"Los participantes del torneo, rankings, estadísticas, cuatro primeros enfrentamientos y enfrentamientos de la primera ronda se cargaron previamente en las celdas grises de la hoja de cálculo.  "]
[null,"Paso 1","En la hoja de cálculo de datos proporcionados por el usuario, simplemente asigna tus propias predicciones de rendimiento y ponderación a las celdas de color verde claro."]
[null,"Paso 2","Verifica los resultados de los datos ingresados en la hoja de cálculo Llaves."]
[]
[null,"Y eso es todo, ya puedes pronosticar quién será el campeón nacional."]
[]
[null,"¿Estás interesado en un enfoque diferente?"]
[null,"Buscar las predicciones de Bing aquí"]
[]
[null,"Nota: Esta herramienta es ofrecida por Microsoft Corporation. No cuenta con patrocinio ni apoyo de la NCAA, ni está afiliada a ella. Esta herramienta es solo para diversión y no fue diseñada para usar en apuestas ni en otras actividades que generan valor. No formulamos ninguna declaración respecto de la precisión de las predicciones ni de las llaves derivadas de esta herramienta."]

{"sheet":"Entrada del usuario","index":1,"n_rows":77,"n_cols":28,"rows_kept":77,"merged":[[4,1,4,2],[4,3,4,6],[4,7,4,8],[5,1,5,2],[8,1,8,2]]}
[{"$nulls":15}," "]
[]
[]
[]
[null,"Nombre de usuario",null,"4 semifinalistas proyectados",{"$nulls":3},"Finalistas proyectados",{"$nulls":6},"Campeón"]
[null,"Escribe el nombre de usuario",null,{"$f":"+Llaves!W34","v":"Duke"},{"$f":"+Llaves!W98","v":"Gonzaga"},{"$f":"+Llaves!AO34","v":"Virginia"},{"$f":"+Llaves!AO98","v":"Houston"},{"$f":"+Llaves!AB66","v":"Gonzaga"},{"$f":"+Llaves!AJ66","v":"Virginia"},{"$nulls":5},{"$f":"+Llaves!AF66","v":"Virginia"}]
[]
[{"$nulls":16},{"$f":"+D8","v":0},{"$f":"+E8","v":0},{"$f":"+F8","v":0},{"$f":"+G8","v":0},{"$f":"+H8","v":0},{"$f":"+I8","v":0},{"$f":"+J8","v":0},{"$f":"+K8","v":0},{"$f":"+L8","v":0},{"$f":"+M8","v":0},{"$f":"+N8","v":0},{"$f":"+O8","v":0}]
[null,"Ponderación de columna asignada por el usuario \nEntre 0 (no usar) y 10 (factor más alto)",null,5,1,1,1,2,5,0,0,0,{"$nulls":4},{"$f":"+D9","v":5},{"$f":"+E9","v":1},{"$f":"+F9","v":1},{"$f":"+G9","v":1},2,5,0,0,0]
[null,1,"Duke",1,{"$f":"VLOOKUP(C10,'Ranking de la NCAA'!$D$6:$L$358,9,FALSE)","v":3},{"$f":"VLOOKUP(C10,'Anotación de ataque'!$C$6:$F$356,4,FALSE)","v":84.1},{"$f":"VLOOKUP(C10,'Anotación de defensa'!$C$6:$F$356,4,FALSE)","v":67.4},{"$f":"VLOOKUP(C10,'% de ganados y perdidos'!$C$6:$F$356,4,FALSE)/100","v":{"v":0.8390000000000001,"d":"83.9%"}},5,0,0,0,null,null,{"$f":"+AB10","v":{"v":7.464329405038098,"d":"7.46"}},null,{"$f":"_xlfn.RANK.EQ(D10,D$10:D$77,0)/COUNT($B$10:$B$77)*10","v":{"v":10,"d":"10.00"}},{"$f":"_xlfn.RANK.EQ(E10,E$10:E$77,0)/COUNT($B$10:$B$77)*10","v":{"v":9.705882352941176,"d":"9.71"}},{"$f":"((F10-MIN(F$10:F$77))/(MAX(F$10:F$77)-MIN(F$10:F$77)))*10","v":{"v":7.947598253275108,"d":"7.95"}},{"$f":"10-((G10-MIN(G$10:G$77))/(MAX(G$10:G$77)-MIN(G$10:G$77)))*10","v":{"v":3.9047619047619007,"d":"3.90"}},{"$f":"((H10-MIN(H$10:H$77))/(MAX(H$10:H$77)-MIN(H$10:H$77)))*10","v":{"v":7.703349282296652,"d":"7.70"}},{"$f":"+I10","v":5},{"$f":"+J10","v":0},{"$f":"+K10","v":0},{"$f":"+L10","v":0},null,null,{"$f":"+(Q10*Q$9+R10*R$9+S10*S$9+T10*T$9+U10*U$9+V10*V$9+W10*W$9+X10*X$9+Y10*Y$9)/SUM(Q$9:Y$9)","v":{"v":7.464329405038098,"d":"7.46"}}]
[null,2,"Virginia",2,{"$f":"VLOOKUP(C11,'Ranking de la NCAA'!$D$6:$L$358,9,FALSE)","v":1},{"$f":"VLOOKUP(C11,'Anotación de ataque'!$C$6:$F$356,4,FALSE)","v":72.1},{"$f":"VLOOKUP(C11,'Anotación de defensa'!$C$6:$F$356,4,FALSE)","v":54.6},{"$f":"VLOOKUP(C11,'% de ganados y perdidos'!$C$6:$F$356,4,FALSE)/100","v":{"v":0.9329999999999999,"d":"93.3%"}},5,0,0,0,null,null,{"$f":"+AB11","v":{"v":7.791762378882311,"d":"7.79"}},null,{"$f":"_xlfn.RANK.EQ(D11,D$10:D$77,0)/COUNT($B$10:$B$77)*10","v":{"v":9.852941176470589,"d":"9.85"}},{"v":10,"d":"10.00"},{"v":2.7074235807860223,"d":"2.71"},{"v":10,"d":"10.00"},{"v":9.952153110047844,"d":"9.95"},{"$f":"+I11","v":5},0,0,0,null,null,{"v":7.791762378882311,"d":"7.79"}]
[null,3,"North Carolina",3,{"$f":"VLOOKUP(C12,'Ranking de la NCAA'!$D$6:$L$358,9,FALSE)","v":7},{"$f":"VLOOKUP(C12,'Anotación de ataque'!$C$6:$F$356,4,FALSE)","v":86.6},{"$f":"VLOOKUP(C12,'Anotación de defensa'!$C$6:$F$356,4,FALSE)","v":72.9},{"$f":"VLOOKUP(C12,'% de ganados y perdidos'!$C$6:$F$356,4,FALSE)/100","v":{"v":0.8390000000000001,"d":"83.9%"}},5,0,0,0,null,null,{"v":7.22525153225871,"d":"7.23"},null,{"v":9.705882352941176,"d":"9.71"},{"v":9.117647058823529,"d":"9.12"},{"v":9.039301310043667,"d":"9.04"},{"v":1.2857142857142811,"d":"1.29"},{"v":7.703349282296652,"d":"7.70"},5,0,0,0,null,null,{"v":7.22525153225871,"d":"7.23"}]
[null,4,"Gonzaga",4,{"$f":"VLOOKUP(C13,'Ranking de la NCAA'!$D$6:$L$358,9,FALSE)","v":2},{"$f":"VLOOKUP(C13,'Anotación de ataque'!$C$6:$F$356,4,FALSE)","v":88.8},{"$f":"VLOOKUP(C13,'Anotación de defensa'!$C$6:$F$356,4,FALSE)","v":65.1},{"$f":"VLOOKUP(C13,'% de ganados y perdidos'!$C$6:$F$356,4,FALSE)/100","v":{"v":0.909,"d":"90.9%"}},5,0,0,0,null,null,{"v":7.760202645651562,"d":"7.76"},null,{"v":9.558823529411764,"d":"9.56"},{"v":9.852941176470589,"d":"9.85"},{"v":10,"d":"10.00"},{"v":5.000000000000002,"d":"5.00"},{"v":9.377990430622008,"d":"9.38"},5,0,0,0,null,null,{"v":7.760202645651562,"d":"7.76"}]
[null,5,"Tennessee",5,{"$f":"VLOOKUP(C14,'Ranking de la NCAA'!$D$6:$L$358,9,FALSE)","v":5},{"$f":"VLOOKUP(C14,'Anotación de ataque'!$C$6:$F$356,4,FALSE)","v":82.3},{"$f":"VLOOKUP(C14,'Anotación de defensa'!$C$6:$F$356,4,FALSE)","v":67.6},{"$f":"VLOOKUP(C14,'% de ganados y perdidos'!$C$6:$F$356,4,FALSE)/100","v":{"v":0.871,"d":"87.1%"}},5,0,0,0,null,null,{"v":7.291965542685459,"d":"7.29"},null,{"v":9.411764705882353,"d":"9.41"},{"v":9.411764705882353,"d":"9.41"},{"v":7.161572052401746,"d":"7.16"},{"v":3.80952380952381,"d":"3.81"},{"v":8.4688995215311,"d":"8.47"},5,0,0,0,null,null,{"v":7.291965542685459,"d":"7.29"}]
[null,6,"Michigan St.",6,{"$f":"VLOOKUP(C15,'Ranking de la NCAA'!$D$6:$L$358,9,FALSE)","v":8},{"$f":"VLOOKUP(C15,'Anotación de ataque'!$C$6:$F$356,4,FALSE)","v":79.7},{"$f":"VLOOKUP(C15,'Anotación de defensa'!$C$6:$F$356,4,FALSE)","v":65.9},{"$f":"VLOOKUP(C15,'% de ganados y perdidos'!$C$6:$F$356,4,FALSE)/100","v":{"v":0.8059999999999999,"d":"80.6%"}},5,0,0,0,null,null,{"v":6.984474489042742,"d":"6.98"},null,{"v":9.264705882352942,"d":"9.26"},{"v":8.970588235294118,"d":"8.97"},{"v":6.026200873362447,"d":"6.03"},{"v":4.619047619047615,"d":"4.62"},{"v":6.913875598086122,"d":"6.91"},5,0,0,0,null,null,{"v":6.984474489042742,"d":"6.98"}]
[null,7,"Kentucky",7,{"$f":"VLOOKUP(C16,'Ranking de la NCAA'!$D$6:$L$358,9,FALSE)","v":6},{"$f":"VLOOKUP(C16,'Anotación de ataque'!$C$6:$F$356,4,FALSE)","v":76.8},{"$f":"VLOOKUP(C16,'Anotación de defensa'!$C$6:$F$356,4,FALSE)","v":65.2},{"$f":"VLOOKUP(C16,'% de ganados y perdidos'!$C$6:$F$356,4,FALSE)/100","v":{"v":0.8390000000000001,"d":"83.9%"}},5,0,0,0,null,null,{"v":6.998123068063717,"d":"7.00"},null,{"v":9.117647058823529,"d":"9.12"},{"v":9.264705882352942,"d":"9.26"},{"$f":"((F16-MIN(F$10:F$77))/(MAX(F$10:F$77)-MIN(F$10:F$77)))*10","v":{"v":4.759825327510915,"d":"4.76"}},{"$f":"10-((G16-MIN(G$10:G$77))/(MAX(G$10:G$77)-MIN(G$10:G$77)))*10","v":{"v":4.952380952380951,"d":"4.95"}},{"$f":"((H16-MIN(H$10:H$77))/(MAX(H$10:H$77)-MIN(H$10:H$77)))*10","v":{"v":7.703349282296652,"d":"7.70"}},{"$f":"+I16","v":5},{"$f":"+J16","v":0},{"$f":"+K16","v":0},{"$f":"+L16","v":0},null,null,{"v":6.998123068063717,"d":"7.00"}]
[null,8,"Michigan",8,{"$f":"VLOOKUP(C17,'Ranking de la NCAA'!$D$6:$L$358,9,FALSE)","v":9},{"$f":"VLOOKUP(C17,'Anotación de ataque'!$C$6:$F$356,4,FALSE)","v":70.4},{"$f":"VLOOKUP(C17,'Anotación de defensa'!$C$6:$F$356,4,FALSE)","v":58.8},{"$f":"VLOOKUP(C17,'% de ganados y perdidos'!$C$6:$F$356,4,FALSE)/100","v":{"v":0.8390000000000001,"d":"83.9%"}},5,0,0,0,null,null,{"v":6.9365489770007995,"d":"6.94"},null,{"v":8.970588235294118,"d":"8.97"},{"v":8.823529411764707,"d":"8.82"},{"$f":"((F17-MIN(F$10:F$77))/(MAX(F$10:F$77)-MIN(F$10:F$77)))*10","v":{"v":1.965065502183407,"d":"1.97"}},{"$f":"10-((G17-MIN(G$10:G$77))/(MAX(G$10:G$77)-MIN(G$10:G$77)))*10","v":{"v":8.000000000000002,"d":"8.00"}},{"$f":"((H17-MIN(H$10:H$77))/(MAX(H$10:H$77)-MIN(H$10:H$77)))*10","v":{"v":7.703349282296652,"d":"7.70"}},5,0,0,0,null,null,{"v":6.9365489770007995,"d":"6.94"}]
[null,9,"Houston",9,{"$f":"VLOOKUP(C18,'Ranking de la NCAA'!$D$6:$L$358,9,FALSE)","v":4},{"$f":"VLOOKUP(C18,'Anotación de ataque'!$C$6:$F$356,4,FALSE)","v":76.4},{"$f":"VLOOKUP(C18,'Anotación de defensa'!$C$6:$F$356,4,FALSE)","v":61.6},{"$f":"VLOOKUP(C18,'% de ganados y perdidos'!$C$6:$F$356,4,FALSE)/100","v":{"v":0.935,"d":"93.5%"}},5,0,0,0,null,null,{"v":7.328552672888661,"d":"7.33"},null,{"v":8.823529411764707,"d":"8.82"},{"v":9.558823529411764,"d":"9.56"},{"v":4.585152838427949,"d":"4.59"},{"v":6.666666666666666,"d":"6.67"},{"v":10,"d":"10.00"},5,0,0,0,null,null,{"v":7.328552672888661,"d":"7.33"}]
[null,10,"Texas Tech",10,{"$f":"VLOOKUP(C19,'Ranking de la NCAA'!$D$6:$L$358,9,FALSE)","v":10},{"$f":"VLOOKUP(C19,'Anotación de ataque'!$C$6:$F$356,4,FALSE)","v":73.1},{"$f":"VLOOKUP(C19,'Anotación de defensa'!$C$6:$F$356,4,FALSE)","v":58.6},{"$f":"VLOOKUP(C19,'% de ganados y perdidos'!$C$6:$F$356,4,FALSE)/100","v":{"v":0.8390000000000001,"d":"83.9%"}},5,0,0,0,null,null,{"v":6.9136576661824405,"d":"6.91"},null,{"v":8.676470588235293,"d":"8.68"},{"v":8.676470588235293,"d":"8.68"},{"v":3.144104803493446,"d":"3.14"},{"v":8.095238095238095,"d":"8.10"},{"v":7.703349282296652,"d":"7.70"},5,0,0,0,null,null,{"v":6.9136576661824405,"d":"6.91"}]
[null,11,"LSU",11,{"$f":"VLOOKUP(C20,'Ranking de la NCAA'!$D$6:$L$358,9,FALSE)","v":14},{"$f":"VLOOKUP(C20,'Anotación de ataque'!$C$6:$F$356,4,FALSE)","v":81.6},{"$f":"VLOOKUP(C20,'Anotación de defensa'!$C$6:$F$356,4,FALSE)","v":72.9},{"$f":"VLOOKUP(C20,'% de ganados y perdidos'!$C$6:$F$356,4,FALSE)/100","v":{"v":0.8390000000000001,"d":"83.9%"}},5,0,0,0,null,null,{"v":6.618906810964079,"d":"6.62"},null,{"v":8.529411764705882,"d":"8.53"},{"v":8.088235294117647,"d":"8.09"},{"v":6.855895196506547,"d":"6.86"},{"v":1.2857142857142811,"d":"1.29"},{"v":7.703349282296652,"d":"7.70"},5,0,0,0,null,null,{"v":6.618906810964079,"d":"6.62"}]
{"$rows_left_out":58}
{"sheet":"Llaves","index":2,"n_rows":130,"n_cols":63,"rows_kept":130,"merged":[[3,2,3,3],[3,7,3,8],[3,12,3,13],[3,17,3,18],[3,22,3,23],[3,39,3,40],[3,44,3,45],[3,49,3,50],[3,54,3,55],[3,59,3,60],[5,1,6,1],[5,2,6,2],[5,3,6,3],[5,59,6,59],[5,60,6,60],[5,61,6,61],[7,7,8,7],[7,8,8,8],[7,54,8,54],[7,55,8,55],[9,1,10,1],[9,2,10,2],[9,3,10,3],[9,59,10,59],[9,60,10,60],[9,61,10,61],[11,12,12,12],[11,13,12,13],[11,49,12,49],[11,50,12,50],[13,1,14,1],[13,2,14,2],[13,3,14,3],[13,59,14,59],[13,60,14,60],[13,61,14,61],[15,7,16,7],[15,8,16,8],[15,54,16,54],[15,55,16,55],[17,1,18,1],[17,2,18,2],[17,3,18,3],[17,59,18,59],[17,60,18,60],[17,61,18,61],[19,17,20,17],[19,18,20,18],[19,44,20,44],[19,45,20,45],[21,1,22,1],[21,2,22,2],[21,3,22,3],[21,59,22,59],[21,60,22,60],[21,61,22,61],[23,7,24,7],[23,8,24,8],[23,54,24,54],[23,55,24,55],[25,1,26,1],[25,2,26,2],[25,3,26,3],[25,59,26,59],[25,60,26,60],[25,61,26,61],[27,12,28,12],[27,13,28,13],[27,49,28,49],[27,50,28,50],[29,1,30,1],[29,2,30,2],[29,3,30,3],[29,59,30,59],[29,60,30,60],[29,61,30,61],[31,7,32,7],[31,8,32,8],[31,54,32,54],[31,55,32,55],[33,1,34,1],[33,2,34,2],[33,3,34,3],[33,22,38,22],[33,23,38,23],[33,39,38,39],[33,40,38,40],[33,59,34,59],[33,60,34,60],[33,61,34,61],[37,1,38,1],[37,2,38,2],[37,3,38,3],[37,59,38,59],[37,60,38,60],[37,61,38,61],[39,7,40,7],[39,8,40,8],[39,54,40,54],[39,55,40,55],[41,1,42,1],[41,2,42,2],[41,3,42,3],[41,59,42,59],[41,60,42,60],[41,61,42,61],[43,12,44,12],[43,13,44,13],[43,49,44,49],[43,50,44,50],[45,1,46,1],[45,2,46,2],[45,3,46,3],[45,59,46,59],[45,60,46,60],[45,61,46,61],[47,7,48,7],[47,8,48,8],[47,54,48,54],[47,55,48,55],[49,1,50,1],[49,2,50,2],[49,3,50,3],[49,59,50,59],[49,60,50,60],[49,61,50,61],[51,17,52,17],[51,18,52,18],[51,44,52,44],[51,45,52,45],[53,1,54,1],[53,2,54,2],[53,3,54,3],[53,59,54,59],[53,60,54,60],[53,61,54,61],[55,7,56,7],[55,8,56,8],[55,54,56,54],[55,55,56,55],[57,1,58,1],[57,2,58,2],[57,3,58,3],[57,59,58,59],[57,60,58,60],[57,61,58,61],[58,28,62,34],[59,12,60,12],[59,13,60,13],[59,49,60,49],[59,50,60,50],[61,1,62,1],[61,2,62,2],[61,3,62,3],[61,59,62,59],[61,60,62,60],[61,61,62,61],[63,7,64,7],[63,8,64,8],[63,54,64,54],[63,55,64,55],[65,1,66,1],[65,2,66,2],[65,3,66,3],[65,22,69,23],[65,27,70,27],[65,28,70,28],[65,31,70,31],[65,34,70,34],[65,35,70,35],[65,39,69,40],[65,59,66,59],[65,60,66,60],[65,61,66,61],[69,1,70,1],[69,2,70,2],[69,3,70,3],[69,59,70,59],[69,60,70,60],[69,61,70,61],[71,7,72,7],[71,8,72,8],[71,54,72,54],[71,55,72,55],[73,1,74,1],[73,2,74,2],[73,3,74,3],[73,59,74,59],[73,60,74,60],[73,61,74,61],[75,12,76,12],[75,13,76,13],[75,49,76,49],[75,50,76,50],[77,1,78,1],[77,2,78,2],[77,3,78,3],[77,59,78,59],[77,60,78,60],[77,61,78,61],[79,7,80,7],[79,8,80,8],[79,54,80,54],[79,55,80,55],[81,1,82,1],[81,2,82,2],[81,3,82,3],[81,59,82,59],[81,60,82,60],[81,61,82,61],[83,17,84,17],[83,18,84,18],[83,44,84,44],[83,45,84,45],[85,1,86,1],[85,2,86,2],[85,3,86,3],[85,59,86,59],[85,60,86,60],[85,61,86,61],[87,7,88,7],[87,8,88,8],[87,54,88,54],[87,55,88,55],[89,1,90,1],[89,2,90,2],[89,3,90,3],[89,59,90,59],[89,60,90,60],[89,61,90,61],[91,12,92,12],[91,13,92,13],[91,49,92,49],[91,50,92,50],[93,1,94,1],[93,2,94,2],[93,3,94,3],[93,59,94,59],[93,60,94,60],[93,61,94,61],[95,7,96,7],[95,8,96,8],[95,54,96,54],[95,55,96,55],[97,1,98,1],[97,2,98,2],[97,3,98,3],[97,22,102,22],[97,23,102,23],[97,39,102,39],[97,40,102,40],[97,59,98,59],[97,60,98,60],[97,61,98,61],[101,1,102,1],[101,2,102,2],[101,3,102,3],[101,59,102,59],[101,60,102,60],[101,61,102,61],[103,7,104,7],[103,8,104,8],[103,54,104,54],[103,55,104,55],[105,1,106,1],[105,2,106,2],[105,3,106,3],[105,59,106,59],[105,60,106,60],[105,61,106,61],[107,12,108,12],[107,13,108,13],[107,49,108,49],[107,50,108,50],[109,1,110,1],[109,2,110,2],[109,3,110,3],[109,59,110,59],[109,60,110,60],[109,61,110,61],[111,7,112,7],[111,8,112,8],[111,54,112,54],[111,55,112,55],[113,1,114,1],[113,2,114,2],[113,3,114,3],[113,59,114,59],[113,60,114,60],[113,61,114,61],[115,17,116,17],[115,18,116,18],[115,44,116,44],[115,45,116,45],[117,1,118,1],[117,2,118,2],[117,3,118,3],[117,59,118,59],[117,60,118,60],[117,61,118,61],[119,7,120,7],[119,8,120,8],[119,54,120,54],[119,55,120,55],[121,1,122,1],[121,2,122,2],[121,3,122,3],[121,22,124,22],[121,23,124,23],[121,27,124,27],[121,28,124,28],[121,31,129,31],[121,34,124,34],[121,35,124,35],[121,39,124,39],[121,40,124,40],[121,59,122,59],[121,60,122,60],[121,61,122,61],[123,12,124,12],[123,13,124,13],[123,49,124,49],[123,50,124,50],[125,1,126,1],[125,2,126,2],[125,3,126,3],[125,59,126,59],[125,60,126,60],[125,61,126,61],[126,22,129,22],[126,23,129,23],[126,27,129,27],[126,28,129,28],[126,34,129,34],[126,35,129,35],[126,39,129,39],[126,40,129,40],[127,7,128,7],[127,8,128,8],[127,54,128,54],[127,55,128,55],[129,1,130,1],[129,2,130,2],[129,3,130,3],[129,59,130,59],[129,60,130,60],[129,61,130,61]]}
[{"$nulls":62}," "]
[]
[]
[null,null,"Primera ronda",{"$nulls":4},"Segunda ronda",{"$nulls":4},"Semifinales regionales",{"$nulls":4},"Finales regionales",{"$nulls":4},"Nacional \nSemifinales",{"$nulls":16},"Nacional \nSemifinales",{"$nulls":4},"Finales regionales",{"$nulls":4},"Semifinales regionales",{"$nulls":4},"Segunda ronda",{"$nulls":4},"Primera ronda"]
[]
[null,1,"Duke",{"$f":"IF(E6>E10,\"G\",\"P\")","v":"G"},{"$f":"VLOOKUP(C6,Estadísticas_Equipo,13,FALSE)","v":{"v":7.464329405038098,"d":"7.46"}},{"$nulls":53},{"$f":"VLOOKUP(BI6,Estadísticas_Equipo,13,FALSE)","v":{"v":7.791762378882311,"d":"7.79"}},{"$f":"IF(BG6>BG10,\"G\",\"P\")","v":"G"},"Virginia",1]
[]
[{"$nulls":7},{"$f":"IF(E6>E10,C6,C10)","v":"Duke"},{"$f":"IF(J8>J16,\"G\",\"P\")","v":"G"},{"$f":"VLOOKUP(H8,Estadísticas_Equipo,13,FALSE)","v":{"v":7.464329405038098,"d":"7.46"}},{"$nulls":43},{"$f":"VLOOKUP(BD8,Estadísticas_Equipo,13,FALSE)","v":{"v":7.791762378882311,"d":"7.79"}},{"$f":"IF(BB8>BB16,\"G\",\"P\")","v":"G"},{"$f":"IF(BG6>BG10,BI6,BI10)","v":"Virginia"}]
[]
[null,16,{"$f":"IF(AH122>AH127,AJ122,AJ127)","v":"N.C. Central"},{"$f":"IF(NOT(E6>E10),\"G\",\"P\")","v":"P"},{"$f":"VLOOKUP(C10,Estadísticas_Equipo,13,FALSE)","v":{"v":2.1991160365164992,"d":"2.20"}},{"$nulls":53},{"$f":"VLOOKUP(BI10,Estadísticas_Equipo,13,FALSE)","v":{"v":3.0594833708749367,"d":"3.06"}},{"$f":"IF(NOT(BG6>BG10),\"G\",\"P\")","v":"P"},"Gardner-Webb",16]
[]
[{"$nulls":12},{"$f":"IF(J8>J16,H8,H16)","v":"Duke"},{"$f":"IF(O12>O28,\"G\",\"P\")","v":"G"},{"$f":"VLOOKUP(M12,Estadísticas_Equipo,13,FALSE)","v":{"v":7.464329405038098,"d":"7.46"}},{"$nulls":33},{"$f":"VLOOKUP(AY12,Estadísticas_Equipo,13,FALSE)","v":{"v":7.791762378882311,"d":"7.79"}},{"$f":"IF(AW12>AW28,\"G\",\"P\")","v":"G"},{"$f":"IF(BB8>BB16,BD8,BD16)","v":"Virginia"}]
[]
[null,8,"VCU",{"$f":"IF(E14>E18,\"G\",\"P\")","v":"G"},{"$f":"VLOOKUP(C14,Estadísticas_Equipo,13,FALSE)","v":{"v":5.522412750227857,"d":"5.52"}},{"$nulls":53},{"$f":"VLOOKUP(BI14,Estadísticas_Equipo,13,FALSE)","v":{"v":4.733604662552707,"d":"4.73"}},{"$f":"IF(BG14>BG18,\"G\",\"P\")","v":"G"},"Ole Miss",8]
[]
[{"$nulls":7},{"$f":"IF(E14>E18,C14,C18)","v":"VCU"},{"$f":"IF(NOT(J8>J16),\"G\",\"P\")","v":"P"},{"$f":"VLOOKUP(H16,Estadísticas_Equipo,13,FALSE)","v":{"v":5.522412750227857,"d":"5.52"}},{"$nulls":43},{"$f":"VLOOKUP(BD16,Estadísticas_Equipo,13,FALSE)","v":{"v":4.733604662552707,"d":"4.73"}},{"$f":"IF(NOT(BB8>BB16),\"G\",\"P\")","v":"P"},{"$f":"IF(BG14>BG18,BI14,BI18)","v":"Ole Miss"}]
[]
[null,9,"UCF",{"$f":"IF(NOT(E14>E18),\"G\",\"P\")","v":"P"},{"$f":"VLOOKUP(C18,Estadísticas_Equipo,13,FALSE)","v":{"v":5.134719377119366,"d":"5.13"}},{"$nulls":53},{"$f":"VLOOKUP(BI18,Estadísticas_Equipo,13,FALSE)","v":{"v":4.252475760855173,"d":"4.25"}},{"$f":"IF(NOT(BG14>BG18),\"G\",\"P\")","v":"P"},"Oklahoma",9]
[]
[{"$nulls":17},{"$f":"IF(O12>O28,M12,M28)","v":"Duke"},{"$f":"IF(T20>T52,\"G\",\"P\")","v":"G"},{"$f":"VLOOKUP(R20,Estadísticas_Equipo,13,FALSE)","v":{"v":7.464329405038098,"d":"7.46"}},{"$nulls":23},{"$f":"VLOOKUP(AT20,Estadísticas_Equipo,13,FALSE)","v":{"v":7.791762378882311,"d":"7.79"}},{"$f":"IF(AR20>AR52,\"G\",\"P\")","v":"G"},{"$f":"IF(AW12>AW28,AY12,AY28)","v":"Virginia"}]
{"$rows_left_out":111}
{"sheet":"Ranking de la NCAA","index":3,"n_rows":358,"n_cols":12,"rows_kept":358}
[{"$nulls":10}," "]
[]
[null,"Hasta partidos del 17 de marzo de 2019"]
[]
[null,"Clasificación","Anterior","Universidad","Conferencia","Récord","Visitante","Neutral","Local","Non Div I",null,"Clasificación"]
[null,1,1,"Virginia","ACC","29-3","10-1","4-1","15-1","0-0",null,{"$f":"+Tabla_Ránking_NCAA[[#This Row],[Clasificación]]","v":1}]
[null,2,2,"Gonzaga","WCC","30-3","9-1","4-2","17-0","0-0",null,{"$f":"+Tabla_Ránking_NCAA[[#This Row],[Clasificación]]","v":2}]
[null,3,3,"Duke","ACC","29-5","7-2","7-1","15-2","0-0",null,{"$f":"+Tabla_Ránking_NCAA[[#This Row],[Clasificación]]","v":3}]
[null,4,4,"Houston","AAC","31-3","11-1","1-1","19-1","0-0",null,{"$f":"+Tabla_Ránking_NCAA[[#This Row],[Clasificación]]","v":4}]
[null,5,5,"Tennessee","SEC","29-5","7-3","4-2","17-0","1-0",null,{"$f":"+Tabla_Ránking_NCAA[[#This Row],[Clasificación]]","v":5}]
[null,6,6,"Kentucky","SEC","27-6","8-2","2-3","17-1","0-0",null,{"$f":"+Tabla_Ránking_NCAA[[#This Row],[Clasificación]]","v":6}]
[null,7,7,"North Carolina","ACC","27-6","11-1","2-3","14-2","0-0",null,{"$f":"+Tabla_Ránking_NCAA[[#This Row],[Clasificación]]","v":7}]
[null,8,8,"Michigan St.","Big Ten","28-6","8-4","5-1","15-1","0-0",null,{"$f":"+Tabla_Ránking_NCAA[[#This Row],[Clasificación]]","v":8}]
[null,9,9,"Michigan","Big Ten","28-6","7-4","4-1","17-1","0-0",null,{"$f":"+Tabla_Ránking_NCAA[[#This Row],[Clasificación]]","v":9}]
[null,10,10,"Texas Tech","Big 12","26-6","6-3","3-2","17-1","0-0",null,{"$f":"+Tabla_Ránking_NCAA[[#This Row],[Clasificación]]","v":10}]
[null,11,11,"Virginia Tech","ACC","24-8","5-5","5-1","14-2","0-0",null,{"$f":"+Tabla_Ránking_NCAA[[#This Row],[Clasificación]]","v":11}]
[null,12,12,"Purdue","Big Ten","23-9","6-6","2-3","15-0","0-0",null,{"$f":"+Tabla_Ránking_NCAA[[#This Row],[Clasificación]]","v":12}]
[null,13,13,"Wofford","SoCon","29-4","11-3","3-0","12-1","3-0",null,{"$f":"+Tabla_Ránking_NCAA[[#This Row],[Clasificación]]","v":13}]
[null,14,14,"LSU","SEC","26-6","9-1","2-3","15-2","0-0",null,{"$f":"+Tabla_Ránking_NCAA[[#This Row],[Clasificación]]","v":14}]
[null,15,15,"Buffalo","MAC","31-3","12-3","5-0","13-0","1-0",null,{"$f":"+Tabla_Ránking_NCAA[[#This Row],[Clasificación]]","v":15}]
{"$rows_left_out":339}
{"sheet":"Anotación de ataque","index":4,"n_rows":356,"n_cols":7,"rows_kept":356}
[{"$nulls":6}," "]
[]
[null,"Hasta partidos del 12 de marzo de 2019"]
[]
[null,"Clasificación","Equipo","Part.","Pts.","PPP"]
[null,1,"Gonzaga",33,{"v":2932,"d":"2,932"},88.8]
[null,2,"Belmont",31,{"v":2710,"d":"2,710"},87.4]
[null,3,"North Carolina",31,{"v":2684,"d":"2,684"},86.6]
[null,4,"The Citadel",30,{"v":2553,"d":"2,553"},85.1]
[null,5,"Buffalo",31,{"v":2634,"d":"2,634"},{"v":85,"d":"85.0"}]
[null,6,"South Dakota St.",32,{"v":2716,"d":"2,716"},84.9]
[null,7,"Duke",31,{"v":2608,"d":"2,608"},84.1]
[null,8,"Hofstra",34,{"v":2841,"d":"2,841"},83.6]
[null,9,"Ga. Southern",31,{"v":2587,"d":"2,587"},83.5]
[null,10,"Lipscomb",32,{"v":2670,"d":"2,670"},83.4]
[null,11,"FIU",31,{"v":2586,"d":"2,586"},83.4]
[null,12,"Winthrop",30,{"v":2499,"d":"2,499"},83.3]
[null,13,"Murray St.",31,{"v":2582,"d":"2,582"},83.3]
[null,14,"Wofford",33,{"v":2739,"d":"2,739"},{"v":83,"d":"83.0"}]
[null,15,"Purdue Fort Wayne",33,{"v":2728,"d":"2,728"},82.7]
{"$rows_left_out":337}
{"sheet":"Anotación de defensa","index":5,"n_rows":356,"n_cols":7,"rows_kept":356}
[{"$nulls":6}," "]
[]
[null,"Partidos hasta el 13 de marzo de 2019"]
[]
[null,"Clasificación","Equipo","Part."," PTS RIVAL"," PPP RIVAL"]
[null,1,"Virginia",30,{"v":1637,"d":"1,637"},54.6]
[null,2,"Texas Tech",31,{"v":1818,"d":"1,818"},58.6]
[null,3,"Michigan",31,{"v":1824,"d":"1,824"},58.8]
[null,4,"Kansas St.",31,{"v":1831,"d":"1,831"},59.1]
[null,5,"Loyola Chicago",33,{"v":1996,"d":"1,996"},60.5]
[null,6,"Liberty",34,{"v":2066,"d":"2,066"},60.8]
[null,7,"VCU",31,{"v":1896,"d":"1,896"},61.2]
[null,8,"Old Dominion",31,{"v":1898,"d":"1,898"},61.2]
[null,"-","Wisconsin",31,{"v":1898,"d":"1,898"},61.2]
[null,10,"Houston",31,{"v":1910,"d":"1,910"},61.6]
[null,11,"Cincinnati",31,{"v":1921,"d":"1,921"},{"v":62,"d":"62.0"}]
[null,12,"Virginia Tech",31,{"v":1922,"d":"1,922"},{"v":62,"d":"62.0"}]
[null,13,"North Texas",32,{"v":2010,"d":"2,010"},62.8]
[null,14,"Manhattan",32,{"v":2011,"d":"2,011"},62.8]
[null,15,"Loyola Marymount",31,{"v":1951,"d":"1,951"},62.9]
{"$rows_left_out":337}
{"sheet":"% de ganados y perdidos","index":6,"n_rows":356,"n_cols":7,"rows_kept":356}
[{"$nulls":6}," "]
[]
[null,"Partidos hasta el 13 de marzo de 2019"]
[]
[null,"Clasificación","Equipo","G","P","PTAJE"]
[null,1,"Houston",29,2,93.5]
[null,2,"Virginia",28,2,93.3]
[null,3,"Gonzaga",30,3,90.9]
[null,4,"Buffalo",28,3,90.3]
[null,"-","Nevada",28,3,90.3]
[null,6,"Wofford",29,4,87.9]
[null,7,"Murray St.",27,4,87.1]
[null,"-","New Mexico St.",27,4,87.1]
[null,"-","Tennessee",27,4,87.1]
[null,10,"UC Irvine",27,5,84.4]
[null,11,"Belmont",26,5,83.9]
[null,"-","Texas Tech",26,5,83.9]
[null,"-","North Carolina",26,5,83.9]
[null,"-","Kentucky",26,5,83.9]
[null,"-","Duke",26,5,83.9]
{"$rows_left_out":336}