{"text_format":"3","workbook":"xlsx","n_sheets":13,"sheets":["1","2","3","4","5","6","7","8","9","10","11","12","Acerca de"],"not_rendered":{"images":1,"defined_names":13},"read":"whole","date_system":"1900"}

{"sheet":"1","index":0,"n_rows":45,"n_cols":30,"rows_kept":45,"merged":[[0,0,6,7],[0,10,0,16],[0,18,0,24],[8,0,8,1],[8,2,8,3],[8,4,8,5],[8,6,8,7],[8,8,8,9],[8,10,8,17],[8,18,8,25],[9,10,9,11],[9,12,9,17],[9,18,9,19],[9,20,9,25],[10,0,10,1],[10,2,10,3],[10,4,10,5],[10,6,10,7],[10,8,10,9],[10,10,10,17],[10,18,10,25],[11,0,11,1],[11,2,11,3],[11,4,11,5],[11,6,11,7],[11,8,11,9],[11,10,11,17],[11,18,11,25],[12,0,12,1],[12,2,12,3],[12,4,12,5],[12,6,12,7],[12,8,12,9],[12,10,12,17],[12,18,12,25],[13,0,13,1],[13,2,13,3],[13,4,13,5],[13,6,13,7],[13,8,13,9],[13,10,13,17],[13,18,13,25],[14,0,14,1],[14,2,14,3],[14,4,14,5],[14,6,14,7],[14,8,14,9],[14,10,14,17],[14,18,14,25],[15,10,15,11],[15,12,15,17],[15,18,15,19],[15,20,15,25],[16,0,16,1],[16,2,16,3],[16,4,16,5],[16,6,16,7],[16,8,16,9],[16,10,16,17],[16,18,16,25],[17,0,17,1],[17,2,17,3],[17,4,17,5],[17,6,17,7],[17,8,17,9],[17,10,17,17],[17,18,17,25],[18,0,18,1],[18,2,18,3],[18,4,18,5],[18,6,18,7],[18,8,18,9],[18,10,18,17],[18,18,18,25],[19,0,19,1],[19,2,19,3],[19,4,19,5],[19,6,19,7],[19,8,19,9],[19,10,19,17],[19,18,19,25],[20,0,20,1],[20,2,20,3],[20,4,20,5],[20,6,20,7],[20,8,20,9],[20,10,20,17],[20,18,20,25],[21,10,21,11],[21,12,21,17],[21,18,21,19],[21,20,21,25],[22,0,22,1],[22,2,22,3],[22,4,22,5],[22,6,22,7],[22,8,22,9],[22,10,22,17],[22,18,22,25],[23,0,23,1],[23,2,23,3],[23,4,23,5],[23,6,23,7],[23,8,23,9],[23,10,23,17],[23,18,23,25],[24,0,24,1],[24,2,24,3],[24,4,24,5],[24,6,24,7],[24,8,24,9],[24,10,24,17],[24,18,24,25],[25,0,25,1],[25,2,25,3],[25,4,25,5],[25,6,25,7],[25,8,25,9],[25,10,25,17],[25,18,25,25],[26,0,26,1],[26,2,26,3],[26,4,26,5],[26,6,26,7],[26,8,26,9],[26,10,26,17],[26,18,26,25],[27,10,27,11],[27,12,27,17],[27,18,27,19],[27,20,27,25],[28,0,28,1],[28,2,28,3],[28,4,28,5],[28,6,28,7],[28,8,28,9],[28,10,28,17],[28,18,28,25],[29,0,29,1],[29,2,29,3],[29,4,29,5],[29,6,29,7],[29,8,29,9],[29,10,29,17],[29,18,29,25],[30,0,30,1],[30,2,30,3],[30,4,30,5],[30,6,30,7],[30,8,30,9],[30,10,30,17],[30,18,30,25],[31,0,31,1],[31,2,31,3],[31,4,31,5],[31,6,31,7],[31,8,31,9],[31,10,31,17],[31,18,31,25],[32,0,32,1],[32,2,32,3],[32,4,32,5],[32,6,32,7],[32,8,32,9],[32,10,32,17],[32,18,32,25],[33,10,33,11],[33,12,33,17],[33,18,33,19],[33,20,33,25],[34,0,34,1],[34,2,34,3],[34,4,34,5],[34,6,34,7],[34,8,34,9],[34,10,34,17],[34,18,34,25],[35,0,35,1],[35,2,35,3],[35,4,35,5],[35,6,35,7],[35,8,35,9],[35,10,35,17],[35,18,35,25],[36,0,36,1],[36,2,36,3],[36,4,36,5],[36,6,36,7],[36,8,36,9],[36,10,36,17],[36,18,36,25],[37,0,37,1],[37,2,37,3],[37,4,37,5],[37,6,37,7],[37,8,37,9],[37,10,37,17],[37,18,37,25],[38,0,38,1],[38,2,38,3],[38,4,38,5],[38,6,38,7],[38,8,38,9],[38,10,38,17],[38,18,38,25],[40,0,40,1],[40,2,40,3],[41,0,41,1],[41,2,41,3],[42,0,42,1],[42,2,42,3],[43,0,43,1],[43,2,43,3],[43,10,43,25],[44,0,44,1],[44,2,44,3],[44,10,44,25]]}
[{"$f":"DATE(AD18,AD20,1)","v":"2019-01-01"},{"$nulls":9},{"$f":"DATE(YEAR(A1),MONTH(A1)-1,1)","v":"2018-12-01"},{"$nulls":7},{"$f":"DATE(YEAR(A1),MONTH(A1)+1,1)","v":"2019-02-01"}]
[{"$nulls":10},{"$f":"INDEX({\"Do\";\"Lu\";\"Ma\";\"Mi\";\"Ju\";\"Vi\";\"Sá\"},1+MOD(Día_inicial+1-2,7))","v":"Do"},{"$f":"INDEX({\"Do\";\"Lu\";\"Ma\";\"Mi\";\"Ju\";\"Vi\";\"Sá\"},1+MOD(Día_inicial+2-2,7))","v":"Lu"},{"$f":"INDEX({\"Do\";\"Lu\";\"Ma\";\"Mi\";\"Ju\";\"Vi\";\"Sá\"},1+MOD(Día_inicial+3-2,7))","v":"Ma"},{"$f":"INDEX({\"Do\";\"Lu\";\"Ma\";\"Mi\";\"Ju\";\"Vi\";\"Sá\"},1+MOD(Día_inicial+4-2,7))","v":"Mi"},{"$f":"INDEX({\"Do\";\"Lu\";\"Ma\";\"Mi\";\"Ju\";\"Vi\";\"Sá\"},1+MOD(Día_inicial+5-2,7))","v":"Ju"},{"$f":"INDEX({\"Do\";\"Lu\";\"Ma\";\"Mi\";\"Ju\";\"Vi\";\"Sá\"},1+MOD(Día_inicial+6-2,7))","v":"Vi"},{"$f":"INDEX({\"Do\";\"Lu\";\"Ma\";\"Mi\";\"Ju\";\"Vi\";\"Sá\"},1+MOD(Día_inicial+7-2,7))","v":"Sá"},null,{"$f":"INDEX({\"Do\";\"Lu\";\"Ma\";\"Mi\";\"Ju\";\"Vi\";\"Sá\"},1+MOD(Día_inicial+1-2,7))","v":"Do"},{"$f":"INDEX({\"Do\";\"Lu\";\"Ma\";\"Mi\";\"Ju\";\"Vi\";\"Sá\"},1+MOD(Día_inicial+2-2,7))","v":"Lu"},{"$f":"INDEX({\"Do\";\"Lu\";\"Ma\";\"Mi\";\"Ju\";\"Vi\";\"Sá\"},1+MOD(Día_inicial+3-2,7))","v":"Ma"},{"$f":"INDEX({\"Do\";\"Lu\";\"Ma\";\"Mi\";\"Ju\";\"Vi\";\"Sá\"},1+MOD(Día_inicial+4-2,7))","v":"Mi"},{"$f":"INDEX({\"Do\";\"Lu\";\"Ma\";\"Mi\";\"Ju\";\"Vi\";\"Sá\"},1+MOD(Día_inicial+5-2,7))","v":"Ju"},{"$f":"INDEX({\"Do\";\"Lu\";\"Ma\";\"Mi\";\"Ju\";\"Vi\";\"Sá\"},1+MOD(Día_inicial+6-2,7))","v":"Vi"},{"$f":"INDEX({\"Do\";\"Lu\";\"Ma\";\"Mi\";\"Ju\";\"Vi\";\"Sá\"},1+MOD(Día_inicial+7-2,7))","v":"Sá"}]
[{"$nulls":10},{"$f":"IF(MONTH($K$1)<>MONTH($K$1-(WEEKDAY($K$1,1)-(Día_inicial-1))-IF((WEEKDAY($K$1,1)-(Día_inicial-1))<=0,7,0)+(ROW(K3)-ROW($K$3))*7+(COLUMN(K3)-COLUMN($K$3)+1)),\"\",$K$1-(WEEKDAY($K$1,1)-(Día_inicial-1))-IF((WEEKDAY($K$1,1)-(Día_inicial-1))<=0,7,0)+(ROW(K3)-ROW($K$3))*7+(COLUMN(K3)-COLUMN($K$3)+1))","v":""},"","","","","","2018-12-01",null,{"$f":"IF(MONTH($S$1)<>MONTH($S$1-(WEEKDAY($S$1,1)-(Día_inicial-1))-IF((WEEKDAY($S$1,1)-(Día_inicial-1))<=0,7,0)+(ROW(S3)-ROW($S$3))*7+(COLUMN(S3)-COLUMN($S$3)+1)),\"\",$S$1-(WEEKDAY($S$1,1)-(Día_inicial-1))-IF((WEEKDAY($S$1,1)-(Día_inicial-1))<=0,7,0)+(ROW(S3)-ROW($S$3))*7+(COLUMN(S3)-COLUMN($S$3)+1))","v":""},"","","","","2019-02-01","2019-02-02"]
[{"$nulls":10},"2018-12-02","2018-12-03","2018-12-04","2018-12-05","2018-12-06","2018-12-07","2018-12-08",null,"2019-02-03","2019-02-04","2019-02-05","2019-02-06","2019-02-07","2019-02-08","2019-02-09"]
[{"$nulls":10},"2018-12-09","2018-12-10","2018-12-11","2018-12-12","2018-12-13","2018-12-14","2018-12-15",null,"2019-02-10","2019-02-11","2019-02-12","2019-02-13","2019-02-14","2019-02-15","2019-02-16"]
[{"$nulls":10},"2018-12-16","2018-12-17","2018-12-18","2018-12-19","2018-12-20","2018-12-21","2018-12-22",null,"2019-02-17","2019-02-18","2019-02-19","2019-02-20","2019-02-21","2019-02-22","2019-02-23"]
[{"$nulls":10},"2018-12-23","2018-12-24","2018-12-25","2018-12-26","2018-12-27","2018-12-28","2018-12-29",null,"2019-02-24","2019-02-25","2019-02-26","2019-02-27","2019-02-28","",""]
[{"$nulls":10},"2018-12-30","2018-12-31","","","","","",null,"","","","","","",""]
[{"$f":"A10","v":"2018-12-30"},null,{"$f":"C10","v":"2018-12-31"},null,{"$f":"E10","v":"2019-01-01"},null,{"$f":"G10","v":"2019-01-02"},null,{"$f":"I10","v":"2019-01-03"},null,{"$f":"K10","v":"2019-01-04"},{"$nulls":7},{"$f":"S10","v":"2019-01-05"},{"$nulls":8},"PLANTILLAS DE CALENDARIO de Vertex42.com"]
[{"$f":"$A$1-(WEEKDAY($A$1,1)-(Día_inicial-1))-IF((WEEKDAY($A$1,1)-(Día_inicial-1))<=0,7,0)+1","v":"2018-12-30"},null,{"$f":"A10+1","v":"2018-12-31"},null,{"$f":"C10+1","v":"2019-01-01"},null,{"$f":"E10+1","v":"2019-01-02"},null,{"$f":"G10+1","v":"2019-01-03"},null,{"$f":"I10+1","v":"2019-01-04"},{"$nulls":7},{"$f":"K10+1","v":"2019-01-05"},{"$nulls":8},"https://www.vertex42.com/calendars/"]
[]
[]
[]
[]
[]
[{"$f":"S10+1","v":"2019-01-06"},null,{"$f":"A16+1","v":"2019-01-07"},null,{"$f":"C16+1","v":"2019-01-08"},null,{"$f":"E16+1","v":"2019-01-09"},null,{"$f":"G16+1","v":"2019-01-10"},null,{"$f":"I16+1","v":"2019-01-11"},{"$nulls":7},{"$f":"K16+1","v":"2019-01-12"},{"$nulls":8},"Paso 1: Escribe el año y el mes de inicio"]
[]
[{"$nulls":28},"Año",2019]
[]
[{"$nulls":28},"Mes de inicio",1]
[]
[{"$f":"S16+1","v":"2019-01-13"},null,{"$f":"A22+1","v":"2019-01-14"},null,{"$f":"C22+1","v":"2019-01-15"},null,{"$f":"E22+1","v":"2019-01-16"},null,{"$f":"G22+1","v":"2019-01-17"},null,{"$f":"I22+1","v":"2019-01-18"},{"$nulls":7},{"$f":"K22+1","v":"2019-01-19"},{"$nulls":8},"Paso 2: Elige el día de inicio"]
[]
[{"$nulls":28},"Día de inicio de la semana",1]
[]
[]
[]
[{"$f":"S22+1","v":"2019-01-20"},null,{"$f":"A28+1","v":"2019-01-21"},null,{"$f":"C28+1","v":"2019-01-22"},null,{"$f":"E28+1","v":"2019-01-23"},null,{"$f":"G28+1","v":"2019-01-24"},null,{"$f":"I28+1","v":"2019-01-25"},{"$nulls":7},{"$f":"K28+1","v":"2019-01-26"},{"$nulls":8},"Paso 3: Personaliza los colores y las fuentes del tema"]
[{"$nulls":28},"Ve a Disposición de página > Temas para"]
[{"$nulls":28},"elegir colores y fuentes distintos."]
[]
[]
[]
[{"$f":"S28+1","v":"2019-01-27"},null,{"$f":"A34+1","v":"2019-01-28"},null,{"$f":"C34+1","v":"2019-01-29"},null,{"$f":"E34+1","v":"2019-01-30"},null,{"$f":"G34+1","v":"2019-01-31"},null,{"$f":"I34+1","v":"2019-02-01"},{"$nulls":7},{"$f":"K34+1","v":"2019-02-02"},{"$nulls":8},"Paso 4: Imprímelo en papel o guárdalo como PDF"]
[{"$nulls":28},"Imprime todo el libro o solo las hojas de "]
[{"$nulls":28},"cálculo seleccionadas."]
[]
[]
[]
[{"$f":"S34+1","v":"2019-02-03"},null,{"$f":"A40+1","v":"2019-02-04"},null,"Notas"]
[]
[]
[]
[{"$nulls":10},"Plantillas de calendario de Vertex42"]
[{"$nulls":10},"https://www.vertex42.com/calendars/"]

{"sheet":"2","index":1,"n_rows":45,"n_cols":25,"rows_kept":45,"merged":[[0,0,6,7],[0,10,0,16],[0,18,0,24],[8,0,8,1],[8,2,8,3],[8,4,8,5],[8,6,8,7],[8,8,8,9],[8,10,8,17],[8,18,8,25],[9,10,9,11],[9,12,9,17],[9,18,9,19],[9,20,9,25],[10,0,10,1],[10,2,10,3],[10,4,10,5],[10,6,10,7],[10,8,10,9],[10,10,10,17],[10,18,10,25],[11,0,11,1],[11,2,11,3],[11,4,11,5],[11,6,11,7],[11,8,11,9],[11,10,11,17],[11,18,11,25],[12,0,12,1],[12,2,12,3],[12,4,12,5],[12,6,12,7],[12,8,12,9],[12,10,12,17],[12,18,12,25],[13,0,13,1],[13,2,13,3],[13,4,13,5],[13,6,13,7],[13,8,13,9],[13,10,13,17],[13,18,13,25],[14,0,14,1],[14,2,14,3],[14,4,14,5],[14,6,14,7],[14,8,14,9],[14,10,14,17],[14,18,14,25],[15,10,15,11],[15,12,15,17],[15,18,15,19],[15,20,15,25],[16,0,16,1],[16,2,16,3],[16,4,16,5],[16,6,16,7],[16,8,16,9],[16,10,16,17],[16,18,16,25],[17,0,17,1],[17,2,17,3],[17,4,17,5],[17,6,17,7],[17,8,17,9],[17,10,17,17],[17,18,17,25],[18,0,18,1],[18,2,18,3],[18,4,18,5],[18,6,18,7],[18,8,18,9],[18,10,18,17],[18,18,18,25],[19,0,19,1],[19,2,19,3],[19,4,19,5],[19,6,19,7],[19,8,19,9],[19,10,19,17],[19,18,19,25],[20,0,20,1],[20,2,20,3],[20,4,20,5],[20,6,20,7],[20,8,20,9],[20,10,20,17],[20,18,20,25],[21,10,21,11],[21,12,21,17],[21,18,21,19],[21,20,21,25],[22,0,22,1],[22,2,22,3],[22,4,22,5],[22,6,22,7],[22,8,22,9],[22,10,22,17],[22,18,22,25],[23,0,23,1],[23,2,23,3],[23,4,23,5],[23,6,23,7],[23,8,23,9],[23,10,23,17],[23,18,23,25],[24,0,24,1],[24,2,24,3],[24,4,24,5],[24,6,24,7],[24,8,24,9],[24,10,24,17],[24,18,24,25],[25,0,25,1],[25,2,25,3],[25,4,25,5],[25,6,25,7],[25,8,25,9],[25,10,25,17],[25,18,25,25],[26,0,26,1],[26,2,26,3],[26,4,26,5],[26,6,26,7],[26,8,26,9],[26,10,26,17],[26,18,26,25],[27,10,27,11],[27,12,27,17],[27,18,27,19],[27,20,27,25],[28,0,28,1],[28,2,28,3],[28,4,28,5],[28,6,28,7],[28,8,28,9],[28,10,28,17],[28,18,28,25],[29,0,29,1],[29,2,29,3],[29,4,29,5],[29,6,29,7],[29,8,29,9],[29,10,29,17],[29,18,29,25],[30,0,30,1],[30,2,30,3],[30,4,30,5],[30,6,30,7],[30,8,30,9],[30,10,30,17],[30,18,30,25],[31,0,31,1],[31,2,31,3],[31,4,31,5],[31,6,31,7],[31,8,31,9],[31,10,31,17],[31,18,31,25],[32,0,32,1],[32,2,32,3],[32,4,32,5],[32,6,32,7],[32,8,32,9],[32,10,32,17],[32,18,32,25],[33,10,33,11],[33,12,33,17],[33,18,33,19],[33,20,33,25],[34,0,34,1],[34,2,34,3],[34,4,34,5],[34,6,34,7],[34,8,34,9],[34,10,34,17],[34,18,34,25],[35,0,35,1],[35,2,35,3],[35,4,35,5],[35,6,35,7],[35,8,35,9],[35,10,35,17],[35,18,35,25],[36,0,36,1],[36,2,36,3],[36,4,36,5],[36,6,36,7],[36,8,36,9],[36,10,36,17],[36,18,36,25],[37,0,37,1],[37,2,37,3],[37,4,37,5],[37,6,37,7],[37,8,37,9],[37,10,37,17],[37,18,37,25],[38,0,38,1],[38,2,38,3],[38,4,38,5],[38,6,38,7],[38,8,38,9],[38,10,38,17],[38,18,38,25],[40,0,40,1],[40,2,40,3],[41,0,41,1],[41,2,41,3],[42,0,42,1],[42,2,42,3],[43,0,43,1],[43,2,43,3],[43,10,43,25],[44,0,44,1],[44,2,44,3],[44,10,44,25]]}
[{"$f":"DATE('1'!AD18,'1'!AD20+1,1)","v":"2019-02-01"},{"$nulls":9},{"$f":"DATE(YEAR(A1),MONTH(A1)-1,1)","v":"2019-01-01"},{"$nulls":7},{"$f":"DATE(YEAR(A1),MONTH(A1)+1,1)","v":"2019-03-01"}]
[{"$nulls":10},{"$f":"INDEX({\"Do\";\"Lu\";\"Ma\";\"Mi\";\"Ju\";\"Vi\";\"Sá\"},1+MOD(Día_inicial+1-2,7))","v":"Do"},{"$f":"INDEX({\"Do\";\"Lu\";\"Ma\";\"Mi\";\"Ju\";\"Vi\";\"Sá\"},1+MOD(Día_inicial+2-2,7))","v":"Lu"},{"$f":"INDEX({\"Do\";\"Lu\";\"Ma\";\"Mi\";\"Ju\";\"Vi\";\"Sá\"},1+MOD(Día_inicial+3-2,7))","v":"Ma"},{"$f":"INDEX({\"Do\";\"Lu\";\"Ma\";\"Mi\";\"Ju\";\"Vi\";\"Sá\"},1+MOD(Día_inicial+4-2,7))","v":"Mi"},{"$f":"INDEX({\"Do\";\"Lu\";\"Ma\";\"Mi\";\"Ju\";\"Vi\";\"Sá\"},1+MOD(Día_inicial+5-2,7))","v":"Ju"},{"$f":"INDEX({\"Do\";\"Lu\";\"Ma\";\"Mi\";\"Ju\";\"Vi\";\"Sá\"},1+MOD(Día_inicial+6-2,7))","v":"Vi"},{"$f":"INDEX({\"Do\";\"Lu\";\"Ma\";\"Mi\";\"Ju\";\"Vi\";\"Sá\"},1+MOD(Día_inicial+7-2,7))","v":"Sá"},null,{"$f":"INDEX({\"Do\";\"Lu\";\"Ma\";\"Mi\";\"Ju\";\"Vi\";\"Sá\"},1+MOD(Día_inicial+1-2,7))","v":"Do"},{"$f":"INDEX({\"Do\";\"Lu\";\"Ma\";\"Mi\";\"Ju\";\"Vi\";\"Sá\"},1+MOD(Día_inicial+2-2,7))","v":"Lu"},{"$f":"INDEX({\"Do\";\"Lu\";\"Ma\";\"Mi\";\"Ju\";\"Vi\";\"Sá\"},1+MOD(Día_inicial+3-2,7))","v":"Ma"},{"$f":"INDEX({\"Do\";\"Lu\";\"Ma\";\"Mi\";\"Ju\";\"Vi\";\"Sá\"},1+MOD(Día_inicial+4-2,7))","v":"Mi"},{"$f":"INDEX({\"Do\";\"Lu\";\"Ma\";\"Mi\";\"Ju\";\"Vi\";\"Sá\"},1+MOD(Día_inicial+5-2,7))","v":"Ju"},{"$f":"INDEX({\"Do\";\"Lu\";\"Ma\";\"Mi\";\"Ju\";\"Vi\";\"Sá\"},1+MOD(Día_inicial+6-2,7))","v":"Vi"},{"$f":"INDEX({\"Do\";\"Lu\";\"Ma\";\"Mi\";\"Ju\";\"Vi\";\"Sá\"},1+MOD(Día_inicial+7-2,7))","v":"Sá"}]
[{"$nulls":10},{"$f":"IF(MONTH($K$1)<>MONTH($K$1-(WEEKDAY($K$1,1)-(Día_inicial-1))-IF((WEEKDAY($K$1,1)-(Día_inicial-1))<=0,7,0)+(ROW(K3)-ROW($K$3))*7+(COLUMN(K3)-COLUMN($K$3)+1)),\"\",$K$1-(WEEKDAY($K$1,1)-(Día_inicial-1))-IF((WEEKDAY($K$1,1)-(Día_inicial-1))<=0,7,0)+(ROW(K3)-ROW($K$3))*7+(COLUMN(K3)-COLUMN($K$3)+1))","v":""},"","2019-01-01","2019-01-02","2019-01-03","2019-01-04","2019-01-05",null,{"$f":"IF(MONTH($S$1)<>MONTH($S$1-(WEEKDAY($S$1,1)-(Día_inicial-1))-IF((WEEKDAY($S$1,1)-(Día_inicial-1))<=0,7,0)+(ROW(S3)-ROW($S$3))*7+(COLUMN(S3)-COLUMN($S$3)+1)),\"\",$S$1-(WEEKDAY($S$1,1)-(Día_inicial-1))-IF((WEEKDAY($S$1,1)-(Día_inicial-1))<=0,7,0)+(ROW(S3)-ROW($S$3))*7+(COLUMN(S3)-COLUMN($S$3)+1))","v":""},"","","","","2019-03-01","2019-03-02"]
[{"$nulls":10},"2019-01-06","2019-01-07","2019-01-08","2019-01-09","2019-01-10","2019-01-11","2019-01-12",null,"2019-03-03","2019-03-04","2019-03-05","2019-03-06","2019-03-07","2019-03-08","2019-03-09"]
[{"$nulls":10},"2019-01-13","2019-01-14","2019-01-15","2019-01-16","2019-01-17","2019-01-18","2019-01-19",null,"2019-03-10","2019-03-11","2019-03-12","2019-03-13","2019-03-14","2019-03-15","2019-03-16"]
[{"$nulls":10},"2019-01-20","2019-01-21","2019-01-22","2019-01-23","2019-01-24","2019-01-25","2019-01-26",null,"2019-03-17","2019-03-18","2019-03-19","2019-03-20","2019-03-21","2019-03-22","2019-03-23"]
[{"$nulls":10},"2019-01-27","2019-01-28","2019-01-29","2019-01-30","2019-01-31","","",null,"2019-03-24","2019-03-25","2019-03-26","2019-03-27","2019-03-28","2019-03-29","2019-03-30"]
[{"$nulls":10},"","","","","","","",null,"2019-03-31","","","","","",""]
[{"$f":"A10","v":"2019-01-27"},null,{"$f":"C10","v":"2019-01-28"},null,{"$f":"E10","v":"2019-01-29"},null,{"$f":"G10","v":"2019-01-30"},null,{"$f":"I10","v":"2019-01-31"},null,{"$f":"K10","v":"2019-02-01"},{"$nulls":7},{"$f":"S10","v":"2019-02-02"}]
[{"$f":"$A$1-(WEEKDAY($A$1,1)-(Día_inicial-1))-IF((WEEKDAY($A$1,1)-(Día_inicial-1))<=0,7,0)+1","v":"2019-01-27"},null,{"$f":"A10+1","v":"2019-01-28"},null,{"$f":"C10+1","v":"2019-01-29"},null,{"$f":"E10+1","v":"2019-01-30"},null,{"$f":"G10+1","v":"2019-01-31"},null,{"$f":"I10+1","v":"2019-02-01"},{"$nulls":7},{"$f":"K10+1","v":"2019-02-02"}]
[]
[]
[]
[]
[]
[{"$f":"S10+1","v":"2019-02-03"},null,{"$f":"A16+1","v":"2019-02-04"},null,{"$f":"C16+1","v":"2019-02-05"},null,{"$f":"E16+1","v":"2019-02-06"},null,{"$f":"G16+1","v":"2019-02-07"},null,{"$f":"I16+1","v":"2019-02-08"},{"$nulls":7},{"$f":"K16+1","v":"2019-02-09"}]
[]
[]
[]
[]
[]
[{"$f":"S16+1","v":"2019-02-10"},null,{"$f":"A22+1","v":"2019-02-11"},null,{"$f":"C22+1","v":"2019-02-12"},null,{"$f":"E22+1","v":"2019-02-13"},null,{"$f":"G22+1","v":"2019-02-14"},null,{"$f":"I22+1","v":"2019-02-15"},{"$nulls":7},{"$f":"K22+1","v":"2019-02-16"}]
[]
[]
[]
[]
[]
[{"$f":"S22+1","v":"2019-02-17"},null,{"$f":"A28+1","v":"2019-02-18"},null,{"$f":"C28+1","v":"2019-02-19"},null,{"$f":"E28+1","v":"2019-02-20"},null,{"$f":"G28+1","v":"2019-02-21"},null,{"$f":"I28+1","v":"2019-02-22"},{"$nulls":7},{"$f":"K28+1","v":"2019-02-23"}]
[]
[]
[]
[]
[]
[{"$f":"S28+1","v":"2019-02-24"},null,{"$f":"A34+1","v":"2019-02-25"},null,{"$f":"C34+1","v":"2019-02-26"},null,{"$f":"E34+1","v":"2019-02-27"},null,{"$f":"G34+1","v":"2019-02-28"},null,{"$f":"I34+1","v":"2019-03-01"},{"$nulls":7},{"$f":"K34+1","v":"2019-03-02"}]
[]
[]
[]
[]
[]
[{"$f":"S34+1","v":"2019-03-03"},null,{"$f":"A40+1","v":"2019-03-04"},null,"Notas"]
[]
[]
[]
[{"$nulls":10},"Plantillas de calendario de Vertex42"]
[{"$nulls":10},"https://www.vertex42.com/calendars/"]

{"sheet":"3","index":2,"n_rows":45,"n_cols":25,"rows_kept":45,"merged":[[0,0,6,7],[0,10,0,16],[0,18,0,24],[8,0,8,1],[8,2,8,3],[8,4,8,5],[8,6,8,7],[8,8,8,9],[8,10,8,17],[8,18,8,25],[9,10,9,11],[9,12,9,17],[9,18,9,19],[9,20,9,25],[10,0,10,1],[10,2,10,3],[10,4,10,5],[10,6,10,7],[10,8,10,9],[10,10,10,17],[10,18,10,25],[11,0,11,1],[11,2,11,3],[11,4,11,5],[11,6,11,7],[11,8,11,9],[11,10,11,17],[11,18,11,25],[12,0,12,1],[12,2,12,3],[12,4,12,5],[12,6,12,7],[12,8,12,9],[12,10,12,17],[12,18,12,25],[13,0,13,1],[13,2,13,3],[13,4,13,5],[13,6,13,7],[13,8,13,9],[13,10,13,17],[13,18,13,25],[14,0,14,1],[14,2,14,3],[14,4,14,5],[14,6,14,7],[14,8,14,9],[14,10,14,17],[14,18,14,25],[15,10,15,11],[15,12,15,17],[15,18,15,19],[15,20,15,25],[16,0,16,1],[16,2,16,3],[16,4,16,5],[16,6,16,7],[16,8,16,9],[16,10,16,17],[16,18,16,25],[17,0,17,1],[17,2,17,3],[17,4,17,5],[17,6,17,7],[17,8,17,9],[17,10,17,17],[17,18,17,25],[18,0,18,1],[18,2,18,3],[18,4,18,5],[18,6,18,7],[18,8,18,9],[18,10,18,17],[18,18,18,25],[19,0,19,1],[19,2,19,3],[19,4,19,5],[19,6,19,7],[19,8,19,9],[19,10,19,17],[19,18,19,25],[20,0,20,1],[20,2,20,3],[20,4,20,5],[20,6,20,7],[20,8,20,9],[20,10,20,17],[20,18,20,25],[21,10,21,11],[21,12,21,17],[21,18,21,19],[21,20,21,25],[22,0,22,1],[22,2,22,3],[22,4,22,5],[22,6,22,7],[22,8,22,9],[22,10,22,17],[22,18,22,25],[23,0,23,1],[23,2,23,3],[23,4,23,5],[23,6,23,7],[23,8,23,9],[23,10,23,17],[23,18,23,25],[24,0,24,1],[24,2,24,3],[24,4,24,5],[24,6,24,7],[24,8,24,9],[24,10,24,17],[24,18,24,25],[25,0,25,1],[25,2,25,3],[25,4,25,5],[25,6,25,7],[25,8,25,9],[25,10,25,17],[25,18,25,25],[26,0,26,1],[26,2,26,3],[26,4,26,5],[26,6,26,7],[26,8,26,9],[26,10,26,17],[26,18,26,25],[27,10,27,11],[27,12,27,17],[27,18,27,19],[27,20,27,25],[28,0,28,1],[28,2,28,3],[28,4,28,5],[28,6,28,7],[28,8,28,9],[28,10,28,17],[28,18,28,25],[29,0,29,1],[29,2,29,3],[29,4,29,5],[29,6,29,7],[29,8,29,9],[29,10,29,17],[29,18,29,25],[30,0,30,1],[30,2,30,3],[30,4,30,5],[30,6,30,7],[30,8,30,9],[30,10,30,17],[30,18,30,25],[31,0,31,1],[31,2,31,3],[31,4,31,5],[31,6,31,7],[31,8,31,9],[31,10,31,17],[31,18,31,25],[32,0,32,1],[32,2,32,3],[32,4,32,5],[32,6,32,7],[32,8,32,9],[32,10,32,17],[32,18,32,25],[33,10,33,11],[33,12,33,17],[33,18,33,19],[33,20,33,25],[34,0,34,1],[34,2,34,3],[34,4,34,5],[34,6,34,7],[34,8,34,9],[34,10,34,17],[34,18,34,25],[35,0,35,1],[35,2,35,3],[35,4,35,5],[35,6,35,7],[35,8,35,9],[35,10,35,17],[35,18,35,25],[36,0,36,1],[36,2,36,3],[36,4,36,5],[36,6,36,7],[36,8,36,9],[36,10,36,17],[36,18,36,25],[37,0,37,1],[37,2,37,3],[37,4,37,5],[37,6,37,7],[37,8,37,9],[37,10,37,17],[37,18,37,25],[38,0,38,1],[38,2,38,3],[38,4,38,5],[38,6,38,7],[38,8,38,9],[38,10,38,17],[38,18,38,25],[40,0,40,1],[40,2,40,3],[41,0,41,1],[41,2,41,3],[42,0,42,1],[42,2,42,3],[43,0,43,1],[43,2,43,3],[43,10,43,25],[44,0,44,1],[44,2,44,3],[44,10,44,25]]}
[{"$f":"DATE('1'!AD18,'1'!AD20+2,1)","v":"2019-03-01"},{"$nulls":9},{"$f":"DATE(YEAR(A1),MONTH(A1)-1,1)","v":"2019-02-01"},{"$nulls":7},{"$f":"DATE(YEAR(A1),MONTH(A1)+1,1)","v":"2019-04-01"}]
[{"$nulls":10},{"$f":"INDEX({\"Do\";\"Lu\";\"Ma\";\"Mi\";\"Ju\";\"Vi\";\"Sá\"},1+MOD(Día_inicial+1-2,7))","v":"Do"},{"$f":"INDEX({\"Do\";\"Lu\";\"Ma\";\"Mi\";\"Ju\";\"Vi\";\"Sá\"},1+MOD(Día_inicial+2-2,7))","v":"Lu"},{"$f":"INDEX({\"Do\";\"Lu\";\"Ma\";\"Mi\";\"Ju\";\"Vi\";\"Sá\"},1+MOD(Día_inicial+3-2,7))","v":"Ma"},{"$f":"INDEX({\"Do\";\"Lu\";\"Ma\";\"Mi\";\"Ju\";\"Vi\";\"Sá\"},1+MOD(Día_inicial+4-2,7))","v":"Mi"},{"$f":"INDEX({\"Do\";\"Lu\";\"Ma\";\"Mi\";\"Ju\";\"Vi\";\"Sá\"},1+MOD(Día_inicial+5-2,7))","v":"Ju"},{"$f":"INDEX({\"Do\";\"Lu\";\"Ma\";\"Mi\";\"Ju\";\"Vi\";\"Sá\"},1+MOD(Día_inicial+6-2,7))","v":"Vi"},{"$f":"INDEX({\"Do\";\"Lu\";\"Ma\";\"Mi\";\"Ju\";\"Vi\";\"Sá\"},1+MOD(Día_inicial+7-2,7))","v":"Sá"},null,{"$f":"INDEX({\"Do\";\"Lu\";\"Ma\";\"Mi\";\"Ju\";\"Vi\";\"Sá\"},1+MOD(Día_inicial+1-2,7))","v":"Do"},{"$f":"INDEX({\"Do\";\"Lu\";\"Ma\";\"Mi\";\"Ju\";\"Vi\";\"Sá\"},1+MOD(Día_inicial+2-2,7))","v":"Lu"},{"$f":"INDEX({\"Do\";\"Lu\";\"Ma\";\"Mi\";\"Ju\";\"Vi\";\"Sá\"},1+MOD(Día_inicial+3-2,7))","v":"Ma"},{"$f":"INDEX({\"Do\";\"Lu\";\"Ma\";\"Mi\";\"Ju\";\"Vi\";\"Sá\"},1+MOD(Día_inicial+4-2,7))","v":"Mi"},{"$f":"INDEX({\"Do\";\"Lu\";\"Ma\";\"Mi\";\"Ju\";\"Vi\";\"Sá\"},1+MOD(Día_inicial+5-2,7))","v":"Ju"},{"$f":"INDEX({\"Do\";\"Lu\";\"Ma\";\"Mi\";\"Ju\";\"Vi\";\"Sá\"},1+MOD(Día_inicial+6-2,7))","v":"Vi"},{"$f":"INDEX({\"Do\";\"Lu\";\"Ma\";\"Mi\";\"Ju\";\"Vi\";\"Sá\"},1+MOD(Día_inicial+7-2,7))","v":"Sá"}]
[{"$nulls":10},{"$f":"IF(MONTH($K$1)<>MONTH($K$1-(WEEKDAY($K$1,1)-(Día_inicial-1))-IF((WEEKDAY($K$1,1)-(Día_inicial-1))<=0,7,0)+(ROW(K3)-ROW($K$3))*7+(COLUMN(K3)-COLUMN($K$3)+1)),\"\",$K$1-(WEEKDAY($K$1,1)-(Día_inicial-1))-IF((WEEKDAY($K$1,1)-(Día_inicial-1))<=0,7,0)+(ROW(K3)-ROW($K$3))*7+(COLUMN(K3)-COLUMN($K$3)+1))","v":""},"","","","","2019-02-01","2019-02-02",null,{"$f":"IF(MONTH($S$1)<>MONTH($S$1-(WEEKDAY($S$1,1)-(Día_inicial-1))-IF((WEEKDAY($S$1,1)-(Día_inicial-1))<=0,7,0)+(ROW(S3)-ROW($S$3))*7+(COLUMN(S3)-COLUMN($S$3)+1)),\"\",$S$1-(WEEKDAY($S$1,1)-(Día_inicial-1))-IF((WEEKDAY($S$1,1)-(Día_inicial-1))<=0,7,0)+(ROW(S3)-ROW($S$3))*7+(COLUMN(S3)-COLUMN($S$3)+1))","v":""},"2019-04-01","2019-04-02","2019-04-03","2019-04-04","2019-04-05","2019-04-06"]
[{"$nulls":10},"2019-02-03","2019-02-04","2019-02-05","2019-02-06","2019-02-07","2019-02-08","2019-02-09",null,"2019-04-07","2019-04-08","2019-04-09","2019-04-10","2019-04-11","2019-04-12","2019-04-13"]
[{"$nulls":10},"2019-02-10","2019-02-11","2019-02-12","2019-02-13","2019-02-14","2019-02-15","2019-02-16",null,"2019-04-14","2019-04-15","2019-04-16","2019-04-17","2019-04-18","2019-04-19","2019-04-20"]
[{"$nulls":10},"2019-02-17","2019-02-18","2019-02-19","2019-02-20","2019-02-21","2019-02-22","2019-02-23",null,"2019-04-21","2019-04-22","2019-04-23","2019-04-24","2019-04-25","2019-04-26","2019-04-27"]
[{"$nulls":10},"2019-02-24","2019-02-25","2019-02-26","2019-02-27","2019-02-28","","",null,"2019-04-28","2019-04-29","2019-04-30","","","",""]
[{"$nulls":10},"","","","","","","",null,"","","","","","",""]
[{"$f":"A10","v":"2019-02-24"},null,{"$f":"C10","v":"2019-02-25"},null,{"$f":"E10","v":"2019-02-26"},null,{"$f":"G10","v":"2019-02-27"},null,{"$f":"I10","v":"2019-02-28"},null,{"$f":"K10","v":"2019-03-01"},{"$nulls":7},{"$f":"S10","v":"2019-03-02"}]
[{"$f":"$A$1-(WEEKDAY($A$1,1)-(Día_inicial-1))-IF((WEEKDAY($A$1,1)-(Día_inicial-1))<=0,7,0)+1","v":"2019-02-24"},null,{"$f":"A10+1","v":"2019-02-25"},null,{"$f":"C10+1","v":"2019-02-26"},null,{"$f":"E10+1","v":"2019-02-27"},null,{"$f":"G10+1","v":"2019-02-28"},null,{"$f":"I10+1","v":"2019-03-01"},{"$nulls":7},{"$f":"K10+1","v":"2019-03-02"}]
[]
[]
[]
[]
[]
[{"$f":"S10+1","v":"2019-03-03"},null,{"$f":"A16+1","v":"2019-03-04"},null,{"$f":"C16+1","v":"2019-03-05"},null,{"$f":"E16+1","v":"2019-03-06"},null,{"$f":"G16+1","v":"2019-03-07"},null,{"$f":"I16+1","v":"2019-03-08"},{"$nulls":7},{"$f":"K16+1","v":"2019-03-09"}]
[]
[]
[]
[]
[]
[{"$f":"S16+1","v":"2019-03-10"},null,{"$f":"A22+1","v":"2019-03-11"},null,{"$f":"C22+1","v":"2019-03-12"},null,{"$f":"E22+1","v":"2019-03-13"},null,{"$f":"G22+1","v":"2019-03-14"},null,{"$f":"I22+1","v":"2019-03-15"},{"$nulls":7},{"$f":"K22+1","v":"2019-03-16"}]
[]
[]
[]
[]
[]
[{"$f":"S22+1","v":"2019-03-17"},null,{"$f":"A28+1","v":"2019-03-18"},null,{"$f":"C28+1","v":"2019-03-19"},null,{"$f":"E28+1","v":"2019-03-20"},null,{"$f":"G28+1","v":"2019-03-21"},null,{"$f":"I28+1","v":"2019-03-22"},{"$nulls":7},{"$f":"K28+1","v":"2019-03-23"}]
[]
[]
[]
[]
[]
[{"$f":"S28+1","v":"2019-03-24"},null,{"$f":"A34+1","v":"2019-03-25"},null,{"$f":"C34+1","v":"2019-03-26"},null,{"$f":"E34+1","v":"2019-03-27"},null,{"$f":"G34+1","v":"2019-03-28"},null,{"$f":"I34+1","v":"2019-03-29"},{"$nulls":7},{"$f":"K34+1","v":"2019-03-30"}]
[]
[]
[]
[]
[]
[{"$f":"S34+1","v":"2019-03-31"},null,{"$f":"A40+1","v":"2019-04-01"},null,"Notas"]
[]
[]
[]
[{"$nulls":10},"Plantillas de calendario de Vertex42"]
[{"$nulls":10},"https://www.vertex42.com/calendars/"]

{"sheet":"4","index":3,"n_rows":45,"n_cols":25,"rows_kept":45,"merged":[[0,0,6,7],[0,10,0,16],[0,18,0,24],[8,0,8,1],[8,2,8,3],[8,4,8,5],[8,6,8,7],[8,8,8,9],[8,10,8,17],[8,18,8,25],[9,10,9,11],[9,12,9,17],[9,18,9,19],[9,20,9,25],[10,0,10,1],[10,2,10,3],[10,4,10,5],[10,6,10,7],[10,8,10,9],[10,10,10,17],[10,18,10,25],[11,0,11,1],[11,2,11,3],[11,4,11,5],[11,6,11,7],[11,8,11,9],[11,10,11,17],[11,18,11,25],[12,0,12,1],[12,2,12,3],[12,4,12,5],[12,6,12,7],[12,8,12,9],[12,10,12,17],[12,18,12,25],[13,0,13,1],[13,2,13,3],[13,4,13,5],[13,6,13,7],[13,8,13,9],[13,10,13,17],[13,18,13,25],[14,0,14,1],[14,2,14,3],[14,4,14,5],[14,6,14,7],[14,8,14,9],[14,10,14,17],[14,18,14,25],[15,10,15,11],[15,12,15,17],[15,18,15,19],[15,20,15,25],[16,0,16,1],[16,2,16,3],[16,4,16,5],[16,6,16,7],[16,8,16,9],[16,10,16,17],[16,18,16,25],[17,0,17,1],[17,2,17,3],[17,4,17,5],[17,6,17,7],[17,8,17,9],[17,10,17,17],[17,18,17,25],[18,0,18,1],[18,2,18,3],[18,4,18,5],[18,6,18,7],[18,8,18,9],[18,10,18,17],[18,18,18,25],[19,0,19,1],[19,2,19,3],[19,4,19,5],[19,6,19,7],[19,8,19,9],[19,10,19,17],[19,18,19,25],[20,0,20,1],[20,2,20,3],[20,4,20,5],[20,6,20,7],[20,8,20,9],[20,10,20,17],[20,18,20,25],[21,10,21,11],[21,12,21,17],[21,18,21,19],[21,20,21,25],[22,0,22,1],[22,2,22,3],[22,4,22,5],[22,6,22,7],[22,8,22,9],[22,10,22,17],[22,18,22,25],[23,0,23,1],[23,2,23,3],[23,4,23,5],[23,6,23,7],[23,8,23,9],[23,10,23,17],[23,18,23,25],[24,0,24,1],[24,2,24,3],[24,4,24,5],[24,6,24,7],[24,8,24,9],[24,10,24,17],[24,18,24,25],[25,0,25,1],[25,2,25,3],[25,4,25,5],[25,6,25,7],[25,8,25,9],[25,10,25,17],[25,18,25,25],[26,0,26,1],[26,2,26,3],[26,4,26,5],[26,6,26,7],[26,8,26,9],[26,10,26,17],[26,18,26,25],[27,10,27,11],[27,12,27,17],[27,18,27,19],[27,20,27,25],[28,0,28,1],[28,2,28,3],[28,4,28,5],[28,6,28,7],[28,8,28,9],[28,10,28,17],[28,18,28,25],[29,0,29,1],[29,2,29,3],[29,4,29,5],[29,6,29,7],[29,8,29,9],[29,10,29,17],[29,18,29,25],[30,0,30,1],[30,2,30,3],[30,4,30,5],[30,6,30,7],[30,8,30,9],[30,10,30,17],[30,18,30,25],[31,0,31,1],[31,2,31,3],[31,4,31,5],[31,6,31,7],[31,8,31,9],[31,10,31,17],[31,18,31,25],[32,0,32,1],[32,2,32,3],[32,4,32,5],[32,6,32,7],[32,8,32,9],[32,10,32,17],[32,18,32,25],[33,10,33,11],[33,12,33,17],[33,18,33,19],[33,20,33,25],[34,0,34,1],[34,2,34,3],[34,4,34,5],[34,6,34,7],[34,8,34,9],[34,10,34,17],[34,18,34,25],[35,0,35,1],[35,2,35,3],[35,4,35,5],[35,6,35,7],[35,8,35,9],[35,10,35,17],[35,18,35,25],[36,0,36,1],[36,2,36,3],[36,4,36,5],[36,6,36,7],[36,8,36,9],[36,10,36,17],[36,18,36,25],[37,0,37,1],[37,2,37,3],[37,4,37,5],[37,6,37,7],[37,8,37,9],[37,10,37,17],[37,18,37,25],[38,0,38,1],[38,2,38,3],[38,4,38,5],[38,6,38,7],[38,8,38,9],[38,10,38,17],[38,18,38,25],[40,0,40,1],[40,2,40,3],[41,0,41,1],[41,2,41,3],[42,0,42,1],[42,2,42,3],[43,0,43,1],[43,2,43,3],[43,10,43,25],[44,0,44,1],[44,2,44,3],[44,10,44,25]]}
[{"$f":"DATE('1'!AD18,'1'!AD20+3,1)","v":"2019-04-01"},{"$nulls":9},{"$f":"DATE(YEAR(A1),MONTH(A1)-1,1)","v":"2019-03-01"},{"$nulls":7},{"$f":"DATE(YEAR(A1),MONTH(A1)+1,1)","v":"2019-05-01"}]
[{"$nulls":10},{"$f":"INDEX({\"Do\";\"Lu\";\"Ma\";\"Mi\";\"Ju\";\"Vi\";\"Sá\"},1+MOD(Día_inicial+1-2,7))","v":"Do"},{"$f":"INDEX({\"Do\";\"Lu\";\"Ma\";\"Mi\";\"Ju\";\"Vi\";\"Sá\"},1+MOD(Día_inicial+2-2,7))","v":"Lu"},{"$f":"INDEX({\"Do\";\"Lu\";\"Ma\";\"Mi\";\"Ju\";\"Vi\";\"Sá\"},1+MOD(Día_inicial+3-2,7))","v":"Ma"},{"$f":"INDEX({\"Do\";\"Lu\";\"Ma\";\"Mi\";\"Ju\";\"Vi\";\"Sá\"},1+MOD(Día_inicial+4-2,7))","v":"Mi"},{"$f":"INDEX({\"Do\";\"Lu\";\"Ma\";\"Mi\";\"Ju\";\"Vi\";\"Sá\"},1+MOD(Día_inicial+5-2,7))","v":"Ju"},{"$f":"INDEX({\"Do\";\"Lu\";\"Ma\";\"Mi\";\"Ju\";\"Vi\";\"Sá\"},1+MOD(Día_inicial+6-2,7))","v":"Vi"},{"$f":"INDEX({\"Do\";\"Lu\";\"Ma\";\"Mi\";\"Ju\";\"Vi\";\"Sá\"},1+MOD(Día_inicial+7-2,7))","v":"Sá"},null,{"$f":"INDEX({\"Do\";\"Lu\";\"Ma\";\"Mi\";\"Ju\";\"Vi\";\"Sá\"},1+MOD(Día_inicial+1-2,7))","v":"Do"},{"$f":"INDEX({\"Do\";\"Lu\";\"Ma\";\"Mi\";\"Ju\";\"Vi\";\"Sá\"},1+MOD(Día_inicial+2-2,7))","v":"Lu"},{"$f":"INDEX({\"Do\";\"Lu\";\"Ma\";\"Mi\";\"Ju\";\"Vi\";\"Sá\"},1+MOD(Día_inicial+3-2,7))","v":"Ma"},{"$f":"INDEX({\"Do\";\"Lu\";\"Ma\";\"Mi\";\"Ju\";\"Vi\";\"Sá\"},1+MOD(Día_inicial+4-2,7))","v":"Mi"},{"$f":"INDEX({\"Do\";\"Lu\";\"Ma\";\"Mi\";\"Ju\";\"Vi\";\"Sá\"},1+MOD(Día_inicial+5-2,7))","v":"Ju"},{"$f":"INDEX({\"Do\";\"Lu\";\"Ma\";\"Mi\";\"Ju\";\"Vi\";\"Sá\"},1+MOD(Día_inicial+6-2,7))","v":"Vi"},{"$f":"INDEX({\"Do\";\"Lu\";\"Ma\";\"Mi\";\"Ju\";\"Vi\";\"Sá\"},1+MOD(Día_inicial+7-2,7))","v":"Sá"}]
[{"$nulls":10},{"$f":"IF(MONTH($K$1)<>MONTH($K$1-(WEEKDAY($K$1,1)-(Día_inicial-1))-IF((WEEKDAY($K$1,1)-(Día_inicial-1))<=0,7,0)+(ROW(K3)-ROW($K$3))*7+(COLUMN(K3)-COLUMN($K$3)+1)),\"\",$K$1-(WEEKDAY($K$1,1)-(Día_inicial-1))-IF((WEEKDAY($K$1,1)-(Día_inicial-1))<=0,7,0)+(ROW(K3)-ROW($K$3))*7+(COLUMN(K3)-COLUMN($K$3)+1))","v":""},"","","","","2019-03-01","2019-03-02",null,{"$f":"IF(MONTH($S$1)<>MONTH($S$1-(WEEKDAY($S$1,1)-(Día_inicial-1))-IF((WEEKDAY($S$1,1)-(Día_inicial-1))<=0,7,0)+(ROW(S3)-ROW($S$3))*7+(COLUMN(S3)-COLUMN($S$3)+1)),\"\",$S$1-(WEEKDAY($S$1,1)-(Día_inicial-1))-IF((WEEKDAY($S$1,1)-(Día_inicial-1))<=0,7,0)+(ROW(S3)-ROW($S$3))*7+(COLUMN(S3)-COLUMN($S$3)+1))","v":""},"","","2019-05-01","2019-05-02","2019-05-03","2019-05-04"]
[{"$nulls":10},"2019-03-03","2019-03-04","2019-03-05","2019-03-06","2019-03-07","2019-03-08","2019-03-09",null,"2019-05-05","2019-05-06","2019-05-07","2019-05-08","2019-05-09","2019-05-10","2019-05-11"]
[{"$nulls":10},"2019-03-10","2019-03-11","2019-03-12","2019-03-13","2019-03-14","2019-03-15","2019-03-16",null,"2019-05-12","2019-05-13","2019-05-14","2019-05-15","2019-05-16","2019-05-17","2019-05-18"]
[{"$nulls":10},"2019-03-17","2019-03-18","2019-03-19","2019-03-20","2019-03-21","2019-03-22","2019-03-23",null,"2019-05-19","2019-05-20","2019-05-21","2019-05-22","2019-05-23","2019-05-24","2019-05-25"]
[{"$nulls":10},"2019-03-24","2019-03-25","2019-03-26","2019-03-27","2019-03-28","2019-03-29","2019-03-30",null,"2019-05-26","2019-05-27","2019-05-28","2019-05-29","2019-05-30","2019-05-31",""]
[{"$nulls":10},"2019-03-31","","","","","","",null,"","","","","","",""]
[{"$f":"A10","v":"2019-03-31"},null,{"$f":"C10","v":"2019-04-01"},null,{"$f":"E10","v":"2019-04-02"},null,{"$f":"G10","v":"2019-04-03"},null,{"$f":"I10","v":"2019-04-04"},null,{"$f":"K10","v":"2019-04-05"},{"$nulls":7},{"$f":"S10","v":"2019-04-06"}]
[{"$f":"$A$1-(WEEKDAY($A$1,1)-(Día_inicial-1))-IF((WEEKDAY($A$1,1)-(Día_inicial-1))<=0,7,0)+1","v":"2019-03-31"},null,{"$f":"A10+1","v":"2019-04-01"},null,{"$f":"C10+1","v":"2019-04-02"},null,{"$f":"E10+1","v":"2019-04-03"},null,{"$f":"G10+1","v":"2019-04-04"},null,{"$f":"I10+1","v":"2019-04-05"},{"$nulls":7},{"$f":"K10+1","v":"2019-04-06"}]
[]
[]
[]
[]
[]
[{"$f":"S10+1","v":"2019-04-07"},null,{"$f":"A16+1","v":"2019-04-08"},null,{"$f":"C16+1","v":"2019-04-09"},null,{"$f":"E16+1","v":"2019-04-10"},null,{"$f":"G16+1","v":"2019-04-11"},null,{"$f":"I16+1","v":"2019-04-12"},{"$nulls":7},{"$f":"K16+1","v":"2019-04-13"}]
[]
[]
[]
[]
[]
[{"$f":"S16+1","v":"2019-04-14"},null,{"$f":"A22+1","v":"2019-04-15"},null,{"$f":"C22+1","v":"2019-04-16"},null,{"$f":"E22+1","v":"2019-04-17"},null,{"$f":"G22+1","v":"2019-04-18"},null,{"$f":"I22+1","v":"2019-04-19"},{"$nulls":7},{"$f":"K22+1","v":"2019-04-20"}]
[]
[]
[]
[]
[]
[{"$f":"S22+1","v":"2019-04-21"},null,{"$f":"A28+1","v":"2019-04-22"},null,{"$f":"C28+1","v":"2019-04-23"},null,{"$f":"E28+1","v":"2019-04-24"},null,{"$f":"G28+1","v":"2019-04-25"},null,{"$f":"I28+1","v":"2019-04-26"},{"$nulls":7},{"$f":"K28+1","v":"2019-04-27"}]
[]
[]
[]
[]
[]
[{"$f":"S28+1","v":"2019-04-28"},null,{"$f":"A34+1","v":"2019-04-29"},null,{"$f":"C34+1","v":"2019-04-30"},null,{"$f":"E34+1","v":"2019-05-01"},null,{"$f":"G34+1","v":"2019-05-02"},null,{"$f":"I34+1","v":"2019-05-03"},{"$nulls":7},{"$f":"K34+1","v":"2019-05-04"}]
[]
[]
[]
[]
[]
[{"$f":"S34+1","v":"2019-05-05"},null,{"$f":"A40+1","v":"2019-05-06"},null,"Notas"]
[]
[]
[]
[{"$nulls":10},"Plantillas de calendario de Vertex42"]
[{"$nulls":10},"https://www.vertex42.com/calendars/"]

{"sheet":"5","index":4,"n_rows":45,"n_cols":25,"rows_kept":45,"merged":[[0,0,6,7],[0,10,0,16],[0,18,0,24],[8,0,8,1],[8,2,8,3],[8,4,8,5],[8,6,8,7],[8,8,8,9],[8,10,8,17],[8,18,8,25],[9,10,9,11],[9,12,9,17],[9,18,9,19],[9,20,9,25],[10,0,10,1],[10,2,10,3],[10,4,10,5],[10,6,10,7],[10,8,10,9],[10,10,10,17],[10,18,10,25],[11,0,11,1],[11,2,11,3],[11,4,11,5],[11,6,11,7],[11,8,11,9],[11,10,11,17],[11,18,11,25],[12,0,12,1],[12,2,12,3],[12,4,12,5],[12,6,12,7],[12,8,12,9],[12,10,12,17],[12,18,12,25],[13,0,13,1],[13,2,13,3],[13,4,13,5],[13,6,13,7],[13,8,13,9],[13,10,13,17],[13,18,13,25],[14,0,14,1],[14,2,14,3],[14,4,14,5],[14,6,14,7],[14,8,14,9],[14,10,14,17],[14,18,14,25],[15,10,15,11],[15,12,15,17],[15,18,15,19],[15,20,15,25],[16,0,16,1],[16,2,16,3],[16,4,16,5],[16,6,16,7],[16,8,16,9],[16,10,16,17],[16,18,16,25],[17,0,17,1],[17,2,17,3],[17,4,17,5],[17,6,17,7],[17,8,17,9],[17,10,17,17],[17,18,17,25],[18,0,18,1],[18,2,18,3],[18,4,18,5],[18,6,18,7],[18,8,18,9],[18,10,18,17],[18,18,18,25],[19,0,19,1],[19,2,19,3],[19,4,19,5],[19,6,19,7],[19,8,19,9],[19,10,19,17],[19,18,19,25],[20,0,20,1],[20,2,20,3],[20,4,20,5],[20,6,20,7],[20,8,20,9],[20,10,20,17],[20,18,20,25],[21,10,21,11],[21,12,21,17],[21,18,21,19],[21,20,21,25],[22,0,22,1],[22,2,22,3],[22,4,22,5],[22,6,22,7],[22,8,22,9],[22,10,22,17],[22,18,22,25],[23,0,23,1],[23,2,23,3],[23,4,23,5],[23,6,23,7],[23,8,23,9],[23,10,23,17],[23,18,23,25],[24,0,24,1],[24,2,24,3],[24,4,24,5],[24,6,24,7],[24,8,24,9],[24,10,24,17],[24,18,24,25],[25,0,25,1],[25,2,25,3],[25,4,25,5],[25,6,25,7],[25,8,25,9],[25,10,25,17],[25,18,25,25],[26,0,26,1],[26,2,26,3],[26,4,26,5],[26,6,26,7],[26,8,26,9],[26,10,26,17],[26,18,26,25],[27,10,27,11],[27,12,27,17],[27,18,27,19],[27,20,27,25],[28,0,28,1],[28,2,28,3],[28,4,28,5],[28,6,28,7],[28,8,28,9],[28,10,28,17],[28,18,28,25],[29,0,29,1],[29,2,29,3],[29,4,29,5],[29,6,29,7],[29,8,29,9],[29,10,29,17],[29,18,29,25],[30,0,30,1],[30,2,30,3],[30,4,30,5],[30,6,30,7],[30,8,30,9],[30,10,30,17],[30,18,30,25],[31,0,31,1],[31,2,31,3],[31,4,31,5],[31,6,31,7],[31,8,31,9],[31,10,31,17],[31,18,31,25],[32,0,32,1],[32,2,32,3],[32,4,32,5],[32,6,32,7],[32,8,32,9],[32,10,32,17],[32,18,32,25],[33,10,33,11],[33,12,33,17],[33,18,33,19],[33,20,33,25],[34,0,34,1],[34,2,34,3],[34,4,34,5],[34,6,34,7],[34,8,34,9],[34,10,34,17],[34,18,34,25],[35,0,35,1],[35,2,35,3],[35,4,35,5],[35,6,35,7],[35,8,35,9],[35,10,35,17],[35,18,35,25],[36,0,36,1],[36,2,36,3],[36,4,36,5],[36,6,36,7],[36,8,36,9],[36,10,36,17],[36,18,36,25],[37,0,37,1],[37,2,37,3],[37,4,37,5],[37,6,37,7],[37,8,37,9],[37,10,37,17],[37,18,37,25],[38,0,38,1],[38,2,38,3],[38,4,38,5],[38,6,38,7],[38,8,38,9],[38,10,38,17],[38,18,38,25],[40,0,40,1],[40,2,40,3],[41,0,41,1],[41,2,41,3],[42,0,42,1],[42,2,42,3],[43,0,43,1],[43,2,43,3],[43,10,43,25],[44,0,44,1],[44,2,44,3],[44,10,44,25]]}
[{"$f":"DATE('1'!AD18,'1'!AD20+4,1)","v":"2019-05-01"},{"$nulls":9},{"$f":"DATE(YEAR(A1),MONTH(A1)-1,1)","v":"2019-04-01"},{"$nulls":7},{"$f":"DATE(YEAR(A1),MONTH(A1)+1,1)","v":"2019-06-01"}]
[{"$nulls":10},{"$f":"INDEX({\"Do\";\"Lu\";\"Ma\";\"Mi\";\"Ju\";\"Vi\";\"Sá\"},1+MOD(Día_inicial+1-2,7))","v":"Do"},{"$f":"INDEX({\"Do\";\"Lu\";\"Ma\";\"Mi\";\"Ju\";\"Vi\";\"Sá\"},1+MOD(Día_inicial+2-2,7))","v":"Lu"},{"$f":"INDEX({\"Do\";\"Lu\";\"Ma\";\"Mi\";\"Ju\";\"Vi\";\"Sá\"},1+MOD(Día_inicial+3-2,7))","v":"Ma"},{"$f":"INDEX({\"Do\";\"Lu\";\"Ma\";\"Mi\";\"Ju\";\"Vi\";\"Sá\"},1+MOD(Día_inicial+4-2,7))","v":"Mi"},{"$f":"INDEX({\"Do\";\"Lu\";\"Ma\";\"Mi\";\"Ju\";\"Vi\";\"Sá\"},1+MOD(Día_inicial+5-2,7))","v":"Ju"},{"$f":"INDEX({\"Do\";\"Lu\";\"Ma\";\"Mi\";\"Ju\";\"Vi\";\"Sá\"},1+MOD(Día_inicial+6-2,7))","v":"Vi"},{"$f":"INDEX({\"Do\";\"Lu\";\"Ma\";\"Mi\";\"Ju\";\"Vi\";\"Sá\"},1+MOD(Día_inicial+7-2,7))","v":"Sá"},null,{"$f":"INDEX({\"Do\";\"Lu\";\"Ma\";\"Mi\";\"Ju\";\"Vi\";\"Sá\"},1+MOD(Día_inicial+1-2,7))","v":"Do"},{"$f":"INDEX({\"Do\";\"Lu\";\"Ma\";\"Mi\";\"Ju\";\"Vi\";\"Sá\"},1+MOD(Día_inicial+2-2,7))","v":"Lu"},{"$f":"INDEX({\"Do\";\"Lu\";\"Ma\";\"Mi\";\"Ju\";\"Vi\";\"Sá\"},1+MOD(Día_inicial+3-2,7))","v":"Ma"},{"$f":"INDEX({\"Do\";\"Lu\";\"Ma\";\"Mi\";\"Ju\";\"Vi\";\"Sá\"},1+MOD(Día_inicial+4-2,7))","v":"Mi"},{"$f":"INDEX({\"Do\";\"Lu\";\"Ma\";\"Mi\";\"Ju\";\"Vi\";\"Sá\"},1+MOD(Día_inicial+5-2,7))","v":"Ju"},{"$f":"INDEX({\"Do\";\"Lu\";\"Ma\";\"Mi\";\"Ju\";\"Vi\";\"Sá\"},1+MOD(Día_inicial+6-2,7))","v":"Vi"},{"$f":"INDEX({\"Do\";\"Lu\";\"Ma\";\"Mi\";\"Ju\";\"Vi\";\"Sá\"},1+MOD(Día_inicial+7-2,7))","v":"Sá"}]
[{"$nulls":10},{"$f":"IF(MONTH($K$1)<>MONTH($K$1-(WEEKDAY($K$1,1)-(Día_inicial-1))-IF((WEEKDAY($K$1,1)-(Día_inicial-1))<=0,7,0)+(ROW(K3)-ROW($K$3))*7+(COLUMN(K3)-COLUMN($K$3)+1)),\"\",$K$1-(WEEKDAY($K$1,1)-(Día_inicial-1))-IF((WEEKDAY($K$1,1)-(Día_inicial-1))<=0,7,0)+(ROW(K3)-ROW($K$3))*7+(COLUMN(K3)-COLUMN($K$3)+1))","v":""},"2019-04-01","2019-04-02","2019-04-03","2019-04-04","2019-04-05","2019-04-06",null,{"$f":"IF(MONTH($S$1)<>MONTH($S$1-(WEEKDAY($S$1,1)-(Día_inicial-1))-IF((WEEKDAY($S$1,1)-(Día_inicial-1))<=0,7,0)+(ROW(S3)-ROW($S$3))*7+(COLUMN(S3)-COLUMN($S$3)+1)),\"\",$S$1-(WEEKDAY($S$1,1)-(Día_inicial-1))-IF((WEEKDAY($S$1,1)-(Día_inicial-1))<=0,7,0)+(ROW(S3)-ROW($S$3))*7+(COLUMN(S3)-COLUMN($S$3)+1))","v":""},"","","","","","2019-06-01"]
[{"$nulls":10},"2019-04-07","2019-04-08","2019-04-09","2019-04-10","2019-04-11","2019-04-12","2019-04-13",null,"2019-06-02","2019-06-03","2019-06-04","2019-06-05","2019-06-06","2019-06-07","2019-06-08"]
[{"$nulls":10},"2019-04-14","2019-04-15","2019-04-16","2019-04-17","2019-04-18","2019-04-19","2019-04-20",null,"2019-06-09","2019-06-10","2019-06-11","2019-06-12","2019-06-13","2019-06-14","2019-06-15"]
[{"$nulls":10},"2019-04-21","2019-04-22","2019-04-23","2019-04-24","2019-04-25","2019-04-26","2019-04-27",null,"2019-06-16","2019-06-17","2019-06-18","2019-06-19","2019-06-20","2019-06-21","2019-06-22"]
[{"$nulls":10},"2019-04-28","2019-04-29","2019-04-30","","","","",null,"2019-06-23","2019-06-24","2019-06-25","2019-06-26","2019-06-27","2019-06-28","2019-06-29"]
[{"$nulls":10},"","","","","","","",null,"2019-06-30","","","","","",""]
[{"$f":"A10","v":"2019-04-28"},null,{"$f":"C10","v":"2019-04-29"},null,{"$f":"E10","v":"2019-04-30"},null,{"$f":"G10","v":"2019-05-01"},null,{"$f":"I10","v":"2019-05-02"},null,{"$f":"K10","v":"2019-05-03"},{"$nulls":7},{"$f":"S10","v":"2019-05-04"}]
[{"$f":"$A$1-(WEEKDAY($A$1,1)-(Día_inicial-1))-IF((WEEKDAY($A$1,1)-(Día_inicial-1))<=0,7,0)+1","v":"2019-04-28"},null,{"$f":"A10+1","v":"2019-04-29"},null,{"$f":"C10+1","v":"2019-04-30"},null,{"$f":"E10+1","v":"2019-05-01"},null,{"$f":"G10+1","v":"2019-05-02"},null,{"$f":"I10+1","v":"2019-05-03"},{"$nulls":7},{"$f":"K10+1","v":"2019-05-04"}]
[]
[]
[]
[]
[]
[{"$f":"S10+1","v":"2019-05-05"},null,{"$f":"A16+1","v":"2019-05-06"},null,{"$f":"C16+1","v":"2019-05-07"},null,{"$f":"E16+1","v":"2019-05-08"},null,{"$f":"G16+1","v":"2019-05-09"},null,{"$f":"I16+1","v":"2019-05-10"},{"$nulls":7},{"$f":"K16+1","v":"2019-05-11"}]
[]
[]
[]
[]
[]
[{"$f":"S16+1","v":"2019-05-12"},null,{"$f":"A22+1","v":"2019-05-13"},null,{"$f":"C22+1","v":"2019-05-14"},null,{"$f":"E22+1","v":"2019-05-15"},null,{"$f":"G22+1","v":"2019-05-16"},null,{"$f":"I22+1","v":"2019-05-17"},{"$nulls":7},{"$f":"K22+1","v":"2019-05-18"}]
[]
[]
[]
[]
[]
[{"$f":"S22+1","v":"2019-05-19"},null,{"$f":"A28+1","v":"2019-05-20"},null,{"$f":"C28+1","v":"2019-05-21"},null,{"$f":"E28+1","v":"2019-05-22"},null,{"$f":"G28+1","v":"2019-05-23"},null,{"$f":"I28+1","v":"2019-05-24"},{"$nulls":7},{"$f":"K28+1","v":"2019-05-25"}]
[]
[]
[]
[]
[]
[{"$f":"S28+1","v":"2019-05-26"},null,{"$f":"A34+1","v":"2019-05-27"},null,{"$f":"C34+1","v":"2019-05-28"},null,{"$f":"E34+1","v":"2019-05-29"},null,{"$f":"G34+1","v":"2019-05-30"},null,{"$f":"I34+1","v":"2019-05-31"},{"$nulls":7},{"$f":"K34+1","v":"2019-06-01"}]
[]
[]
[]
[]
[]
[{"$f":"S34+1","v":"2019-06-02"},null,{"$f":"A40+1","v":"2019-06-03"},null,"Notas"]
[]
[]
[]
[{"$nulls":10},"Plantillas de calendario de Vertex42"]
[{"$nulls":10},"https://www.vertex42.com/calendars/"]

{"sheet":"6","index":5,"n_rows":45,"n_cols":25,"rows_kept":45,"merged":[[0,0,6,7],[0,10,0,16],[0,18,0,24],[8,0,8,1],[8,2,8,3],[8,4,8,5],[8,6,8,7],[8,8,8,9],[8,10,8,17],[8,18,8,25],[9,10,9,11],[9,12,9,17],[9,18,9,19],[9,20,9,25],[10,0,10,1],[10,2,10,3],[10,4,10,5],[10,6,10,7],[10,8,10,9],[10,10,10,17],[10,18,10,25],[11,0,11,1],[11,2,11,3],[11,4,11,5],[11,6,11,7],[11,8,11,9],[11,10,11,17],[11,18,11,25],[12,0,12,1],[12,2,12,3],[12,4,12,5],[12,6,12,7],[12,8,12,9],[12,10,12,17],[12,18,12,25],[13,0,13,1],[13,2,13,3],[13,4,13,5],[13,6,13,7],[13,8,13,9],[13,10,13,17],[13,18,13,25],[14,0,14,1],[14,2,14,3],[14,4,14,5],[14,6,14,7],[14,8,14,9],[14,10,14,17],[14,18,14,25],[15,10,15,11],[15,12,15,17],[15,18,15,19],[15,20,15,25],[16,0,16,1],[16,2,16,3],[16,4,16,5],[16,6,16,7],[16,8,16,9],[16,10,16,17],[16,18,16,25],[17,0,17,1],[17,2,17,3],[17,4,17,5],[17,6,17,7],[17,8,17,9],[17,10,17,17],[17,18,17,25],[18,0,18,1],[18,2,18,3],[18,4,18,5],[18,6,18,7],[18,8,18,9],[18,10,18,17],[18,18,18,25],[19,0,19,1],[19,2,19,3],[19,4,19,5],[19,6,19,7],[19,8,19,9],[19,10,19,17],[19,18,19,25],[20,0,20,1],[20,2,20,3],[20,4,20,5],[20,6,20,7],[20,8,20,9],[20,10,20,17],[20,18,20,25],[21,10,21,11],[21,12,21,17],[21,18,21,19],[21,20,21,25],[22,0,22,1],[22,2,22,3],[22,4,22,5],[22,6,22,7],[22,8,22,9],[22,10,22,17],[22,18,22,25],[23,0,23,1],[23,2,23,3],[23,4,23,5],[23,6,23,7],[23,8,23,9],[23,10,23,17],[23,18,23,25],[24,0,24,1],[24,2,24,3],[24,4,24,5],[24,6,24,7],[24,8,24,9],[24,10,24,17],[24,18,24,25],[25,0,25,1],[25,2,25,3],[25,4,25,5],[25,6,25,7],[25,8,25,9],[25,10,25,17],[25,18,25,25],[26,0,26,1],[26,2,26,3],[26,4,26,5],[26,6,26,7],[26,8,26,9],[26,10,26,17],[26,18,26,25],[27,10,27,11],[27,12,27,17],[27,18,27,19],[27,20,27,25],[28,0,28,1],[28,2,28,3],[28,4,28,5],[28,6,28,7],[28,8,28,9],[28,10,28,17],[28,18,28,25],[29,0,29,1],[29,2,29,3],[29,4,29,5],[29,6,29,7],[29,8,29,9],[29,10,29,17],[29,18,29,25],[30,0,30,1],[30,2,30,3],[30,4,30,5],[30,6,30,7],[30,8,30,9],[30,10,30,17],[30,18,30,25],[31,0,31,1],[31,2,31,3],[31,4,31,5],[31,6,31,7],[31,8,31,9],[31,10,31,17],[31,18,31,25],[32,0,32,1],[32,2,32,3],[32,4,32,5],[32,6,32,7],[32,8,32,9],[32,10,32,17],[32,18,32,25],[33,10,33,11],[33,12,33,17],[33,18,33,19],[33,20,33,25],[34,0,34,1],[34,2,34,3],[34,4,34,5],[34,6,34,7],[34,8,34,9],[34,10,34,17],[34,18,34,25],[35,0,35,1],[35,2,35,3],[35,4,35,5],[35,6,35,7],[35,8,35,9],[35,10,35,17],[35,18,35,25],[36,0,36,1],[36,2,36,3],[36,4,36,5],[36,6,36,7],[36,8,36,9],[36,10,36,17],[36,18,36,25],[37,0,37,1],[37,2,37,3],[37,4,37,5],[37,6,37,7],[37,8,37,9],[37,10,37,17],[37,18,37,25],[38,0,38,1],[38,2,38,3],[38,4,38,5],[38,6,38,7],[38,8,38,9],[38,10,38,17],[38,18,38,25],[40,0,40,1],[40,2,40,3],[41,0,41,1],[41,2,41,3],[42,0,42,1],[42,2,42,3],[43,0,43,1],[43,2,43,3],[43,10,43,25],[44,0,44,1],[44,2,44,3],[44,10,44,25]]}
[{"$f":"DATE('1'!AD18,'1'!AD20+5,1)","v":"2019-06-01"},{"$nulls":9},{"$f":"DATE(YEAR(A1),MONTH(A1)-1,1)","v":"2019-05-01"},{"$nulls":7},{"$f":"DATE(YEAR(A1),MONTH(A1)+1,1)","v":"2019-07-01"}]
[{"$nulls":10},{"$f":"INDEX({\"Do\";\"Lu\";\"Ma\";\"Mi\";\"Ju\";\"Vi\";\"Sá\"},1+MOD(Día_inicial+1-2,7))","v":"Do"},{"$f":"INDEX({\"Do\";\"Lu\";\"Ma\";\"Mi\";\"Ju\";\"Vi\";\"Sá\"},1+MOD(Día_inicial+2-2,7))","v":"Lu"},{"$f":"INDEX({\"Do\";\"Lu\";\"Ma\";\"Mi\";\"Ju\";\"Vi\";\"Sá\"},1+MOD(Día_inicial+3-2,7))","v":"Ma"},{"$f":"INDEX({\"Do\";\"Lu\";\"Ma\";\"Mi\";\"Ju\";\"Vi\";\"Sá\"},1+MOD(Día_inicial+4-2,7))","v":"Mi"},{"$f":"INDEX({\"Do\";\"Lu\";\"Ma\";\"Mi\";\"Ju\";\"Vi\";\"Sá\"},1+MOD(Día_inicial+5-2,7))","v":"Ju"},{"$f":"INDEX({\"Do\";\"Lu\";\"Ma\";\"Mi\";\"Ju\";\"Vi\";\"Sá\"},1+MOD(Día_inicial+6-2,7))","v":"Vi"},{"$f":"INDEX({\"Do\";\"Lu\";\"Ma\";\"Mi\";\"Ju\";\"Vi\";\"Sá\"},1+MOD(Día_inicial+7-2,7))","v":"Sá"},null,{"$f":"INDEX({\"Do\";\"Lu\";\"Ma\";\"Mi\";\"Ju\";\"Vi\";\"Sá\"},1+MOD(Día_inicial+1-2,7))","v":"Do"},{"$f":"INDEX({\"Do\";\"Lu\";\"Ma\";\"Mi\";\"Ju\";\"Vi\";\"Sá\"},1+MOD(Día_inicial+2-2,7))","v":"Lu"},{"$f":"INDEX({\"Do\";\"Lu\";\"Ma\";\"Mi\";\"Ju\";\"Vi\";\"Sá\"},1+MOD(Día_inicial+3-2,7))","v":"Ma"},{"$f":"INDEX({\"Do\";\"Lu\";\"Ma\";\"Mi\";\"Ju\";\"Vi\";\"Sá\"},1+MOD(Día_inicial+4-2,7))","v":"Mi"},{"$f":"INDEX({\"Do\";\"Lu\";\"Ma\";\"Mi\";\"Ju\";\"Vi\";\"Sá\"},1+MOD(Día_inicial+5-2,7))","v":"Ju"},{"$f":"INDEX({\"Do\";\"Lu\";\"Ma\";\"Mi\";\"Ju\";\"Vi\";\"Sá\"},1+MOD(Día_inicial+6-2,7))","v":"Vi"},{"$f":"INDEX({\"Do\";\"Lu\";\"Ma\";\"Mi\";\"Ju\";\"Vi\";\"Sá\"},1+MOD(Día_inicial+7-2,7))","v":"Sá"}]
[{"$nulls":10},{"$f":"IF(MONTH($K$1)<>MONTH($K$1-(WEEKDAY($K$1,1)-(Día_inicial-1))-IF((WEEKDAY($K$1,1)-(Día_inicial-1))<=0,7,0)+(ROW(K3)-ROW($K$3))*7+(COLUMN(K3)-COLUMN($K$3)+1)),\"\",$K$1-(WEEKDAY($K$1,1)-(Día_inicial-1))-IF((WEEKDAY($K$1,1)-(Día_inicial-1))<=0,7,0)+(ROW(K3)-ROW($K$3))*7+(COLUMN(K3)-COLUMN($K$3)+1))","v":""},"","","2019-05-01","2019-05-02","2019-05-03","2019-05-04",null,{"$f":"IF(MONTH($S$1)<>MONTH($S$1-(WEEKDAY($S$1,1)-(Día_inicial-1))-IF((WEEKDAY($S$1,1)-(Día_inicial-1))<=0,7,0)+(ROW(S3)-ROW($S$3))*7+(COLUMN(S3)-COLUMN($S$3)+1)),\"\",$S$1-(WEEKDAY($S$1,1)-(Día_inicial-1))-IF((WEEKDAY($S$1,1)-(Día_inicial-1))<=0,7,0)+(ROW(S3)-ROW($S$3))*7+(COLUMN(S3)-COLUMN($S$3)+1))","v":""},"2019-07-01","2019-07-02","2019-07-03","2019-07-04","2019-07-05","2019-07-06"]
[{"$nulls":10},"2019-05-05","2019-05-06","2019-05-07","2019-05-08","2019-05-09","2019-05-10","2019-05-11",null,"2019-07-07","2019-07-08","2019-07-09","2019-07-10","2019-07-11","2019-07-12","2019-07-13"]
[{"$nulls":10},"2019-05-12","2019-05-13","2019-05-14","2019-05-15","2019-05-16","2019-05-17","2019-05-18",null,"2019-07-14","2019-07-15","2019-07-16","2019-07-17","2019-07-18","2019-07-19","2019-07-20"]
[{"$nulls":10},"2019-05-19","2019-05-20","2019-05-21","2019-05-22","2019-05-23","2019-05-24","2019-05-25",null,"2019-07-21","2019-07-22","2019-07-23","2019-07-24","2019-07-25","2019-07-26","2019-07-27"]
[{"$nulls":10},"2019-05-26","2019-05-27","2019-05-28","2019-05-29","2019-05-30","2019-05-31","",null,"2019-07-28","2019-07-29","2019-07-30","2019-07-31","","",""]
[{"$nulls":10},"","","","","","","",null,"","","","","","",""]
[{"$f":"A10","v":"2019-05-26"},null,{"$f":"C10","v":"2019-05-27"},null,{"$f":"E10","v":"2019-05-28"},null,{"$f":"G10","v":"2019-05-29"},null,{"$f":"I10","v":"2019-05-30"},null,{"$f":"K10","v":"2019-05-31"},{"$nulls":7},{"$f":"S10","v":"2019-06-01"}]
[{"$f":"$A$1-(WEEKDAY($A$1,1)-(Día_inicial-1))-IF((WEEKDAY($A$1,1)-(Día_inicial-1))<=0,7,0)+1","v":"2019-05-26"},null,{"$f":"A10+1","v":"2019-05-27"},null,{"$f":"C10+1","v":"2019-05-28"},null,{"$f":"E10+1","v":"2019-05-29"},null,{"$f":"G10+1","v":"2019-05-30"},null,{"$f":"I10+1","v":"2019-05-31"},{"$nulls":7},{"$f":"K10+1","v":"2019-06-01"}]
[]
[]
[]
[]
[]
[{"$f":"S10+1","v":"2019-06-02"},null,{"$f":"A16+1","v":"2019-06-03"},null,{"$f":"C16+1","v":"2019-06-04"},null,{"$f":"E16+1","v":"2019-06-05"},null,{"$f":"G16+1","v":"2019-06-06"},null,{"$f":"I16+1","v":"2019-06-07"},{"$nulls":7},{"$f":"K16+1","v":"2019-06-08"}]
[]
[]
[]
[]
[]
[{"$f":"S16+1","v":"2019-06-09"},null,{"$f":"A22+1","v":"2019-06-10"},null,{"$f":"C22+1","v":"2019-06-11"},null,{"$f":"E22+1","v":"2019-06-12"},null,{"$f":"G22+1","v":"2019-06-13"},null,{"$f":"I22+1","v":"2019-06-14"},{"$nulls":7},{"$f":"K22+1","v":"2019-06-15"}]
[]
[]
[]
[]
[]
[{"$f":"S22+1","v":"2019-06-16"},null,{"$f":"A28+1","v":"2019-06-17"},null,{"$f":"C28+1","v":"2019-06-18"},null,{"$f":"E28+1","v":"2019-06-19"},null,{"$f":"G28+1","v":"2019-06-20"},null,{"$f":"I28+1","v":"2019-06-21"},{"$nulls":7},{"$f":"K28+1","v":"2019-06-22"}]
[]
[]
[]
[]
[]
[{"$f":"S28+1","v":"2019-06-23"},null,{"$f":"A34+1","v":"2019-06-24"},null,{"$f":"C34+1","v":"2019-06-25"},null,{"$f":"E34+1","v":"2019-06-26"},null,{"$f":"G34+1","v":"2019-06-27"},null,{"$f":"I34+1","v":"2019-06-28"},{"$nulls":7},{"$f":"K34+1","v":"2019-06-29"}]
[]
[]
[]
[]
[]
[{"$f":"S34+1","v":"2019-06-30"},null,{"$f":"A40+1","v":"2019-07-01"},null,"Notas"]
[]
[]
[]
[{"$nulls":10},"Plantillas de calendario de Vertex42"]
[{"$nulls":10},"https://www.vertex42.com/calendars/"]

{"sheet":"7","index":6,"n_rows":45,"n_cols":25,"rows_kept":45,"merged":[[0,0,6,7],[0,10,0,16],[0,18,0,24],[8,0,8,1],[8,2,8,3],[8,4,8,5],[8,6,8,7],[8,8,8,9],[8,10,8,17],[8,18,8,25],[9,10,9,11],[9,12,9,17],[9,18,9,19],[9,20,9,25],[10,0,10,1],[10,2,10,3],[10,4,10,5],[10,6,10,7],[10,8,10,9],[10,10,10,17],[10,18,10,25],[11,0,11,1],[11,2,11,3],[11,4,11,5],[11,6,11,7],[11,8,11,9],[11,10,11,17],[11,18,11,25],[12,0,12,1],[12,2,12,3],[12,4,12,5],[12,6,12,7],[12,8,12,9],[12,10,12,17],[12,18,12,25],[13,0,13,1],[13,2,13,3],[13,4,13,5],[13,6,13,7],[13,8,13,9],[13,10,13,17],[13,18,13,25],[14,0,14,1],[14,2,14,3],[14,4,14,5],[14,6,14,7],[14,8,14,9],[14,10,14,17],[14,18,14,25],[15,10,15,11],[15,12,15,17],[15,18,15,19],[15,20,15,25],[16,0,16,1],[16,2,16,3],[16,4,16,5],[16,6,16,7],[16,8,16,9],[16,10,16,17],[16,18,16,25],[17,0,17,1],[17,2,17,3],[17,4,17,5],[17,6,17,7],[17,8,17,9],[17,10,17,17],[17,18,17,25],[18,0,18,1],[18,2,18,3],[18,4,18,5],[18,6,18,7],[18,8,18,9],[18,10,18,17],[18,18,18,25],[19,0,19,1],[19,2,19,3],[19,4,19,5],[19,6,19,7],[19,8,19,9],[19,10,19,17],[19,18,19,25],[20,0,20,1],[20,2,20,3],[20,4,20,5],[20,6,20,7],[20,8,20,9],[20,10,20,17],[20,18,20,25],[21,10,21,11],[21,12,21,17],[21,18,21,19],[21,20,21,25],[22,0,22,1],[22,2,22,3],[22,4,22,5],[22,6,22,7],[22,8,22,9],[22,10,22,17],[22,18,22,25],[23,0,23,1],[23,2,23,3],[23,4,23,5],[23,6,23,7],[23,8,23,9],[23,10,23,17],[23,18,23,25],[24,0,24,1],[24,2,24,3],[24,4,24,5],[24,6,24,7],[24,8,24,9],[24,10,24,17],[24,18,24,25],[25,0,25,1],[25,2,25,3],[25,4,25,5],[25,6,25,7],[25,8,25,9],[25,10,25,17],[25,18,25,25],[26,0,26,1],[26,2,26,3],[26,4,26,5],[26,6,26,7],[26,8,26,9],[26,10,26,17],[26,18,26,25],[27,10,27,11],[27,12,27,17],[27,18,27,19],[27,20,27,25],[28,0,28,1],[28,2,28,3],[28,4,28,5],[28,6,28,7],[28,8,28,9],[28,10,28,17],[28,18,28,25],[29,0,29,1],[29,2,29,3],[29,4,29,5],[29,6,29,7],[29,8,29,9],[29,10,29,17],[29,18,29,25],[30,0,30,1],[30,2,30,3],[30,4,30,5],[30,6,30,7],[30,8,30,9],[30,10,30,17],[30,18,30,25],[31,0,31,1],[31,2,31,3],[31,4,31,5],[31,6,31,7],[31,8,31,9],[31,10,31,17],[31,18,31,25],[32,0,32,1],[32,2,32,3],[32,4,32,5],[32,6,32,7],[32,8,32,9],[32,10,32,17],[32,18,32,25],[33,10,33,11],[33,12,33,17],[33,18,33,19],[33,20,33,25],[34,0,34,1],[34,2,34,3],[34,4,34,5],[34,6,34,7],[34,8,34,9],[34,10,34,17],[34,18,34,25],[35,0,35,1],[35,2,35,3],[35,4,35,5],[35,6,35,7],[35,8,35,9],[35,10,35,17],[35,18,35,25],[36,0,36,1],[36,2,36,3],[36,4,36,5],[36,6,36,7],[36,8,36,9],[36,10,36,17],[36,18,36,25],[37,0,37,1],[37,2,37,3],[37,4,37,5],[37,6,37,7],[37,8,37,9],[37,10,37,17],[37,18,37,25],[38,0,38,1],[38,2,38,3],[38,4,38,5],[38,6,38,7],[38,8,38,9],[38,10,38,17],[38,18,38,25],[40,0,40,1],[40,2,40,3],[41,0,41,1],[41,2,41,3],[42,0,42,1],[42,2,42,3],[43,0,43,1],[43,2,43,3],[43,10,43,25],[44,0,44,1],[44,2,44,3],[44,10,44,25]]}
[{"$f":"DATE('1'!AD18,'1'!AD20+6,1)","v":"2019-07-01"},{"$nulls":9},{"$f":"DATE(YEAR(A1),MONTH(A1)-1,1)","v":"2019-06-01"},{"$nulls":7},{"$f":"DATE(YEAR(A1),MONTH(A1)+1,1)","v":"2019-08-01"}]
[{"$nulls":10},{"$f":"INDEX({\"Do\";\"Lu\";\"Ma\";\"Mi\";\"Ju\";\"Vi\";\"Sá\"},1+MOD(Día_inicial+1-2,7))","v":"Do"},{"$f":"INDEX({\"Do\";\"Lu\";\"Ma\";\"Mi\";\"Ju\";\"Vi\";\"Sá\"},1+MOD(Día_inicial+2-2,7))","v":"Lu"},{"$f":"INDEX({\"Do\";\"Lu\";\"Ma\";\"Mi\";\"Ju\";\"Vi\";\"Sá\"},1+MOD(Día_inicial+3-2,7))","v":"Ma"},{"$f":"INDEX({\"Do\";\"Lu\";\"Ma\";\"Mi\";\"Ju\";\"Vi\";\"Sá\"},1+MOD(Día_inicial+4-2,7))","v":"Mi"},{"$f":"INDEX({\"Do\";\"Lu\";\"Ma\";\"Mi\";\"Ju\";\"Vi\";\"Sá\"},1+MOD(Día_inicial+5-2,7))","v":"Ju"},{"$f":"INDEX({\"Do\";\"Lu\";\"Ma\";\"Mi\";\"Ju\";\"Vi\";\"Sá\"},1+MOD(Día_inicial+6-2,7))","v":"Vi"},{"$f":"INDEX({\"Do\";\"Lu\";\"Ma\";\"Mi\";\"Ju\";\"Vi\";\"Sá\"},1+MOD(Día_inicial+7-2,7))","v":"Sá"},null,{"$f":"INDEX({\"Do\";\"Lu\";\"Ma\";\"Mi\";\"Ju\";\"Vi\";\"Sá\"},1+MOD(Día_inicial+1-2,7))","v":"Do"},{"$f":"INDEX({\"Do\";\"Lu\";\"Ma\";\"Mi\";\"Ju\";\"Vi\";\"Sá\"},1+MOD(Día_inicial+2-2,7))","v":"Lu"},{"$f":"INDEX({\"Do\";\"Lu\";\"Ma\";\"Mi\";\"Ju\";\"Vi\";\"Sá\"},1+MOD(Día_inicial+3-2,7))","v":"Ma"},{"$f":"INDEX({\"Do\";\"Lu\";\"Ma\";\"Mi\";\"Ju\";\"Vi\";\"Sá\"},1+MOD(Día_inicial+4-2,7))","v":"Mi"},{"$f":"INDEX({\"Do\";\"Lu\";\"Ma\";\"Mi\";\"Ju\";\"Vi\";\"Sá\"},1+MOD(Día_inicial+5-2,7))","v":"Ju"},{"$f":"INDEX({\"Do\";\"Lu\";\"Ma\";\"Mi\";\"Ju\";\"Vi\";\"Sá\"},1+MOD(Día_inicial+6-2,7))","v":"Vi"},{"$f":"INDEX({\"Do\";\"Lu\";\"Ma\";\"Mi\";\"Ju\";\"Vi\";\"Sá\"},1+MOD(Día_inicial+7-2,7))","v":"Sá"}]
[{"$nulls":10},{"$f":"IF(MONTH($K$1)<>MONTH($K$1-(WEEKDAY($K$1,1)-(Día_inicial-1))-IF((WEEKDAY($K$1,1)-(Día_inicial-1))<=0,7,0)+(ROW(K3)-ROW($K$3))*7+(COLUMN(K3)-COLUMN($K$3)+1)),\"\",$K$1-(WEEKDAY($K$1,1)-(Día_inicial-1))-IF((WEEKDAY($K$1,1)-(Día_inicial-1))<=0,7,0)+(ROW(K3)-ROW($K$3))*7+(COLUMN(K3)-COLUMN($K$3)+1))","v":""},"","","","","","2019-06-01",null,{"$f":"IF(MONTH($S$1)<>MONTH($S$1-(WEEKDAY($S$1,1)-(Día_inicial-1))-IF((WEEKDAY($S$1,1)-(Día_inicial-1))<=0,7,0)+(ROW(S3)-ROW($S$3))*7+(COLUMN(S3)-COLUMN($S$3)+1)),\"\",$S$1-(WEEKDAY($S$1,1)-(Día_inicial-1))-IF((WEEKDAY($S$1,1)-(Día_inicial-1))<=0,7,0)+(ROW(S3)-ROW($S$3))*7+(COLUMN(S3)-COLUMN($S$3)+1))","v":""},"","","","2019-08-01","2019-08-02","2019-08-03"]
[{"$nulls":10},"2019-06-02","2019-06-03","2019-06-04","2019-06-05","2019-06-06","2019-06-07","2019-06-08",null,"2019-08-04","2019-08-05","2019-08-06","2019-08-07","2019-08-08","2019-08-09","2019-08-10"]
[{"$nulls":10},"2019-06-09","2019-06-10","2019-06-11","2019-06-12","2019-06-13","2019-06-14","2019-06-15",null,"2019-08-11","2019-08-12","2019-08-13","2019-08-14","2019-08-15","2019-08-16","2019-08-17"]
[{"$nulls":10},"2019-06-16","2019-06-17","2019-06-18","2019-06-19","2019-06-20","2019-06-21","2019-06-22",null,"2019-08-18","2019-08-19","2019-08-20","2019-08-21","2019-08-22","2019-08-23","2019-08-24"]
[{"$nulls":10},"2019-06-23","2019-06-24","2019-06-25","2019-06-26","2019-06-27","2019-06-28","2019-06-29",null,"2019-08-25","2019-08-26","2019-08-27","2019-08-28","2019-08-29","2019-08-30","2019-08-31"]
[{"$nulls":10},"2019-06-30","","","","","","",null,"","","","","","",""]
[{"$f":"A10","v":"2019-06-30"},null,{"$f":"C10","v":"2019-07-01"},null,{"$f":"E10","v":"2019-07-02"},null,{"$f":"G10","v":"2019-07-03"},null,{"$f":"I10","v":"2019-07-04"},null,{"$f":"K10","v":"2019-07-05"},{"$nulls":7},{"$f":"S10","v":"2019-07-06"}]
[{"$f":"$A$1-(WEEKDAY($A$1,1)-(Día_inicial-1))-IF((WEEKDAY($A$1,1)-(Día_inicial-1))<=0,7,0)+1","v":"2019-06-30"},null,{"$f":"A10+1","v":"2019-07-01"},null,{"$f":"C10+1","v":"2019-07-02"},null,{"$f":"E10+1","v":"2019-07-03"},null,{"$f":"G10+1","v":"2019-07-04"},null,{"$f":"I10+1","v":"2019-07-05"},{"$nulls":7},{"$f":"K10+1","v":"2019-07-06"}]
[]
[]
[]
[]
[]
[{"$f":"S10+1","v":"2019-07-07"},null,{"$f":"A16+1","v":"2019-07-08"},null,{"$f":"C16+1","v":"2019-07-09"},null,{"$f":"E16+1","v":"2019-07-10"},null,{"$f":"G16+1","v":"2019-07-11"},null,{"$f":"I16+1","v":"2019-07-12"},{"$nulls":7},{"$f":"K16+1","v":"2019-07-13"}]
[]
[]
[]
[]
[]
[{"$f":"S16+1","v":"2019-07-14"},null,{"$f":"A22+1","v":"2019-07-15"},null,{"$f":"C22+1","v":"2019-07-16"},null,{"$f":"E22+1","v":"2019-07-17"},null,{"$f":"G22+1","v":"2019-07-18"},null,{"$f":"I22+1","v":"2019-07-19"},{"$nulls":7},{"$f":"K22+1","v":"2019-07-20"}]
[]
[]
[]
[]
[]
[{"$f":"S22+1","v":"2019-07-21"},null,{"$f":"A28+1","v":"2019-07-22"},null,{"$f":"C28+1","v":"2019-07-23"},null,{"$f":"E28+1","v":"2019-07-24"},null,{"$f":"G28+1","v":"2019-07-25"},null,{"$f":"I28+1","v":"2019-07-26"},{"$nulls":7},{"$f":"K28+1","v":"2019-07-27"}]
[]
[]
[]
[]
[]
[{"$f":"S28+1","v":"2019-07-28"},null,{"$f":"A34+1","v":"2019-07-29"},null,{"$f":"C34+1","v":"2019-07-30"},null,{"$f":"E34+1","v":"2019-07-31"},null,{"$f":"G34+1","v":"2019-08-01"},null,{"$f":"I34+1","v":"2019-08-02"},{"$nulls":7},{"$f":"K34+1","v":"2019-08-03"}]
[]
[]
[]
[]
[]
[{"$f":"S34+1","v":"2019-08-04"},null,{"$f":"A40+1","v":"2019-08-05"},null,"Notas"]
[]
[]
[]
[{"$nulls":10},"Plantillas de calendario de Vertex42"]
[{"$nulls":10},"https://www.vertex42.com/calendars/"]

{"sheet":"8","index":7,"n_rows":45,"n_cols":25,"rows_kept":45,"merged":[[0,0,6,7],[0,10,0,16],[0,18,0,24],[8,0,8,1],[8,2,8,3],[8,4,8,5],[8,6,8,7],[8,8,8,9],[8,10,8,17],[8,18,8,25],[9,10,9,11],[9,12,9,17],[9,18,9,19],[9,20,9,25],[10,0,10,1],[10,2,10,3],[10,4,10,5],[10,6,10,7],[10,8,10,9],[10,10,10,17],[10,18,10,25],[11,0,11,1],[11,2,11,3],[11,4,11,5],[11,6,11,7],[11,8,11,9],[11,10,11,17],[11,18,11,25],[12,0,12,1],[12,2,12,3],[12,4,12,5],[12,6,12,7],[12,8,12,9],[12,10,12,17],[12,18,12,25],[13,0,13,1],[13,2,13,3],[13,4,13,5],[13,6,13,7],[13,8,13,9],[13,10,13,17],[13,18,13,25],[14,0,14,1],[14,2,14,3],[14,4,14,5],[14,6,14,7],[14,8,14,9],[14,10,14,17],[14,18,14,25],[15,10,15,11],[15,12,15,17],[15,18,15,19],[15,20,15,25],[16,0,16,1],[16,2,16,3],[16,4,16,5],[16,6,16,7],[16,8,16,9],[16,10,16,17],[16,18,16,25],[17,0,17,1],[17,2,17,3],[17,4,17,5],[17,6,17,7],[17,8,17,9],[17,10,17,17],[17,18,17,25],[18,0,18,1],[18,2,18,3],[18,4,18,5],[18,6,18,7],[18,8,18,9],[18,10,18,17],[18,18,18,25],[19,0,19,1],[19,2,19,3],[19,4,19,5],[19,6,19,7],[19,8,19,9],[19,10,19,17],[19,18,19,25],[20,0,20,1],[20,2,20,3],[20,4,20,5],[20,6,20,7],[20,8,20,9],[20,10,20,17],[20,18,20,25],[21,10,21,11],[21,12,21,17],[21,18,21,19],[21,20,21,25],[22,0,22,1],[22,2,22,3],[22,4,22,5],[22,6,22,7],[22,8,22,9],[22,10,22,17],[22,18,22,25],[23,0,23,1],[23,2,23,3],[23,4,23,5],[23,6,23,7],[23,8,23,9],[23,10,23,17],[23,18,23,25],[24,0,24,1],[24,2,24,3],[24,4,24,5],[24,6,24,7],[24,8,24,9],[24,10,24,17],[24,18,24,25],[25,0,25,1],[25,2,25,3],[25,4,25,5],[25,6,25,7],[25,8,25,9],[25,10,25,17],[25,18,25,25],[26,0,26,1],[26,2,26,3],[26,4,26,5],[26,6,26,7],[26,8,26,9],[26,10,26,17],[26,18,26,25],[27,10,27,11],[27,12,27,17],[27,18,27,19],[27,20,27,25],[28,0,28,1],[28,2,28,3],[28,4,28,5],[28,6,28,7],[28,8,28,9],[28,10,28,17],[28,18,28,25],[29,0,29,1],[29,2,29,3],[29,4,29,5],[29,6,29,7],[29,8,29,9],[29,10,29,17],[29,18,29,25],[30,0,30,1],[30,2,30,3],[30,4,30,5],[30,6,30,7],[30,8,30,9],[30,10,30,17],[30,18,30,25],[31,0,31,1],[31,2,31,3],[31,4,31,5],[31,6,31,7],[31,8,31,9],[31,10,31,17],[31,18,31,25],[32,0,32,1],[32,2,32,3],[32,4,32,5],[32,6,32,7],[32,8,32,9],[32,10,32,17],[32,18,32,25],[33,10,33,11],[33,12,33,17],[33,18,33,19],[33,20,33,25],[34,0,34,1],[34,2,34,3],[34,4,34,5],[34,6,34,7],[34,8,34,9],[34,10,34,17],[34,18,34,25],[35,0,35,1],[35,2,35,3],[35,4,35,5],[35,6,35,7],[35,8,35,9],[35,10,35,17],[35,18,35,25],[36,0,36,1],[36,2,36,3],[36,4,36,5],[36,6,36,7],[36,8,36,9],[36,10,36,17],[36,18,36,25],[37,0,37,1],[37,2,37,3],[37,4,37,5],[37,6,37,7],[37,8,37,9],[37,10,37,17],[37,18,37,25],[38,0,38,1],[38,2,38,3],[38,4,38,5],[38,6,38,7],[38,8,38,9],[38,10,38,17],[38,18,38,25],[40,0,40,1],[40,2,40,3],[41,0,41,1],[41,2,41,3],[42,0,42,1],[42,2,42,3],[43,0,43,1],[43,2,43,3],[43,10,43,25],[44,0,44,1],[44,2,44,3],[44,10,44,25]]}
[{"$f":"DATE('1'!AD18,'1'!AD20+7,1)","v":"2019-08-01"},{"$nulls":9},{"$f":"DATE(YEAR(A1),MONTH(A1)-1,1)","v":"2019-07-01"},{"$nulls":7},{"$f":"DATE(YEAR(A1),MONTH(A1)+1,1)","v":"2019-09-01"}]
[{"$nulls":10},{"$f":"INDEX({\"Do\";\"Lu\";\"Ma\";\"Mi\";\"Ju\";\"Vi\";\"Sá\"},1+MOD(Día_inicial+1-2,7))","v":"Do"},{"$f":"INDEX({\"Do\";\"Lu\";\"Ma\";\"Mi\";\"Ju\";\"Vi\";\"Sá\"},1+MOD(Día_inicial+2-2,7))","v":"Lu"},{"$f":"INDEX({\"Do\";\"Lu\";\"Ma\";\"Mi\";\"Ju\";\"Vi\";\"Sá\"},1+MOD(Día_inicial+3-2,7))","v":"Ma"},{"$f":"INDEX({\"Do\";\"Lu\";\"Ma\";\"Mi\";\"Ju\";\"Vi\";\"Sá\"},1+MOD(Día_inicial+4-2,7))","v":"Mi"},{"$f":"INDEX({\"Do\";\"Lu\";\"Ma\";\"Mi\";\"Ju\";\"Vi\";\"Sá\"},1+MOD(Día_inicial+5-2,7))","v":"Ju"},{"$f":"INDEX({\"Do\";\"Lu\";\"Ma\";\"Mi\";\"Ju\";\"Vi\";\"Sá\"},1+MOD(Día_inicial+6-2,7))","v":"Vi"},{"$f":"INDEX({\"Do\";\"Lu\";\"Ma\";\"Mi\";\"Ju\";\"Vi\";\"Sá\"},1+MOD(Día_inicial+7-2,7))","v":"Sá"},null,{"$f":"INDEX({\"Do\";\"Lu\";\"Ma\";\"Mi\";\"Ju\";\"Vi\";\"Sá\"},1+MOD(Día_inicial+1-2,7))","v":"Do"},{"$f":"INDEX({\"Do\";\"Lu\";\"Ma\";\"Mi\";\"Ju\";\"Vi\";\"Sá\"},1+MOD(Día_inicial+2-2,7))","v":"Lu"},{"$f":"INDEX({\"Do\";\"Lu\";\"Ma\";\"Mi\";\"Ju\";\"Vi\";\"Sá\"},1+MOD(Día_inicial+3-2,7))","v":"Ma"},{"$f":"INDEX({\"Do\";\"Lu\";\"Ma\";\"Mi\";\"Ju\";\"Vi\";\"Sá\"},1+MOD(Día_inicial+4-2,7))","v":"Mi"},{"$f":"INDEX({\"Do\";\"Lu\";\"Ma\";\"Mi\";\"Ju\";\"Vi\";\"Sá\"},1+MOD(Día_inicial+5-2,7))","v":"Ju"},{"$f":"INDEX({\"Do\";\"Lu\";\"Ma\";\"Mi\";\"Ju\";\"Vi\";\"Sá\"},1+MOD(Día_inicial+6-2,7))","v":"Vi"},{"$f":"INDEX({\"Do\";\"Lu\";\"Ma\";\"Mi\";\"Ju\";\"Vi\";\"Sá\"},1+MOD(Día_inicial+7-2,7))","v":"Sá"}]
[{"$nulls":10},{"$f":"IF(MONTH($K$1)<>MONTH($K$1-(WEEKDAY($K$1,1)-(Día_inicial-1))-IF((WEEKDAY($K$1,1)-(Día_inicial-1))<=0,7,0)+(ROW(K3)-ROW($K$3))*7+(COLUMN(K3)-COLUMN($K$3)+1)),\"\",$K$1-(WEEKDAY($K$1,1)-(Día_inicial-1))-IF((WEEKDAY($K$1,1)-(Día_inicial-1))<=0,7,0)+(ROW(K3)-ROW($K$3))*7+(COLUMN(K3)-COLUMN($K$3)+1))","v":""},"2019-07-01","2019-07-02","2019-07-03","2019-07-04","2019-07-05","2019-07-06",null,{"$f":"IF(MONTH($S$1)<>MONTH($S$1-(WEEKDAY($S$1,1)-(Día_inicial-1))-IF((WEEKDAY($S$1,1)-(Día_inicial-1))<=0,7,0)+(ROW(S3)-ROW($S$3))*7+(COLUMN(S3)-COLUMN($S$3)+1)),\"\",$S$1-(WEEKDAY($S$1,1)-(Día_inicial-1))-IF((WEEKDAY($S$1,1)-(Día_inicial-1))<=0,7,0)+(ROW(S3)-ROW($S$3))*7+(COLUMN(S3)-COLUMN($S$3)+1))","v":"2019-09-01"},"2019-09-02","2019-09-03","2019-09-04","2019-09-05","2019-09-06","2019-09-07"]
[{"$nulls":10},"2019-07-07","2019-07-08","2019-07-09","2019-07-10","2019-07-11","2019-07-12","2019-07-13",null,"2019-09-08","2019-09-09","2019-09-10","2019-09-11","2019-09-12","2019-09-13","2019-09-14"]
[{"$nulls":10},"2019-07-14","2019-07-15","2019-07-16","2019-07-17","2019-07-18","2019-07-19","2019-07-20",null,"2019-09-15","2019-09-16","2019-09-17","2019-09-18","2019-09-19","2019-09-20","2019-09-21"]
[{"$nulls":10},"2019-07-21","2019-07-22","2019-07-23","2019-07-24","2019-07-25","2019-07-26","2019-07-27",null,"2019-09-22","2019-09-23","2019-09-24","2019-09-25","2019-09-26","2019-09-27","2019-09-28"]
[{"$nulls":10},"2019-07-28","2019-07-29","2019-07-30","2019-07-31","","","",null,"2019-09-29","2019-09-30","","","","",""]
[{"$nulls":10},"","","","","","","",null,"","","","","","",""]
[{"$f":"A10","v":"2019-07-28"},null,{"$f":"C10","v":"2019-07-29"},null,{"$f":"E10","v":"2019-07-30"},null,{"$f":"G10","v":"2019-07-31"},null,{"$f":"I10","v":"2019-08-01"},null,{"$f":"K10","v":"2019-08-02"},{"$nulls":7},{"$f":"S10","v":"2019-08-03"}]
[{"$f":"$A$1-(WEEKDAY($A$1,1)-(Día_inicial-1))-IF((WEEKDAY($A$1,1)-(Día_inicial-1))<=0,7,0)+1","v":"2019-07-28"},null,{"$f":"A10+1","v":"2019-07-29"},null,{"$f":"C10+1","v":"2019-07-30"},null,{"$f":"E10+1","v":"2019-07-31"},null,{"$f":"G10+1","v":"2019-08-01"},null,{"$f":"I10+1","v":"2019-08-02"},{"$nulls":7},{"$f":"K10+1","v":"2019-08-03"}]
[]
[]
[]
[]
[]
[{"$f":"S10+1","v":"2019-08-04"},null,{"$f":"A16+1","v":"2019-08-05"},null,{"$f":"C16+1","v":"2019-08-06"},null,{"$f":"E16+1","v":"2019-08-07"},null,{"$f":"G16+1","v":"2019-08-08"},null,{"$f":"I16+1","v":"2019-08-09"},{"$nulls":7},{"$f":"K16+1","v":"2019-08-10"}]
[]
[]
[]
[]
[]
[{"$f":"S16+1","v":"2019-08-11"},null,{"$f":"A22+1","v":"2019-08-12"},null,{"$f":"C22+1","v":"2019-08-13"},null,{"$f":"E22+1","v":"2019-08-14"},null,{"$f":"G22+1","v":"2019-08-15"},null,{"$f":"I22+1","v":"2019-08-16"},{"$nulls":7},{"$f":"K22+1","v":"2019-08-17"}]
[]
[]
[]
[]
[]
[{"$f":"S22+1","v":"2019-08-18"},null,{"$f":"A28+1","v":"2019-08-19"},null,{"$f":"C28+1","v":"2019-08-20"},null,{"$f":"E28+1","v":"2019-08-21"},null,{"$f":"G28+1","v":"2019-08-22"},null,{"$f":"I28+1","v":"2019-08-23"},{"$nulls":7},{"$f":"K28+1","v":"2019-08-24"}]
[]
[]
[]
[]
[]
[{"$f":"S28+1","v":"2019-08-25"},null,{"$f":"A34+1","v":"2019-08-26"},null,{"$f":"C34+1","v":"2019-08-27"},null,{"$f":"E34+1","v":"2019-08-28"},null,{"$f":"G34+1","v":"2019-08-29"},null,{"$f":"I34+1","v":"2019-08-30"},{"$nulls":7},{"$f":"K34+1","v":"2019-08-31"}]
[]
[]
[]
[]
[]
[{"$f":"S34+1","v":"2019-09-01"},null,{"$f":"A40+1","v":"2019-09-02"},null,"Notas"]
[]
[]
[]
[{"$nulls":10},"Plantillas de calendario de Vertex42"]
[{"$nulls":10},"https://www.vertex42.com/calendars/"]

{"sheet":"9","index":8,"n_rows":45,"n_cols":25,"rows_kept":45,"merged":[[0,0,6,7],[0,10,0,16],[0,18,0,24],[8,0,8,1],[8,2,8,3],[8,4,8,5],[8,6,8,7],[8,8,8,9],[8,10,8,17],[8,18,8,25],[9,10,9,11],[9,12,9,17],[9,18,9,19],[9,20,9,25],[10,0,10,1],[10,2,10,3],[10,4,10,5],[10,6,10,7],[10,8,10,9],[10,10,10,17],[10,18,10,25],[11,0,11,1],[11,2,11,3],[11,4,11,5],[11,6,11,7],[11,8,11,9],[11,10,11,17],[11,18,11,25],[12,0,12,1],[12,2,12,3],[12,4,12,5],[12,6,12,7],[12,8,12,9],[12,10,12,17],[12,18,12,25],[13,0,13,1],[13,2,13,3],[13,4,13,5],[13,6,13,7],[13,8,13,9],[13,10,13,17],[13,18,13,25],[14,0,14,1],[14,2,14,3],[14,4,14,5],[14,6,14,7],[14,8,14,9],[14,10,14,17],[14,18,14,25],[15,10,15,11],[15,12,15,17],[15,18,15,19],[15,20,15,25],[16,0,16,1],[16,2,16,3],[16,4,16,5],[16,6,16,7],[16,8,16,9],[16,10,16,17],[16,18,16,25],[17,0,17,1],[17,2,17,3],[17,4,17,5],[17,6,17,7],[17,8,17,9],[17,10,17,17],[17,18,17,25],[18,0,18,1],[18,2,18,3],[18,4,18,5],[18,6,18,7],[18,8,18,9],[18,10,18,17],[18,18,18,25],[19,0,19,1],[19,2,19,3],[19,4,19,5],[19,6,19,7],[19,8,19,9],[19,10,19,17],[19,18,19,25],[20,0,20,1],[20,2,20,3],[20,4,20,5],[20,6,20,7],[20,8,20,9],[20,10,20,17],[20,18,20,25],[21,10,21,11],[21,12,21,17],[21,18,21,19],[21,20,21,25],[22,0,22,1],[22,2,22,3],[22,4,22,5],[22,6,22,7],[22,8,22,9],[22,10,22,17],[22,18,22,25],[23,0,23,1],[23,2,23,3],[23,4,23,5],[23,6,23,7],[23,8,23,9],[23,10,23,17],[23,18,23,25],[24,0,24,1],[24,2,24,3],[24,4,24,5],[24,6,24,7],[24,8,24,9],[24,10,24,17],[24,18,24,25],[25,0,25,1],[25,2,25,3],[25,4,25,5],[25,6,25,7],[25,8,25,9],[25,10,25,17],[25,18,25,25],[26,0,26,1],[26,2,26,3],[26,4,26,5],[26,6,26,7],[26,8,26,9],[26,10,26,17],[26,18,26,25],[27,10,27,11],[27,12,27,17],[27,18,27,19],[27,20,27,25],[28,0,28,1],[28,2,28,3],[28,4,28,5],[28,6,28,7],[28,8,28,9],[28,10,28,17],[28,18,28,25],[29,0,29,1],[29,2,29,3],[29,4,29,5],[29,6,29,7],[29,8,29,9],[29,10,29,17],[29,18,29,25],[30,0,30,1],[30,2,30,3],[30,4,30,5],[30,6,30,7],[30,8,30,9],[30,10,30,17],[30,18,30,25],[31,0,31,1],[31,2,31,3],[31,4,31,5],[31,6,31,7],[31,8,31,9],[31,10,31,17],[31,18,31,25],[32,0,32,1],[32,2,32,3],[32,4,32,5],[32,6,32,7],[32,8,32,9],[32,10,32,17],[32,18,32,25],[33,10,33,11],[33,12,33,17],[33,18,33,19],[33,20,33,25],[34,0,34,1],[34,2,34,3],[34,4,34,5],[34,6,34,7],[34,8,34,9],[34,10,34,17],[34,18,34,25],[35,0,35,1],[35,2,35,3],[35,4,35,5],[35,6,35,7],[35,8,35,9],[35,10,35,17],[35,18,35,25],[36,0,36,1],[36,2,36,3],[36,4,36,5],[36,6,36,7],[36,8,36,9],[36,10,36,17],[36,18,36,25],[37,0,37,1],[37,2,37,3],[37,4,37,5],[37,6,37,7],[37,8,37,9],[37,10,37,17],[37,18,37,25],[38,0,38,1],[38,2,38,3],[38,4,38,5],[38,6,38,7],[38,8,38,9],[38,10,38,17],[38,18,38,25],[40,0,40,1],[40,2,40,3],[41,0,41,1],[41,2,41,3],[42,0,42,1],[42,2,42,3],[43,0,43,1],[43,2,43,3],[43,10,43,25],[44,0,44,1],[44,2,44,3],[44,10,44,25]]}
[{"$f":"DATE('1'!AD18,'1'!AD20+8,1)","v":"2019-09-01"},{"$nulls":9},{"$f":"DATE(YEAR(A1),MONTH(A1)-1,1)","v":"2019-08-01"},{"$nulls":7},{"$f":"DATE(YEAR(A1),MONTH(A1)+1,1)","v":"2019-10-01"}]
[{"$nulls":10},{"$f":"INDEX({\"Do\";\"Lu\";\"Ma\";\"Mi\";\"Ju\";\"Vi\";\"Sá\"},1+MOD(Día_inicial+1-2,7))","v":"Do"},{"$f":"INDEX({\"Do\";\"Lu\";\"Ma\";\"Mi\";\"Ju\";\"Vi\";\"Sá\"},1+MOD(Día_inicial+2-2,7))","v":"Lu"},{"$f":"INDEX({\"Do\";\"Lu\";\"Ma\";\"Mi\";\"Ju\";\"Vi\";\"Sá\"},1+MOD(Día_inicial+3-2,7))","v":"Ma"},{"$f":"INDEX({\"Do\";\"Lu\";\"Ma\";\"Mi\";\"Ju\";\"Vi\";\"Sá\"},1+MOD(Día_inicial+4-2,7))","v":"Mi"},{"$f":"INDEX({\"Do\";\"Lu\";\"Ma\";\"Mi\";\"Ju\";\"Vi\";\"Sá\"},1+MOD(Día_inicial+5-2,7))","v":"Ju"},{"$f":"INDEX({\"Do\";\"Lu\";\"Ma\";\"Mi\";\"Ju\";\"Vi\";\"Sá\"},1+MOD(Día_inicial+6-2,7))","v":"Vi"},{"$f":"INDEX({\"Do\";\"Lu\";\"Ma\";\"Mi\";\"Ju\";\"Vi\";\"Sá\"},1+MOD(Día_inicial+7-2,7))","v":"Sá"},null,{"$f":"INDEX({\"Do\";\"Lu\";\"Ma\";\"Mi\";\"Ju\";\"Vi\";\"Sá\"},1+MOD(Día_inicial+1-2,7))","v":"Do"},{"$f":"INDEX({\"Do\";\"Lu\";\"Ma\";\"Mi\";\"Ju\";\"Vi\";\"Sá\"},1+MOD(Día_inicial+2-2,7))","v":"Lu"},{"$f":"INDEX({\"Do\";\"Lu\";\"Ma\";\"Mi\";\"Ju\";\"Vi\";\"Sá\"},1+MOD(Día_inicial+3-2,7))","v":"Ma"},{"$f":"INDEX({\"Do\";\"Lu\";\"Ma\";\"Mi\";\"Ju\";\"Vi\";\"Sá\"},1+MOD(Día_inicial+4-2,7))","v":"Mi"},{"$f":"INDEX({\"Do\";\"Lu\";\"Ma\";\"Mi\";\"Ju\";\"Vi\";\"Sá\"},1+MOD(Día_inicial+5-2,7))","v":"Ju"},{"$f":"INDEX({\"Do\";\"Lu\";\"Ma\";\"Mi\";\"Ju\";\"Vi\";\"Sá\"},1+MOD(Día_inicial+6-2,7))","v":"Vi"},{"$f":"INDEX({\"Do\";\"Lu\";\"Ma\";\"Mi\";\"Ju\";\"Vi\";\"Sá\"},1+MOD(Día_inicial+7-2,7))","v":"Sá"}]
[{"$nulls":10},{"$f":"IF(MONTH($K$1)<>MONTH($K$1-(WEEKDAY($K$1,1)-(Día_inicial-1))-IF((WEEKDAY($K$1,1)-(Día_inicial-1))<=0,7,0)+(ROW(K3)-ROW($K$3))*7+(COLUMN(K3)-COLUMN($K$3)+1)),\"\",$K$1-(WEEKDAY($K$1,1)-(Día_inicial-1))-IF((WEEKDAY($K$1,1)-(Día_inicial-1))<=0,7,0)+(ROW(K3)-ROW($K$3))*7+(COLUMN(K3)-COLUMN($K$3)+1))","v":""},"","","","2019-08-01","2019-08-02","2019-08-03",null,{"$f":"IF(MONTH($S$1)<>MONTH($S$1-(WEEKDAY($S$1,1)-(Día_inicial-1))-IF((WEEKDAY($S$1,1)-(Día_inicial-1))<=0,7,0)+(ROW(S3)-ROW($S$3))*7+(COLUMN(S3)-COLUMN($S$3)+1)),\"\",$S$1-(WEEKDAY($S$1,1)-(Día_inicial-1))-IF((WEEKDAY($S$1,1)-(Día_inicial-1))<=0,7,0)+(ROW(S3)-ROW($S$3))*7+(COLUMN(S3)-COLUMN($S$3)+1))","v":""},"","2019-10-01","2019-10-02","2019-10-03","2019-10-04","2019-10-05"]
[{"$nulls":10},"2019-08-04","2019-08-05","2019-08-06","2019-08-07","2019-08-08","2019-08-09","2019-08-10",null,"2019-10-06","2019-10-07","2019-10-08","2019-10-09","2019-10-10","2019-10-11","2019-10-12"]
[{"$nulls":10},"2019-08-11","2019-08-12","2019-08-13","2019-08-14","2019-08-15","2019-08-16","2019-08-17",null,"2019-10-13","2019-10-14","2019-10-15","2019-10-16","2019-10-17","2019-10-18","2019-10-19"]
[{"$nulls":10},"2019-08-18","2019-08-19","2019-08-20","2019-08-21","2019-08-22","2019-08-23","2019-08-24",null,"2019-10-20","2019-10-21","2019-10-22","2019-10-23","2019-10-24","2019-10-25","2019-10-26"]
[{"$nulls":10},"2019-08-25","2019-08-26","2019-08-27","2019-08-28","2019-08-29","2019-08-30","2019-08-31",null,"2019-10-27","2019-10-28","2019-10-29","2019-10-30","2019-10-31","",""]
[{"$nulls":10},"","","","","","","",null,"","","","","","",""]
[{"$f":"A10","v":"2019-09-01"},null,{"$f":"C10","v":"2019-09-02"},null,{"$f":"E10","v":"2019-09-03"},null,{"$f":"G10","v":"2019-09-04"},null,{"$f":"I10","v":"2019-09-05"},null,{"$f":"K10","v":"2019-09-06"},{"$nulls":7},{"$f":"S10","v":"2019-09-07"}]
[{"$f":"$A$1-(WEEKDAY($A$1,1)-(Día_inicial-1))-IF((WEEKDAY($A$1,1)-(Día_inicial-1))<=0,7,0)+1","v":"2019-09-01"},null,{"$f":"A10+1","v":"2019-09-02"},null,{"$f":"C10+1","v":"2019-09-03"},null,{"$f":"E10+1","v":"2019-09-04"},null,{"$f":"G10+1","v":"2019-09-05"},null,{"$f":"I10+1","v":"2019-09-06"},{"$nulls":7},{"$f":"K10+1","v":"2019-09-07"}]
[]
[]
[]
[]
[]
[{"$f":"S10+1","v":"2019-09-08"},null,{"$f":"A16+1","v":"2019-09-09"},null,{"$f":"C16+1","v":"2019-09-10"},null,{"$f":"E16+1","v":"2019-09-11"},null,{"$f":"G16+1","v":"2019-09-12"},null,{"$f":"I16+1","v":"2019-09-13"},{"$nulls":7},{"$f":"K16+1","v":"2019-09-14"}]
[]
[]
[]
[]
[]
[{"$f":"S16+1","v":"2019-09-15"},null,{"$f":"A22+1","v":"2019-09-16"},null,{"$f":"C22+1","v":"2019-09-17"},null,{"$f":"E22+1","v":"2019-09-18"},null,{"$f":"G22+1","v":"2019-09-19"},null,{"$f":"I22+1","v":"2019-09-20"},{"$nulls":7},{"$f":"K22+1","v":"2019-09-21"}]
[]
[]
[]
[]
[]
[{"$f":"S22+1","v":"2019-09-22"},null,{"$f":"A28+1","v":"2019-09-23"},null,{"$f":"C28+1","v":"2019-09-24"},null,{"$f":"E28+1","v":"2019-09-25"},null,{"$f":"G28+1","v":"2019-09-26"},null,{"$f":"I28+1","v":"2019-09-27"},{"$nulls":7},{"$f":"K28+1","v":"2019-09-28"}]
[]
[]
[]
[]
[]
[{"$f":"S28+1","v":"2019-09-29"},null,{"$f":"A34+1","v":"2019-09-30"},null,{"$f":"C34+1","v":"2019-10-01"},null,{"$f":"E34+1","v":"2019-10-02"},null,{"$f":"G34+1","v":"2019-10-03"},null,{"$f":"I34+1","v":"2019-10-04"},{"$nulls":7},{"$f":"K34+1","v":"2019-10-05"}]
[]
[]
[]
[]
[]
[{"$f":"S34+1","v":"2019-10-06"},null,{"$f":"A40+1","v":"2019-10-07"},null,"Notas"]
[]
[]
[]
[{"$nulls":10},"Plantillas de calendario de Vertex42"]
[{"$nulls":10},"https://www.vertex42.com/calendars/"]

{"sheet":"10","index":9,"n_rows":45,"n_cols":25,"rows_kept":45,"merged":[[0,0,6,7],[0,10,0,16],[0,18,0,24],[8,0,8,1],[8,2,8,3],[8,4,8,5],[8,6,8,7],[8,8,8,9],[8,10,8,17],[8,18,8,25],[9,10,9,11],[9,12,9,17],[9,18,9,19],[9,20,9,25],[10,0,10,1],[10,2,10,3],[10,4,10,5],[10,6,10,7],[10,8,10,9],[10,10,10,17],[10,18,10,25],[11,0,11,1],[11,2,11,3],[11,4,11,5],[11,6,11,7],[11,8,11,9],[11,10,11,17],[11,18,11,25],[12,0,12,1],[12,2,12,3],[12,4,12,5],[12,6,12,7],[12,8,12,9],[12,10,12,17],[12,18,12,25],[13,0,13,1],[13,2,13,3],[13,4,13,5],[13,6,13,7],[13,8,13,9],[13,10,13,17],[13,18,13,25],[14,0,14,1],[14,2,14,3],[14,4,14,5],[14,6,14,7],[14,8,14,9],[14,10,14,17],[14,18,14,25],[15,10,15,11],[15,12,15,17],[15,18,15,19],[15,20,15,25],[16,0,16,1],[16,2,16,3],[16,4,16,5],[16,6,16,7],[16,8,16,9],[16,10,16,17],[16,18,16,25],[17,0,17,1],[17,2,17,3],[17,4,17,5],[17,6,17,7],[17,8,17,9],[17,10,17,17],[17,18,17,25],[18,0,18,1],[18,2,18,3],[18,4,18,5],[18,6,18,7],[18,8,18,9],[18,10,18,17],[18,18,18,25],[19,0,19,1],[19,2,19,3],[19,4,19,5],[19,6,19,7],[19,8,19,9],[19,10,19,17],[19,18,19,25],[20,0,20,1],[20,2,20,3],[20,4,20,5],[20,6,20,7],[20,8,20,9],[20,10,20,17],[20,18,20,25],[21,10,21,11],[21,12,21,17],[21,18,21,19],[21,20,21,25],[22,0,22,1],[22,2,22,3],[22,4,22,5],[22,6,22,7],[22,8,22,9],[22,10,22,17],[22,18,22,25],[23,0,23,1],[23,2,23,3],[23,4,23,5],[23,6,23,7],[23,8,23,9],[23,10,23,17],[23,18,23,25],[24,0,24,1],[24,2,24,3],[24,4,24,5],[24,6,24,7],[24,8,24,9],[24,10,24,17],[24,18,24,25],[25,0,25,1],[25,2,25,3],[25,4,25,5],[25,6,25,7],[25,8,25,9],[25,10,25,17],[25,18,25,25],[26,0,26,1],[26,2,26,3],[26,4,26,5],[26,6,26,7],[26,8,26,9],[26,10,26,17],[26,18,26,25],[27,10,27,11],[27,12,27,17],[27,18,27,19],[27,20,27,25],[28,0,28,1],[28,2,28,3],[28,4,28,5],[28,6,28,7],[28,8,28,9],[28,10,28,17],[28,18,28,25],[29,0,29,1],[29,2,29,3],[29,4,29,5],[29,6,29,7],[29,8,29,9],[29,10,29,17],[29,18,29,25],[30,0,30,1],[30,2,30,3],[30,4,30,5],[30,6,30,7],[30,8,30,9],[30,10,30,17],[30,18,30,25],[31,0,31,1],[31,2,31,3],[31,4,31,5],[31,6,31,7],[31,8,31,9],[31,10,31,17],[31,18,31,25],[32,0,32,1],[32,2,32,3],[32,4,32,5],[32,6,32,7],[32,8,32,9],[32,10,32,17],[32,18,32,25],[33,10,33,11],[33,12,33,17],[33,18,33,19],[33,20,33,25],[34,0,34,1],[34,2,34,3],[34,4,34,5],[34,6,34,7],[34,8,34,9],[34,10,34,17],[34,18,34,25],[35,0,35,1],[35,2,35,3],[35,4,35,5],[35,6,35,7],[35,8,35,9],[35,10,35,17],[35,18,35,25],[36,0,36,1],[36,2,36,3],[36,4,36,5],[36,6,36,7],[36,8,36,9],[36,10,36,17],[36,18,36,25],[37,0,37,1],[37,2,37,3],[37,4,37,5],[37,6,37,7],[37,8,37,9],[37,10,37,17],[37,18,37,25],[38,0,38,1],[38,2,38,3],[38,4,38,5],[38,6,38,7],[38,8,38,9],[38,10,38,17],[38,18,38,25],[40,0,40,1],[40,2,40,3],[41,0,41,1],[41,2,41,3],[42,0,42,1],[42,2,42,3],[43,0,43,1],[43,2,43,3],[43,10,43,25],[44,0,44,1],[44,2,44,3],[44,10,44,25]]}
[{"$f":"DATE('1'!AD18,'1'!AD20+9,1)","v":"2019-10-01"},{"$nulls":9},{"$f":"DATE(YEAR(A1),MONTH(A1)-1,1)","v":"2019-09-01"},{"$nulls":7},{"$f":"DATE(YEAR(A1),MONTH(A1)+1,1)","v":"2019-11-01"}]
[{"$nulls":10},{"$f":"INDEX({\"Do\";\"Lu\";\"Ma\";\"Mi\";\"Ju\";\"Vi\";\"Sá\"},1+MOD(Día_inicial+1-2,7))","v":"Do"},{"$f":"INDEX({\"Do\";\"Lu\";\"Ma\";\"Mi\";\"Ju\";\"Vi\";\"Sá\"},1+MOD(Día_inicial+2-2,7))","v":"Lu"},{"$f":"INDEX({\"Do\";\"Lu\";\"Ma\";\"Mi\";\"Ju\";\"Vi\";\"Sá\"},1+MOD(Día_inicial+3-2,7))","v":"Ma"},{"$f":"INDEX({\"Do\";\"Lu\";\"Ma\";\"Mi\";\"Ju\";\"Vi\";\"Sá\"},1+MOD(Día_inicial+4-2,7))","v":"Mi"},{"$f":"INDEX({\"Do\";\"Lu\";\"Ma\";\"Mi\";\"Ju\";\"Vi\";\"Sá\"},1+MOD(Día_inicial+5-2,7))","v":"Ju"},{"$f":"INDEX({\"Do\";\"Lu\";\"Ma\";\"Mi\";\"Ju\";\"Vi\";\"Sá\"},1+MOD(Día_inicial+6-2,7))","v":"Vi"},{"$f":"INDEX({\"Do\";\"Lu\";\"Ma\";\"Mi\";\"Ju\";\"Vi\";\"Sá\"},1+MOD(Día_inicial+7-2,7))","v":"Sá"},null,{"$f":"INDEX({\"Do\";\"Lu\";\"Ma\";\"Mi\";\"Ju\";\"Vi\";\"Sá\"},1+MOD(Día_inicial+1-2,7))","v":"Do"},{"$f":"INDEX({\"Do\";\"Lu\";\"Ma\";\"Mi\";\"Ju\";\"Vi\";\"Sá\"},1+MOD(Día_inicial+2-2,7))","v":"Lu"},{"$f":"INDEX({\"Do\";\"Lu\";\"Ma\";\"Mi\";\"Ju\";\"Vi\";\"Sá\"},1+MOD(Día_inicial+3-2,7))","v":"Ma"},{"$f":"INDEX({\"Do\";\"Lu\";\"Ma\";\"Mi\";\"Ju\";\"Vi\";\"Sá\"},1+MOD(Día_inicial+4-2,7))","v":"Mi"},{"$f":"INDEX({\"Do\";\"Lu\";\"Ma\";\"Mi\";\"Ju\";\"Vi\";\"Sá\"},1+MOD(Día_inicial+5-2,7))","v":"Ju"},{"$f":"INDEX({\"Do\";\"Lu\";\"Ma\";\"Mi\";\"Ju\";\"Vi\";\"Sá\"},1+MOD(Día_inicial+6-2,7))","v":"Vi"},{"$f":"INDEX({\"Do\";\"Lu\";\"Ma\";\"Mi\";\"Ju\";\"Vi\";\"Sá\"},1+MOD(Día_inicial+7-2,7))","v":"Sá"}]
[{"$nulls":10},{"$f":"IF(MONTH($K$1)<>MONTH($K$1-(WEEKDAY($K$1,1)-(Día_inicial-1))-IF((WEEKDAY($K$1,1)-(Día_inicial-1))<=0,7,0)+(ROW(K3)-ROW($K$3))*7+(COLUMN(K3)-COLUMN($K$3)+1)),\"\",$K$1-(WEEKDAY($K$1,1)-(Día_inicial-1))-IF((WEEKDAY($K$1,1)-(Día_inicial-1))<=0,7,0)+(ROW(K3)-ROW($K$3))*7+(COLUMN(K3)-COLUMN($K$3)+1))","v":"2019-09-01"},"2019-09-02","2019-09-03","2019-09-04","2019-09-05","2019-09-06","2019-09-07",null,{"$f":"IF(MONTH($S$1)<>MONTH($S$1-(WEEKDAY($S$1,1)-(Día_inicial-1))-IF((WEEKDAY($S$1,1)-(Día_inicial-1))<=0,7,0)+(ROW(S3)-ROW($S$3))*7+(COLUMN(S3)-COLUMN($S$3)+1)),\"\",$S$1-(WEEKDAY($S$1,1)-(Día_inicial-1))-IF((WEEKDAY($S$1,1)-(Día_inicial-1))<=0,7,0)+(ROW(S3)-ROW($S$3))*7+(COLUMN(S3)-COLUMN($S$3)+1))","v":""},"","","","","2019-11-01","2019-11-02"]
[{"$nulls":10},"2019-09-08","2019-09-09","2019-09-10","2019-09-11","2019-09-12","2019-09-13","2019-09-14",null,"2019-11-03","2019-11-04","2019-11-05","2019-11-06","2019-11-07","2019-11-08","2019-11-09"]
[{"$nulls":10},"2019-09-15","2019-09-16","2019-09-17","2019-09-18","2019-09-19","2019-09-20","2019-09-21",null,"2019-11-10","2019-11-11","2019-11-12","2019-11-13","2019-11-14","2019-11-15","2019-11-16"]
[{"$nulls":10},"2019-09-22","2019-09-23","2019-09-24","2019-09-25","2019-09-26","2019-09-27","2019-09-28",null,"2019-11-17","2019-11-18","2019-11-19","2019-11-20","2019-11-21","2019-11-22","2019-11-23"]
[{"$nulls":10},"2019-09-29","2019-09-30","","","","","",null,"2019-11-24","2019-11-25","2019-11-26","2019-11-27","2019-11-28","2019-11-29","2019-11-30"]
[{"$nulls":10},"","","","","","","",null,"","","","","","",""]
[{"$f":"A10","v":"2019-09-29"},null,{"$f":"C10","v":"2019-09-30"},null,{"$f":"E10","v":"2019-10-01"},null,{"$f":"G10","v":"2019-10-02"},null,{"$f":"I10","v":"2019-10-03"},null,{"$f":"K10","v":"2019-10-04"},{"$nulls":7},{"$f":"S10","v":"2019-10-05"}]
[{"$f":"$A$1-(WEEKDAY($A$1,1)-(Día_inicial-1))-IF((WEEKDAY($A$1,1)-(Día_inicial-1))<=0,7,0)+1","v":"2019-09-29"},null,{"$f":"A10+1","v":"2019-09-30"},null,{"$f":"C10+1","v":"2019-10-01"},null,{"$f":"E10+1","v":"2019-10-02"},null,{"$f":"G10+1","v":"2019-10-03"},null,{"$f":"I10+1","v":"2019-10-04"},{"$nulls":7},{"$f":"K10+1","v":"2019-10-05"}]
[]
[]
[]
[]
[]
[{"$f":"S10+1","v":"2019-10-06"},null,{"$f":"A16+1","v":"2019-10-07"},null,{"$f":"C16+1","v":"2019-10-08"},null,{"$f":"E16+1","v":"2019-10-09"},null,{"$f":"G16+1","v":"2019-10-10"},null,{"$f":"I16+1","v":"2019-10-11"},{"$nulls":7},{"$f":"K16+1","v":"2019-10-12"}]
[]
[]
[]
[]
[]
[{"$f":"S16+1","v":"2019-10-13"},null,{"$f":"A22+1","v":"2019-10-14"},null,{"$f":"C22+1","v":"2019-10-15"},null,{"$f":"E22+1","v":"2019-10-16"},null,{"$f":"G22+1","v":"2019-10-17"},null,{"$f":"I22+1","v":"2019-10-18"},{"$nulls":7},{"$f":"K22+1","v":"2019-10-19"}]
[]
[]
[]
[]
[]
[{"$f":"S22+1","v":"2019-10-20"},null,{"$f":"A28+1","v":"2019-10-21"},null,{"$f":"C28+1","v":"2019-10-22"},null,{"$f":"E28+1","v":"2019-10-23"},null,{"$f":"G28+1","v":"2019-10-24"},null,{"$f":"I28+1","v":"2019-10-25"},{"$nulls":7},{"$f":"K28+1","v":"2019-10-26"}]
[]
[]
[]
[]
[]
[{"$f":"S28+1","v":"2019-10-27"},null,{"$f":"A34+1","v":"2019-10-28"},null,{"$f":"C34+1","v":"2019-10-29"},null,{"$f":"E34+1","v":"2019-10-30"},null,{"$f":"G34+1","v":"2019-10-31"},null,{"$f":"I34+1","v":"2019-11-01"},{"$nulls":7},{"$f":"K34+1","v":"2019-11-02"}]
[]
[]
[]
[]
[]
[{"$f":"S34+1","v":"2019-11-03"},null,{"$f":"A40+1","v":"2019-11-04"},null,"Notas"]
[]
[]
[]
[{"$nulls":10},"Plantillas de calendario de Vertex42"]
[{"$nulls":10},"https://www.vertex42.com/calendars/"]

{"sheet":"11","index":10,"n_rows":45,"n_cols":25,"rows_kept":45,"merged":[[0,0,6,7],[0,10,0,16],[0,18,0,24],[8,0,8,1],[8,2,8,3],[8,4,8,5],[8,6,8,7],[8,8,8,9],[8,10,8,17],[8,18,8,25],[9,10,9,11],[9,12,9,17],[9,18,9,19],[9,20,9,25],[10,0,10,1],[10,2,10,3],[10,4,10,5],[10,6,10,7],[10,8,10,9],[10,10,10,17],[10,18,10,25],[11,0,11,1],[11,2,11,3],[11,4,11,5],[11,6,11,7],[11,8,11,9],[11,10,11,17],[11,18,11,25],[12,0,12,1],[12,2,12,3],[12,4,12,5],[12,6,12,7],[12,8,12,9],[12,10,12,17],[12,18,12,25],[13,0,13,1],[13,2,13,3],[13,4,13,5],[13,6,13,7],[13,8,13,9],[13,10,13,17],[13,18,13,25],[14,0,14,1],[14,2,14,3],[14,4,14,5],[14,6,14,7],[14,8,14,9],[14,10,14,17],[14,18,14,25],[15,10,15,11],[15,12,15,17],[15,18,15,19],[15,20,15,25],[16,0,16,1],[16,2,16,3],[16,4,16,5],[16,6,16,7],[16,8,16,9],[16,10,16,17],[16,18,16,25],[17,0,17,1],[17,2,17,3],[17,4,17,5],[17,6,17,7],[17,8,17,9],[17,10,17,17],[17,18,17,25],[18,0,18,1],[18,2,18,3],[18,4,18,5],[18,6,18,7],[18,8,18,9],[18,10,18,17],[18,18,18,25],[19,0,19,1],[19,2,19,3],[19,4,19,5],[19,6,19,7],[19,8,19,9],[19,10,19,17],[19,18,19,25],[20,0,20,1],[20,2,20,3],[20,4,20,5],[20,6,20,7],[20,8,20,9],[20,10,20,17],[20,18,20,25],[21,10,21,11],[21,12,21,17],[21,18,21,19],[21,20,21,25],[22,0,22,1],[22,2,22,3],[22,4,22,5],[22,6,22,7],[22,8,22,9],[22,10,22,17],[22,18,22,25],[23,0,23,1],[23,2,23,3],[23,4,23,5],[23,6,23,7],[23,8,23,9],[23,10,23,17],[23,18,23,25],[24,0,24,1],[24,2,24,3],[24,4,24,5],[24,6,24,7],[24,8,24,9],[24,10,24,17],[24,18,24,25],[25,0,25,1],[25,2,25,3],[25,4,25,5],[25,6,25,7],[25,8,25,9],[25,10,25,17],[25,18,25,25],[26,0,26,1],[26,2,26,3],[26,4,26,5],[26,6,26,7],[26,8,26,9],[26,10,26,17],[26,18,26,25],[27,10,27,11],[27,12,27,17],[27,18,27,19],[27,20,27,25],[28,0,28,1],[28,2,28,3],[28,4,28,5],[28,6,28,7],[28,8,28,9],[28,10,28,17],[28,18,28,25],[29,0,29,1],[29,2,29,3],[29,4,29,5],[29,6,29,7],[29,8,29,9],[29,10,29,17],[29,18,29,25],[30,0,30,1],[30,2,30,3],[30,4,30,5],[30,6,30,7],[30,8,30,9],[30,10,30,17],[30,18,30,25],[31,0,31,1],[31,2,31,3],[31,4,31,5],[31,6,31,7],[31,8,31,9],[31,10,31,17],[31,18,31,25],[32,0,32,1],[32,2,32,3],[32,4,32,5],[32,6,32,7],[32,8,32,9],[32,10,32,17],[32,18,32,25],[33,10,33,11],[33,12,33,17],[33,18,33,19],[33,20,33,25],[34,0,34,1],[34,2,34,3],[34,4,34,5],[34,6,34,7],[34,8,34,9],[34,10,34,17],[34,18,34,25],[35,0,35,1],[35,2,35,3],[35,4,35,5],[35,6,35,7],[35,8,35,9],[35,10,35,17],[35,18,35,25],[36,0,36,1],[36,2,36,3],[36,4,36,5],[36,6,36,7],[36,8,36,9],[36,10,36,17],[36,18,36,25],[37,0,37,1],[37,2,37,3],[37,4,37,5],[37,6,37,7],[37,8,37,9],[37,10,37,17],[37,18,37,25],[38,0,38,1],[38,2,38,3],[38,4,38,5],[38,6,38,7],[38,8,38,9],[38,10,38,17],[38,18,38,25],[40,0,40,1],[40,2,40,3],[41,0,41,1],[41,2,41,3],[42,0,42,1],[42,2,42,3],[43,0,43,1],[43,2,43,3],[43,10,43,25],[44,0,44,1],[44,2,44,3],[44,10,44,25]]}
[{"$f":"DATE('1'!AD18,'1'!AD20+10,1)","v":"2019-11-01"},{"$nulls":9},{"$f":"DATE(YEAR(A1),MONTH(A1)-1,1)","v":"2019-10-01"},{"$nulls":7},{"$f":"DATE(YEAR(A1),MONTH(A1)+1,1)","v":"2019-12-01"}]
[{"$nulls":10},{"$f":"INDEX({\"Do\";\"Lu\";\"Ma\";\"Mi\";\"Ju\";\"Vi\";\"Sá\"},1+MOD(Día_inicial+1-2,7))","v":"Do"},{"$f":"INDEX({\"Do\";\"Lu\";\"Ma\";\"Mi\";\"Ju\";\"Vi\";\"Sá\"},1+MOD(Día_inicial+2-2,7))","v":"Lu"},{"$f":"INDEX({\"Do\";\"Lu\";\"Ma\";\"Mi\";\"Ju\";\"Vi\";\"Sá\"},1+MOD(Día_inicial+3-2,7))","v":"Ma"},{"$f":"INDEX({\"Do\";\"Lu\";\"Ma\";\"Mi\";\"Ju\";\"Vi\";\"Sá\"},1+MOD(Día_inicial+4-2,7))","v":"Mi"},{"$f":"INDEX({\"Do\";\"Lu\";\"Ma\";\"Mi\";\"Ju\";\"Vi\";\"Sá\"},1+MOD(Día_inicial+5-2,7))","v":"Ju"},{"$f":"INDEX({\"Do\";\"Lu\";\"Ma\";\"Mi\";\"Ju\";\"Vi\";\"Sá\"},1+MOD(Día_inicial+6-2,7))","v":"Vi"},{"$f":"INDEX({\"Do\";\"Lu\";\"Ma\";\"Mi\";\"Ju\";\"Vi\";\"Sá\"},1+MOD(Día_inicial+7-2,7))","v":"Sá"},null,{"$f":"INDEX({\"Do\";\"Lu\";\"Ma\";\"Mi\";\"Ju\";\"Vi\";\"Sá\"},1+MOD(Día_inicial+1-2,7))","v":"Do"},{"$f":"INDEX({\"Do\";\"Lu\";\"Ma\";\"Mi\";\"Ju\";\"Vi\";\"Sá\"},1+MOD(Día_inicial+2-2,7))","v":"Lu"},{"$f":"INDEX({\"Do\";\"Lu\";\"Ma\";\"Mi\";\"Ju\";\"Vi\";\"Sá\"},1+MOD(Día_inicial+3-2,7))","v":"Ma"},{"$f":"INDEX({\"Do\";\"Lu\";\"Ma\";\"Mi\";\"Ju\";\"Vi\";\"Sá\"},1+MOD(Día_inicial+4-2,7))","v":"Mi"},{"$f":"INDEX({\"Do\";\"Lu\";\"Ma\";\"Mi\";\"Ju\";\"Vi\";\"Sá\"},1+MOD(Día_inicial+5-2,7))","v":"Ju"},{"$f":"INDEX({\"Do\";\"Lu\";\"Ma\";\"Mi\";\"Ju\";\"Vi\";\"Sá\"},1+MOD(Día_inicial+6-2,7))","v":"Vi"},{"$f":"INDEX({\"Do\";\"Lu\";\"Ma\";\"Mi\";\"Ju\";\"Vi\";\"Sá\"},1+MOD(Día_inicial+7-2,7))","v":"Sá"}]
[{"$nulls":10},{"$f":"IF(MONTH($K$1)<>MONTH($K$1-(WEEKDAY($K$1,1)-(Día_inicial-1))-IF((WEEKDAY($K$1,1)-(Día_inicial-1))<=0,7,0)+(ROW(K3)-ROW($K$3))*7+(COLUMN(K3)-COLUMN($K$3)+1)),\"\",$K$1-(WEEKDAY($K$1,1)-(Día_inicial-1))-IF((WEEKDAY($K$1,1)-(Día_inicial-1))<=0,7,0)+(ROW(K3)-ROW($K$3))*7+(COLUMN(K3)-COLUMN($K$3)+1))","v":""},"","2019-10-01","2019-10-02","2019-10-03","2019-10-04","2019-10-05",null,{"$f":"IF(MONTH($S$1)<>MONTH($S$1-(WEEKDAY($S$1,1)-(Día_inicial-1))-IF((WEEKDAY($S$1,1)-(Día_inicial-1))<=0,7,0)+(ROW(S3)-ROW($S$3))*7+(COLUMN(S3)-COLUMN($S$3)+1)),\"\",$S$1-(WEEKDAY($S$1,1)-(Día_inicial-1))-IF((WEEKDAY($S$1,1)-(Día_inicial-1))<=0,7,0)+(ROW(S3)-ROW($S$3))*7+(COLUMN(S3)-COLUMN($S$3)+1))","v":"2019-12-01"},"2019-12-02","2019-12-03","2019-12-04","2019-12-05","2019-12-06","2019-12-07"]
[{"$nulls":10},"2019-10-06","2019-10-07","2019-10-08","2019-10-09","2019-10-10","2019-10-11","2019-10-12",null,"2019-12-08","2019-12-09","2019-12-10","2019-12-11","2019-12-12","2019-12-13","2019-12-14"]
[{"$nulls":10},"2019-10-13","2019-10-14","2019-10-15","2019-10-16","2019-10-17","2019-10-18","2019-10-19",null,"2019-12-15","2019-12-16","2019-12-17","2019-12-18","2019-12-19","2019-12-20","2019-12-21"]
[{"$nulls":10},"2019-10-20","2019-10-21","2019-10-22","2019-10-23","2019-10-24","2019-10-25","2019-10-26",null,"2019-12-22","2019-12-23","2019-12-24","2019-12-25","2019-12-26","2019-12-27","2019-12-28"]
[{"$nulls":10},"2019-10-27","2019-10-28","2019-10-29","2019-10-30","2019-10-31","","",null,"2019-12-29","2019-12-30","2019-12-31","","","",""]
[{"$nulls":10},"","","","","","","",null,"","","","","","",""]
[{"$f":"A10","v":"2019-10-27"},null,{"$f":"C10","v":"2019-10-28"},null,{"$f":"E10","v":"2019-10-29"},null,{"$f":"G10","v":"2019-10-30"},null,{"$f":"I10","v":"2019-10-31"},null,{"$f":"K10","v":"2019-11-01"},{"$nulls":7},{"$f":"S10","v":"2019-11-02"}]
[{"$f":"$A$1-(WEEKDAY($A$1,1)-(Día_inicial-1))-IF((WEEKDAY($A$1,1)-(Día_inicial-1))<=0,7,0)+1","v":"2019-10-27"},null,{"$f":"A10+1","v":"2019-10-28"},null,{"$f":"C10+1","v":"2019-10-29"},null,{"$f":"E10+1","v":"2019-10-30"},null,{"$f":"G10+1","v":"2019-10-31"},null,{"$f":"I10+1","v":"2019-11-01"},{"$nulls":7},{"$f":"K10+1","v":"2019-11-02"}]
[]
[]
[]
[]
[]
[{"$f":"S10+1","v":"2019-11-03"},null,{"$f":"A16+1","v":"2019-11-04"},null,{"$f":"C16+1","v":"2019-11-05"},null,{"$f":"E16+1","v":"2019-11-06"},null,{"$f":"G16+1","v":"2019-11-07"},null,{"$f":"I16+1","v":"2019-11-08"},{"$nulls":7},{"$f":"K16+1","v":"2019-11-09"}]
[]
[]
[]
[]
[]
[{"$f":"S16+1","v":"2019-11-10"},null,{"$f":"A22+1","v":"2019-11-11"},null,{"$f":"C22+1","v":"2019-11-12"},null,{"$f":"E22+1","v":"2019-11-13"},null,{"$f":"G22+1","v":"2019-11-14"},null,{"$f":"I22+1","v":"2019-11-15"},{"$nulls":7},{"$f":"K22+1","v":"2019-11-16"}]
[]
[]
[]
[]
[]
[{"$f":"S22+1","v":"2019-11-17"},null,{"$f":"A28+1","v":"2019-11-18"},null,{"$f":"C28+1","v":"2019-11-19"},null,{"$f":"E28+1","v":"2019-11-20"},null,{"$f":"G28+1","v":"2019-11-21"},null,{"$f":"I28+1","v":"2019-11-22"},{"$nulls":7},{"$f":"K28+1","v":"2019-11-23"}]
[]
[]
[]
[]
[]
[{"$f":"S28+1","v":"2019-11-24"},null,{"$f":"A34+1","v":"2019-11-25"},null,{"$f":"C34+1","v":"2019-11-26"},null,{"$f":"E34+1","v":"2019-11-27"},null,{"$f":"G34+1","v":"2019-11-28"},null,{"$f":"I34+1","v":"2019-11-29"},{"$nulls":7},{"$f":"K34+1","v":"2019-11-30"}]
[]
[]
[]
[]
[]
[{"$f":"S34+1","v":"2019-12-01"},null,{"$f":"A40+1","v":"2019-12-02"},null,"Notas"]
[]
[]
[]
[{"$nulls":10},"Plantillas de calendario de Vertex42"]
[{"$nulls":10},"https://www.vertex42.com/calendars/"]

{"sheet":"12","index":11,"n_rows":45,"n_cols":25,"rows_kept":45,"merged":[[0,0,6,7],[0,10,0,16],[0,18,0,24],[8,0,8,1],[8,2,8,3],[8,4,8,5],[8,6,8,7],[8,8,8,9],[8,10,8,17],[8,18,8,25],[9,10,9,11],[9,12,9,17],[9,18,9,19],[9,20,9,25],[10,0,10,1],[10,2,10,3],[10,4,10,5],[10,6,10,7],[10,8,10,9],[10,10,10,17],[10,18,10,25],[11,0,11,1],[11,2,11,3],[11,4,11,5],[11,6,11,7],[11,8,11,9],[11,10,11,17],[11,18,11,25],[12,0,12,1],[12,2,12,3],[12,4,12,5],[12,6,12,7],[12,8,12,9],[12,10,12,17],[12,18,12,25],[13,0,13,1],[13,2,13,3],[13,4,13,5],[13,6,13,7],[13,8,13,9],[13,10,13,17],[13,18,13,25],[14,0,14,1],[14,2,14,3],[14,4,14,5],[14,6,14,7],[14,8,14,9],[14,10,14,17],[14,18,14,25],[15,10,15,11],[15,12,15,17],[15,18,15,19],[15,20,15,25],[16,0,16,1],[16,2,16,3],[16,4,16,5],[16,6,16,7],[16,8,16,9],[16,10,16,17],[16,18,16,25],[17,0,17,1],[17,2,17,3],[17,4,17,5],[17,6,17,7],[17,8,17,9],[17,10,17,17],[17,18,17,25],[18,0,18,1],[18,2,18,3],[18,4,18,5],[18,6,18,7],[18,8,18,9],[18,10,18,17],[18,18,18,25],[19,0,19,1],[19,2,19,3],[19,4,19,5],[19,6,19,7],[19,8,19,9],[19,10,19,17],[19,18,19,25],[20,0,20,1],[20,2,20,3],[20,4,20,5],[20,6,20,7],[20,8,20,9],[20,10,20,17],[20,18,20,25],[21,10,21,11],[21,12,21,17],[21,18,21,19],[21,20,21,25],[22,0,22,1],[22,2,22,3],[22,4,22,5],[22,6,22,7],[22,8,22,9],[22,10,22,17],[22,18,22,25],[23,0,23,1],[23,2,23,3],[23,4,23,5],[23,6,23,7],[23,8,23,9],[23,10,23,17],[23,18,23,25],[24,0,24,1],[24,2,24,3],[24,4,24,5],[24,6,24,7],[24,8,24,9],[24,10,24,17],[24,18,24,25],[25,0,25,1],[25,2,25,3],[25,4,25,5],[25,6,25,7],[25,8,25,9],[25,10,25,17],[25,18,25,25],[26,0,26,1],[26,2,26,3],[26,4,26,5],[26,6,26,7],[26,8,26,9],[26,10,26,17],[26,18,26,25],[27,10,27,11],[27,12,27,17],[27,18,27,19],[27,20,27,25],[28,0,28,1],[28,2,28,3],[28,4,28,5],[28,6,28,7],[28,8,28,9],[28,10,28,17],[28,18,28,25],[29,0,29,1],[29,2,29,3],[29,4,29,5],[29,6,29,7],[29,8,29,9],[29,10,29,17],[29,18,29,25],[30,0,30,1],[30,2,30,3],[30,4,30,5],[30,6,30,7],[30,8,30,9],[30,10,30,17],[30,18,30,25],[31,0,31,1],[31,2,31,3],[31,4,31,5],[31,6,31,7],[31,8,31,9],[31,10,31,17],[31,18,31,25],[32,0,32,1],[32,2,32,3],[32,4,32,5],[32,6,32,7],[32,8,32,9],[32,10,32,17],[32,18,32,25],[33,10,33,11],[33,12,33,17],[33,18,33,19],[33,20,33,25],[34,0,34,1],[34,2,34,3],[34,4,34,5],[34,6,34,7],[34,8,34,9],[34,10,34,17],[34,18,34,25],[35,0,35,1],[35,2,35,3],[35,4,35,5],[35,6,35,7],[35,8,35,9],[35,10,35,17],[35,18,35,25],[36,0,36,1],[36,2,36,3],[36,4,36,5],[36,6,36,7],[36,8,36,9],[36,10,36,17],[36,18,36,25],[37,0,37,1],[37,2,37,3],[37,4,37,5],[37,6,37,7],[37,8,37,9],[37,10,37,17],[37,18,37,25],[38,0,38,1],[38,2,38,3],[38,4,38,5],[38,6,38,7],[38,8,38,9],[38,10,38,17],[38,18,38,25],[40,0,40,1],[40,2,40,3],[41,0,41,1],[41,2,41,3],[42,0,42,1],[42,2,42,3],[43,0,43,1],[43,2,43,3],[43,10,43,25],[44,0,44,1],[44,2,44,3],[44,10,44,25]]}
[{"$f":"DATE('1'!AD18,'1'!AD20+11,1)","v":"2019-12-01"},{"$nulls":9},{"$f":"DATE(YEAR(A1),MONTH(A1)-1,1)","v":"2019-11-01"},{"$nulls":7},{"$f":"DATE(YEAR(A1),MONTH(A1)+1,1)","v":"2020-01-01"}]
[{"$nulls":10},{"$f":"INDEX({\"Do\";\"Lu\";\"Ma\";\"Mi\";\"Ju\";\"Vi\";\"Sá\"},1+MOD(Día_inicial+1-2,7))","v":"Do"},{"$f":"INDEX({\"Do\";\"Lu\";\"Ma\";\"Mi\";\"Ju\";\"Vi\";\"Sá\"},1+MOD(Día_inicial+2-2,7))","v":"Lu"},{"$f":"INDEX({\"Do\";\"Lu\";\"Ma\";\"Mi\";\"Ju\";\"Vi\";\"Sá\"},1+MOD(Día_inicial+3-2,7))","v":"Ma"},{"$f":"INDEX({\"Do\";\"Lu\";\"Ma\";\"Mi\";\"Ju\";\"Vi\";\"Sá\"},1+MOD(Día_inicial+4-2,7))","v":"Mi"},{"$f":"INDEX({\"Do\";\"Lu\";\"Ma\";\"Mi\";\"Ju\";\"Vi\";\"Sá\"},1+MOD(Día_inicial+5-2,7))","v":"Ju"},{"$f":"INDEX({\"Do\";\"Lu\";\"Ma\";\"Mi\";\"Ju\";\"Vi\";\"Sá\"},1+MOD(Día_inicial+6-2,7))","v":"Vi"},{"$f":"INDEX({\"Do\";\"Lu\";\"Ma\";\"Mi\";\"Ju\";\"Vi\";\"Sá\"},1+MOD(Día_inicial+7-2,7))","v":"Sá"},null,{"$f":"INDEX({\"Do\";\"Lu\";\"Ma\";\"Mi\";\"Ju\";\"Vi\";\"Sá\"},1+MOD(Día_inicial+1-2,7))","v":"Do"},{"$f":"INDEX({\"Do\";\"Lu\";\"Ma\";\"Mi\";\"Ju\";\"Vi\";\"Sá\"},1+MOD(Día_inicial+2-2,7))","v":"Lu"},{"$f":"INDEX({\"Do\";\"Lu\";\"Ma\";\"Mi\";\"Ju\";\"Vi\";\"Sá\"},1+MOD(Día_inicial+3-2,7))","v":"Ma"},{"$f":"INDEX({\"Do\";\"Lu\";\"Ma\";\"Mi\";\"Ju\";\"Vi\";\"Sá\"},1+MOD(Día_inicial+4-2,7))","v":"Mi"},{"$f":"INDEX({\"Do\";\"Lu\";\"Ma\";\"Mi\";\"Ju\";\"Vi\";\"Sá\"},1+MOD(Día_inicial+5-2,7))","v":"Ju"},{"$f":"INDEX({\"Do\";\"Lu\";\"Ma\";\"Mi\";\"Ju\";\"Vi\";\"Sá\"},1+MOD(Día_inicial+6-2,7))","v":"Vi"},{"$f":"INDEX({\"Do\";\"Lu\";\"Ma\";\"Mi\";\"Ju\";\"Vi\";\"Sá\"},1+MOD(Día_inicial+7-2,7))","v":"Sá"}]
[{"$nulls":10},{"$f":"IF(MONTH($K$1)<>MONTH($K$1-(WEEKDAY($K$1,1)-(Día_inicial-1))-IF((WEEKDAY($K$1,1)-(Día_inicial-1))<=0,7,0)+(ROW(K3)-ROW($K$3))*7+(COLUMN(K3)-COLUMN($K$3)+1)),\"\",$K$1-(WEEKDAY($K$1,1)-(Día_inicial-1))-IF((WEEKDAY($K$1,1)-(Día_inicial-1))<=0,7,0)+(ROW(K3)-ROW($K$3))*7+(COLUMN(K3)-COLUMN($K$3)+1))","v":""},"","","","","2019-11-01","2019-11-02",null,{"$f":"IF(MONTH($S$1)<>MONTH($S$1-(WEEKDAY($S$1,1)-(Día_inicial-1))-IF((WEEKDAY($S$1,1)-(Día_inicial-1))<=0,7,0)+(ROW(S3)-ROW($S$3))*7+(COLUMN(S3)-COLUMN($S$3)+1)),\"\",$S$1-(WEEKDAY($S$1,1)-(Día_inicial-1))-IF((WEEKDAY($S$1,1)-(Día_inicial-1))<=0,7,0)+(ROW(S3)-ROW($S$3))*7+(COLUMN(S3)-COLUMN($S$3)+1))","v":""},"","","2020-01-01","2020-01-02","2020-01-03","2020-01-04"]
[{"$nulls":10},"2019-11-03","2019-11-04","2019-11-05","2019-11-06","2019-11-07","2019-11-08","2019-11-09",null,"2020-01-05","2020-01-06","2020-01-07","2020-01-08","2020-01-09","2020-01-10","2020-01-11"]
[{"$nulls":10},"2019-11-10","2019-11-11","2019-11-12","2019-11-13","2019-11-14","2019-11-15","2019-11-16",null,"2020-01-12","2020-01-13","2020-01-14","2020-01-15","2020-01-16","2020-01-17","2020-01-18"]
[{"$nulls":10},"2019-11-17","2019-11-18","2019-11-19","2019-11-20","2019-11-21","2019-11-22","2019-11-23",null,"2020-01-19","2020-01-20","2020-01-21","2020-01-22","2020-01-23","2020-01-24","2020-01-25"]
[{"$nulls":10},"2019-11-24","2019-11-25","2019-11-26","2019-11-27","2019-11-28","2019-11-29","2019-11-30",null,"2020-01-26","2020-01-27","2020-01-28","2020-01-29","2020-01-30","2020-01-31",""]
[{"$nulls":10},"","","","","","","",null,"","","","","","",""]
[{"$f":"A10","v":"2019-12-01"},null,{"$f":"C10","v":"2019-12-02"},null,{"$f":"E10","v":"2019-12-03"},null,{"$f":"G10","v":"2019-12-04"},null,{"$f":"I10","v":"2019-12-05"},null,{"$f":"K10","v":"2019-12-06"},{"$nulls":7},{"$f":"S10","v":"2019-12-07"}]
[{"$f":"$A$1-(WEEKDAY($A$1,1)-(Día_inicial-1))-IF((WEEKDAY($A$1,1)-(Día_inicial-1))<=0,7,0)+1","v":"2019-12-01"},null,{"$f":"A10+1","v":"2019-12-02"},null,{"$f":"C10+1","v":"2019-12-03"},null,{"$f":"E10+1","v":"2019-12-04"},null,{"$f":"G10+1","v":"2019-12-05"},null,{"$f":"I10+1","v":"2019-12-06"},{"$nulls":7},{"$f":"K10+1","v":"2019-12-07"}]
[]
[]
[]
[]
[]
[{"$f":"S10+1","v":"2019-12-08"},null,{"$f":"A16+1","v":"2019-12-09"},null,{"$f":"C16+1","v":"2019-12-10"},null,{"$f":"E16+1","v":"2019-12-11"},null,{"$f":"G16+1","v":"2019-12-12"},null,{"$f":"I16+1","v":"2019-12-13"},{"$nulls":7},{"$f":"K16+1","v":"2019-12-14"}]
[]
[]
[]
[]
[]
[{"$f":"S16+1","v":"2019-12-15"},null,{"$f":"A22+1","v":"2019-12-16"},null,{"$f":"C22+1","v":"2019-12-17"},null,{"$f":"E22+1","v":"2019-12-18"},null,{"$f":"G22+1","v":"2019-12-19"},null,{"$f":"I22+1","v":"2019-12-20"},{"$nulls":7},{"$f":"K22+1","v":"2019-12-21"}]
[]
[]
[]
[]
[]
[{"$f":"S22+1","v":"2019-12-22"},null,{"$f":"A28+1","v":"2019-12-23"},null,{"$f":"C28+1","v":"2019-12-24"},null,{"$f":"E28+1","v":"2019-12-25"},null,{"$f":"G28+1","v":"2019-12-26"},null,{"$f":"I28+1","v":"2019-12-27"},{"$nulls":7},{"$f":"K28+1","v":"2019-12-28"}]
[]
[]
[]
[]
[]
[{"$f":"S28+1","v":"2019-12-29"},null,{"$f":"A34+1","v":"2019-12-30"},null,{"$f":"C34+1","v":"2019-12-31"},null,{"$f":"E34+1","v":"2020-01-01"},null,{"$f":"G34+1","v":"2020-01-02"},null,{"$f":"I34+1","v":"2020-01-03"},{"$nulls":7},{"$f":"K34+1","v":"2020-01-04"}]
[]
[]
[]
[]
[]
[{"$f":"S34+1","v":"2020-01-05"},null,{"$f":"A40+1","v":"2020-01-06"},null,"Notas"]
[]
[]
[]
[{"$nulls":10},"Plantillas de calendario de Vertex42"]
[{"$nulls":10},"https://www.vertex42.com/calendars/"]

{"sheet":"Acerca de","index":12,"n_rows":15,"n_cols":2,"rows_kept":15}
[]
[null,"PLANTILLAS DE CALENDARIO de Vertex42.com"]
[null,"https://www.vertex42.com/calendars/"]
[]
[null,"Acerca de esta plantilla"]
[null,"Crea e imprime un calendario de 12 meses para tu familia, tu empresa o tu centro educativo con esta plantilla proporcionada por Vertex42.com. Escribe el año y el mes de inicio, después, elige si deseas empezar cada semana el domingo o el lunes. Los pequeños calendarios del mes anterior y del mes siguiente en la parte superior de la página te proporcionan una referencia útil. Compártelo y edítalo en colaboración o imprime un calendario para la pared, el escritorio, el refrigerador o el planificador. Funciona para los años 2018, 2019, 2020 y en adelante."]
[]
[null,"Más plantillas de calendario"]
[null,"Visita Vertex42.com para descargar varias plantillas de calendario distintas."]
[null,"Más plantillas de calendario"]
[]
[null,"Acerca de Vertex42"]
[null,"Vertex42.com ofrece más de 300 plantillas de hoja de cálculo de diseño profesional para la empresa, el hogar y ámbitos educativos, la mayoría de las cuales se pueden descargar sin cargo. La colección incluye una amplia variedad de calendarios, planificadores y programaciones, así como hojas de cálculo de finanzas personales para presupuestos, reducción de deuda y amortización de préstamos."]
[]
[null,"Las empresas encontrarán facturas, hojas de horas, seguimiento de inventario, informes financieros y plantillas de planificación de proyectos. Los profesores y alumnos encontrarán recursos como programaciones de clase, libros y planillas de asistencia. Organiza tu vida familiar con planificadores de comidas, listas de verificación y registros de actividad física. Cada plantilla se investiga, perfecciona y mejora cuidadosamente con el tiempo gracias a los comentarios de miles de usuarios."]