{"text_format":"3","workbook":"xlsx","n_sheets":5,"sheets":["Resumen anual","T 1","T 2","T 3","T 4"],"not_rendered":{"defined_names":12},"read":"whole","date_system":"1900"}

{"sheet":"Resumen anual","index":0,"n_rows":36,"n_cols":12,"rows_kept":36,"merged":[[3,0,3,6]]}
["Nombre de la empresa"]
["Seguimiento de asistencia, resumen anual"]
["Fecha"]
[{"$f":"Nombre_de_la_compañía","v":"Nombre de la empresa"},{"$nulls":6},"CONFIDENCIAL"]
["Apellidos","Nombre","Vacaciones","Personal","Enfermedad","NÚMERO DEL SEGURO SOCIAL","Puesto","Supervisor","Fecha de contratación","Comentarios","Días de vacaciones \npor año","Días de vacaciones \nRestantes"]
["Apellidos","Nombre",{"$f":"SUM('T 1:T 4'!C6)","v":3},{"$f":"SUM('T 1:T 4'!D6)","v":0},{"$f":"SUM('T 1:T 4'!E6)","v":1},"xxx-xx-xxxx","Encargado","Nombre",null,null,10,{"$f":"K6-C6","v":7}]
[null,null,{"$f":"SUM('T 1:T 4'!C7)","v":0},{"$f":"SUM('T 1:T 4'!D7)","v":0},{"$f":"SUM('T 1:T 4'!E7)","v":0},{"$nulls":6},{"$f":"K7-C7","v":0}]
[null,null,{"$f":"SUM('T 1:T 4'!C8)","v":0},{"$f":"SUM('T 1:T 4'!D8)","v":0},{"$f":"SUM('T 1:T 4'!E8)","v":0},{"$nulls":6},0]
[null,null,{"$f":"SUM('T 1:T 4'!C9)","v":0},{"$f":"SUM('T 1:T 4'!D9)","v":0},{"$f":"SUM('T 1:T 4'!E9)","v":0},{"$nulls":6},0]
[null,null,{"$f":"SUM('T 1:T 4'!C10)","v":0},{"$f":"SUM('T 1:T 4'!D10)","v":0},{"$f":"SUM('T 1:T 4'!E10)","v":0},{"$nulls":6},0]
[null,null,{"$f":"SUM('T 1:T 4'!C11)","v":0},{"$f":"SUM('T 1:T 4'!D11)","v":0},{"$f":"SUM('T 1:T 4'!E11)","v":0},{"$nulls":6},0]
[null,null,{"$f":"SUM('T 1:T 4'!C12)","v":0},{"$f":"SUM('T 1:T 4'!D12)","v":0},{"$f":"SUM('T 1:T 4'!E12)","v":0},{"$nulls":6},0]
[null,null,{"$f":"SUM('T 1:T 4'!C13)","v":0},{"$f":"SUM('T 1:T 4'!D13)","v":0},{"$f":"SUM('T 1:T 4'!E13)","v":0},{"$nulls":6},0]
[null,null,{"$f":"SUM('T 1:T 4'!C14)","v":0},{"$f":"SUM('T 1:T 4'!D14)","v":0},{"$f":"SUM('T 1:T 4'!E14)","v":0},{"$nulls":6},0]
[null,null,{"$f":"SUM('T 1:T 4'!C15)","v":0},{"$f":"SUM('T 1:T 4'!D15)","v":0},{"$f":"SUM('T 1:T 4'!E15)","v":0},{"$nulls":6},0]
[null,null,{"$f":"SUM('T 1:T 4'!C16)","v":0},{"$f":"SUM('T 1:T 4'!D16)","v":0},{"$f":"SUM('T 1:T 4'!E16)","v":0},{"$nulls":6},0]
[null,null,{"$f":"SUM('T 1:T 4'!C17)","v":0},{"$f":"SUM('T 1:T 4'!D17)","v":0},{"$f":"SUM('T 1:T 4'!E17)","v":0},{"$nulls":6},0]
[null,null,{"$f":"SUM('T 1:T 4'!C18)","v":0},{"$f":"SUM('T 1:T 4'!D18)","v":0},{"$f":"SUM('T 1:T 4'!E18)","v":0},{"$nulls":6},0]
[null,null,{"$f":"SUM('T 1:T 4'!C19)","v":0},{"$f":"SUM('T 1:T 4'!D19)","v":0},{"$f":"SUM('T 1:T 4'!E19)","v":0},{"$nulls":6},0]
[null,null,{"$f":"SUM('T 1:T 4'!C20)","v":0},{"$f":"SUM('T 1:T 4'!D20)","v":0},{"$f":"SUM('T 1:T 4'!E20)","v":0},{"$nulls":6},0]
[null,null,{"$f":"SUM('T 1:T 4'!C21)","v":0},{"$f":"SUM('T 1:T 4'!D21)","v":0},{"$f":"SUM('T 1:T 4'!E21)","v":0},{"$nulls":6},0]
[null,null,{"$f":"SUM('T 1:T 4'!C22)","v":0},{"$f":"SUM('T 1:T 4'!D22)","v":0},{"$f":"SUM('T 1:T 4'!E22)","v":0},{"$nulls":6},0]
[null,null,{"$f":"SUM('T 1:T 4'!C23)","v":0},{"$f":"SUM('T 1:T 4'!D23)","v":0},{"$f":"SUM('T 1:T 4'!E23)","v":0},{"$nulls":6},0]
[null,null,{"$f":"SUM('T 1:T 4'!C24)","v":0},{"$f":"SUM('T 1:T 4'!D24)","v":0},{"$f":"SUM('T 1:T 4'!E24)","v":0},{"$nulls":6},0]
[null,null,{"$f":"SUM('T 1:T 4'!C25)","v":0},{"$f":"SUM('T 1:T 4'!D25)","v":0},{"$f":"SUM('T 1:T 4'!E25)","v":0},{"$nulls":6},0]
[null,null,{"$f":"SUM('T 1:T 4'!C26)","v":0},{"$f":"SUM('T 1:T 4'!D26)","v":0},{"$f":"SUM('T 1:T 4'!E26)","v":0},{"$nulls":6},0]
[null,null,{"$f":"SUM('T 1:T 4'!C27)","v":0},{"$f":"SUM('T 1:T 4'!D27)","v":0},{"$f":"SUM('T 1:T 4'!E27)","v":0},{"$nulls":6},0]
[null,null,{"$f":"SUM('T 1:T 4'!C28)","v":0},{"$f":"SUM('T 1:T 4'!D28)","v":0},{"$f":"SUM('T 1:T 4'!E28)","v":0},{"$nulls":6},0]
[null,null,{"$f":"SUM('T 1:T 4'!C29)","v":0},{"$f":"SUM('T 1:T 4'!D29)","v":0},{"$f":"SUM('T 1:T 4'!E29)","v":0},{"$nulls":6},0]
[null,null,{"$f":"SUM('T 1:T 4'!C30)","v":0},{"$f":"SUM('T 1:T 4'!D30)","v":0},{"$f":"SUM('T 1:T 4'!E30)","v":0},{"$nulls":6},0]
[null,null,{"$f":"SUM('T 1:T 4'!C31)","v":0},{"$f":"SUM('T 1:T 4'!D31)","v":0},{"$f":"SUM('T 1:T 4'!E31)","v":0},{"$nulls":6},0]
[null,null,{"$f":"SUM('T 1:T 4'!C32)","v":0},{"$f":"SUM('T 1:T 4'!D32)","v":0},{"$f":"SUM('T 1:T 4'!E32)","v":0},{"$nulls":6},0]
[null,null,{"$f":"SUM('T 1:T 4'!C33)","v":0},{"$f":"SUM('T 1:T 4'!D33)","v":0},{"$f":"SUM('T 1:T 4'!E33)","v":0},{"$nulls":6},0]
[null,null,{"$f":"SUM('T 1:T 4'!C34)","v":0},{"$f":"SUM('T 1:T 4'!D34)","v":0},{"$f":"SUM('T 1:T 4'!E34)","v":0},{"$nulls":6},0]
[null,null,{"$f":"SUM('T 1:T 4'!C35)","v":0},{"$f":"SUM('T 1:T 4'!D35)","v":0},{"$f":"SUM('T 1:T 4'!E35)","v":0},{"$nulls":6},0]
[null,null,{"$f":"SUM('T 1:T 4'!C36)","v":0},{"$f":"SUM('T 1:T 4'!D36)","v":0},{"$f":"SUM('T 1:T 4'!E36)","v":0},{"$nulls":6},0]

{"sheet":"T 1","index":1,"n_rows":36,"n_cols":95,"rows_kept":36,"merged":[[3,0,3,6]]}
[{"$f":"Nombre_de_la_compañía","v":"Nombre de la empresa"}]
["Seguimiento de asistencia, trimestre 1"]
["Fecha"]
[{"$f":"Nombre_de_la_compañía","v":"Nombre de la empresa"},{"$nulls":6},"CONFIDENCIAL"]
["Apellidos","Nombre","Vacaciones","Personal","Enfermedad","01/01","01/02","01/03","01/04","01/05","01/06","01/07","01/08","01/09","01/10","01/11","01/12","01/13","01/14","01/15","01/16","01/17","01/18","01/19","01/20","01/21","01/22","01/23","01/24","01/25","01/26","01/27","01/28","01/29","01/30","01/31","02/01","02/02","02/03","02/04","02/05","02/06","02/07","02/08","02/09","02/10","02/11","02/12","02/13","02/14","02/15","02/16","02/17","02/18","02/19","02/20","02/21","02/22","02/23","02/24","02/25","02/26","02/27","02/28","03/01","03/02","03/03","03/04","03/05","03/06","03/07","03/08","03/09","03/10","03/11","03/12","03/13","03/14","03/15","03/16","03/17","03/18","03/19","03/20","03/21","03/22","03/23","03/24","03/25","03/26","03/27","03/28","03/29","03/30","03/31"]
[{"$f":"IF(ISBLANK('Resumen anual'!A6),\"\",'Resumen anual'!A6)","v":"Apellidos"},{"$f":"IF(ISBLANK('Resumen anual'!B6),\"\",'Resumen anual'!B6)","v":"Nombre"},{"$f":"COUNTIF($F6:$CQ6, \"V\")","v":3},{"$f":"COUNTIF($F6:$CQ6, \"P\")","v":0},{"$f":"COUNTIF($F6:$CQ6, \"E\")","v":1},"V","V","V",{"$nulls":4},"E"]
[{"$f":"IF(ISBLANK('Resumen anual'!A7),\"\",'Resumen anual'!A7)","v":""},{"$f":"IF(ISBLANK('Resumen anual'!B7),\"\",'Resumen anual'!B7)","v":""},0,0,0]
[{"$f":"IF(ISBLANK('Resumen anual'!A8),\"\",'Resumen anual'!A8)","v":""},{"$f":"IF(ISBLANK('Resumen anual'!B8),\"\",'Resumen anual'!B8)","v":""},0,0,0]
[{"$f":"IF(ISBLANK('Resumen anual'!A9),\"\",'Resumen anual'!A9)","v":""},{"$f":"IF(ISBLANK('Resumen anual'!B9),\"\",'Resumen anual'!B9)","v":""},0,0,0]
[{"$f":"IF(ISBLANK('Resumen anual'!A10),\"\",'Resumen anual'!A10)","v":""},{"$f":"IF(ISBLANK('Resumen anual'!B10),\"\",'Resumen anual'!B10)","v":""},0,0,0]
[{"$f":"IF(ISBLANK('Resumen anual'!A11),\"\",'Resumen anual'!A11)","v":""},{"$f":"IF(ISBLANK('Resumen anual'!B11),\"\",'Resumen anual'!B11)","v":""},0,0,0]
[{"$f":"IF(ISBLANK('Resumen anual'!A12),\"\",'Resumen anual'!A12)","v":""},{"$f":"IF(ISBLANK('Resumen anual'!B12),\"\",'Resumen anual'!B12)","v":""},0,0,0]
[{"$f":"IF(ISBLANK('Resumen anual'!A13),\"\",'Resumen anual'!A13)","v":""},{"$f":"IF(ISBLANK('Resumen anual'!B13),\"\",'Resumen anual'!B13)","v":""},0,0,0]
[{"$f":"IF(ISBLANK('Resumen anual'!A14),\"\",'Resumen anual'!A14)","v":""},{"$f":"IF(ISBLANK('Resumen anual'!B14),\"\",'Resumen anual'!B14)","v":""},0,0,0]
[{"$f":"IF(ISBLANK('Resumen anual'!A15),\"\",'Resumen anual'!A15)","v":""},{"$f":"IF(ISBLANK('Resumen anual'!B15),\"\",'Resumen anual'!B15)","v":""},0,0,0]
[{"$f":"IF(ISBLANK('Resumen anual'!A16),\"\",'Resumen anual'!A16)","v":""},{"$f":"IF(ISBLANK('Resumen anual'!B16),\"\",'Resumen anual'!B16)","v":""},0,0,0]
[{"$f":"IF(ISBLANK('Resumen anual'!A17),\"\",'Resumen anual'!A17)","v":""},{"$f":"IF(ISBLANK('Resumen anual'!B17),\"\",'Resumen anual'!B17)","v":""},0,0,0]
[{"$f":"IF(ISBLANK('Resumen anual'!A18),\"\",'Resumen anual'!A18)","v":""},{"$f":"IF(ISBLANK('Resumen anual'!B18),\"\",'Resumen anual'!B18)","v":""},0,0,0]
[{"$f":"IF(ISBLANK('Resumen anual'!A19),\"\",'Resumen anual'!A19)","v":""},{"$f":"IF(ISBLANK('Resumen anual'!B19),\"\",'Resumen anual'!B19)","v":""},0,0,0]
[{"$f":"IF(ISBLANK('Resumen anual'!A20),\"\",'Resumen anual'!A20)","v":""},{"$f":"IF(ISBLANK('Resumen anual'!B20),\"\",'Resumen anual'!B20)","v":""},0,0,0]
[{"$f":"IF(ISBLANK('Resumen anual'!A21),\"\",'Resumen anual'!A21)","v":""},{"$f":"IF(ISBLANK('Resumen anual'!B21),\"\",'Resumen anual'!B21)","v":""},0,0,0]
[{"$f":"IF(ISBLANK('Resumen anual'!A22),\"\",'Resumen anual'!A22)","v":""},{"$f":"IF(ISBLANK('Resumen anual'!B22),\"\",'Resumen anual'!B22)","v":""},0,0,0]
[{"$f":"IF(ISBLANK('Resumen anual'!A23),\"\",'Resumen anual'!A23)","v":""},{"$f":"IF(ISBLANK('Resumen anual'!B23),\"\",'Resumen anual'!B23)","v":""},0,0,0]
[{"$f":"IF(ISBLANK('Resumen anual'!A24),\"\",'Resumen anual'!A24)","v":""},{"$f":"IF(ISBLANK('Resumen anual'!B24),\"\",'Resumen anual'!B24)","v":""},0,0,0]
[{"$f":"IF(ISBLANK('Resumen anual'!A25),\"\",'Resumen anual'!A25)","v":""},{"$f":"IF(ISBLANK('Resumen anual'!B25),\"\",'Resumen anual'!B25)","v":""},0,0,0]
[{"$f":"IF(ISBLANK('Resumen anual'!A26),\"\",'Resumen anual'!A26)","v":""},{"$f":"IF(ISBLANK('Resumen anual'!B26),\"\",'Resumen anual'!B26)","v":""},0,0,0]
[{"$f":"IF(ISBLANK('Resumen anual'!A27),\"\",'Resumen anual'!A27)","v":""},{"$f":"IF(ISBLANK('Resumen anual'!B27),\"\",'Resumen anual'!B27)","v":""},0,0,0]
[{"$f":"IF(ISBLANK('Resumen anual'!A28),\"\",'Resumen anual'!A28)","v":""},{"$f":"IF(ISBLANK('Resumen anual'!B28),\"\",'Resumen anual'!B28)","v":""},0,0,0]
[{"$f":"IF(ISBLANK('Resumen anual'!A29),\"\",'Resumen anual'!A29)","v":""},{"$f":"IF(ISBLANK('Resumen anual'!B29),\"\",'Resumen anual'!B29)","v":""},0,0,0]
[{"$f":"IF(ISBLANK('Resumen anual'!A30),\"\",'Resumen anual'!A30)","v":""},{"$f":"IF(ISBLANK('Resumen anual'!B30),\"\",'Resumen anual'!B30)","v":""},0,0,0]
[{"$f":"IF(ISBLANK('Resumen anual'!A31),\"\",'Resumen anual'!A31)","v":""},{"$f":"IF(ISBLANK('Resumen anual'!B31),\"\",'Resumen anual'!B31)","v":""},0,0,0]
[{"$f":"IF(ISBLANK('Resumen anual'!A32),\"\",'Resumen anual'!A32)","v":""},{"$f":"IF(ISBLANK('Resumen anual'!B32),\"\",'Resumen anual'!B32)","v":""},0,0,0]
[{"$f":"IF(ISBLANK('Resumen anual'!A33),\"\",'Resumen anual'!A33)","v":""},{"$f":"IF(ISBLANK('Resumen anual'!B33),\"\",'Resumen anual'!B33)","v":""},0,0,0]
[{"$f":"IF(ISBLANK('Resumen anual'!A34),\"\",'Resumen anual'!A34)","v":""},{"$f":"IF(ISBLANK('Resumen anual'!B34),\"\",'Resumen anual'!B34)","v":""},0,0,0]
[{"$f":"IF(ISBLANK('Resumen anual'!A35),\"\",'Resumen anual'!A35)","v":""},{"$f":"IF(ISBLANK('Resumen anual'!B35),\"\",'Resumen anual'!B35)","v":""},0,0,0]
[{"$f":"IF(ISBLANK('Resumen anual'!A36),\"\",'Resumen anual'!A36)","v":""},{"$f":"IF(ISBLANK('Resumen anual'!B36),\"\",'Resumen anual'!B36)","v":""},0,0,0]

{"sheet":"T 2","index":2,"n_rows":36,"n_cols":96,"rows_kept":36,"merged":[[3,0,3,6]]}
[{"$f":"Nombre_de_la_compañía","v":"Nombre de la empresa"}]
["Seguimiento de asistencia, segundo trimestre"]
["Fecha"]
[{"$f":"Nombre_de_la_compañía","v":"Nombre de la empresa"},{"$nulls":6},"CONFIDENCIAL"]
["Apellidos","Nombre","Vacaciones","Personal","Enfermedad","04/01","04/02","04/03","04/04","04/05","04/06","04/07","04/08","04/09","04/10","04/11","04/12","04/13","04/14","04/15","04/16","04/17","04/18","04/19","04/20","04/21","04/22","04/23","04/24","04/25","04/26","04/27","04/28","04/29","04/30","05/01","05/02","05/03","05/04","05/05","05/06","05/07","05/08","05/09","05/10","05/11","05/12","05/13","05/14","05/15","05/16","05/17","05/18","05/19","05/20","05/21","05/22","05/23","05/24","05/25","05/26","05/27","05/28","05/29","05/30","05/31","06/01","06/02","06/03","06/04","06/05","06/06","06/07","06/08","06/09","06/10","06/11","06/12","06/13","06/14","06/15","06/16","06/17","06/18","06/19","06/20","06/21","06/22","06/23","06/24","06/25","06/26","06/27","06/28","06/29","06/30"]
[{"$f":"IF(ISBLANK('Resumen anual'!A6),\"\",'Resumen anual'!A6)","v":"Apellidos"},{"$f":"IF(ISBLANK('Resumen anual'!B6),\"\",'Resumen anual'!B6)","v":"Nombre"},{"$f":"COUNTIF($F6:$CR6, \"V\")","v":0},{"$f":"COUNTIF($F6:$CR6, \"P\")","v":0},{"$f":"COUNTIF($F6:$CR6, \"E\")","v":0}]
[{"$f":"IF(ISBLANK('Resumen anual'!A7),\"\",'Resumen anual'!A7)","v":""},{"$f":"IF(ISBLANK('Resumen anual'!B7),\"\",'Resumen anual'!B7)","v":""},{"$f":"COUNTIF($F7:$CR7, \"V\")","v":0},{"$f":"COUNTIF($F7:$CR7, \"P\")","v":0},0]
[{"$f":"IF(ISBLANK('Resumen anual'!A8),\"\",'Resumen anual'!A8)","v":""},{"$f":"IF(ISBLANK('Resumen anual'!B8),\"\",'Resumen anual'!B8)","v":""},0,0,0]
[{"$f":"IF(ISBLANK('Resumen anual'!A9),\"\",'Resumen anual'!A9)","v":""},{"$f":"IF(ISBLANK('Resumen anual'!B9),\"\",'Resumen anual'!B9)","v":""},0,0,0]
[{"$f":"IF(ISBLANK('Resumen anual'!A10),\"\",'Resumen anual'!A10)","v":""},{"$f":"IF(ISBLANK('Resumen anual'!B10),\"\",'Resumen anual'!B10)","v":""},0,0,0]
[{"$f":"IF(ISBLANK('Resumen anual'!A11),\"\",'Resumen anual'!A11)","v":""},{"$f":"IF(ISBLANK('Resumen anual'!B11),\"\",'Resumen anual'!B11)","v":""},0,0,0]
[{"$f":"IF(ISBLANK('Resumen anual'!A12),\"\",'Resumen anual'!A12)","v":""},{"$f":"IF(ISBLANK('Resumen anual'!B12),\"\",'Resumen anual'!B12)","v":""},0,0,0]
[{"$f":"IF(ISBLANK('Resumen anual'!A13),\"\",'Resumen anual'!A13)","v":""},{"$f":"IF(ISBLANK('Resumen anual'!B13),\"\",'Resumen anual'!B13)","v":""},0,0,0]
[{"$f":"IF(ISBLANK('Resumen anual'!A14),\"\",'Resumen anual'!A14)","v":""},{"$f":"IF(ISBLANK('Resumen anual'!B14),\"\",'Resumen anual'!B14)","v":""},0,0,0]
[{"$f":"IF(ISBLANK('Resumen anual'!A15),\"\",'Resumen anual'!A15)","v":""},{"$f":"IF(ISBLANK('Resumen anual'!B15),\"\",'Resumen anual'!B15)","v":""},0,0,0]
[{"$f":"IF(ISBLANK('Resumen anual'!A16),\"\",'Resumen anual'!A16)","v":""},{"$f":"IF(ISBLANK('Resumen anual'!B16),\"\",'Resumen anual'!B16)","v":""},0,0,0]
[{"$f":"IF(ISBLANK('Resumen anual'!A17),\"\",'Resumen anual'!A17)","v":""},{"$f":"IF(ISBLANK('Resumen anual'!B17),\"\",'Resumen anual'!B17)","v":""},0,0,0]
[{"$f":"IF(ISBLANK('Resumen anual'!A18),\"\",'Resumen anual'!A18)","v":""},{"$f":"IF(ISBLANK('Resumen anual'!B18),\"\",'Resumen anual'!B18)","v":""},0,0,0]
[{"$f":"IF(ISBLANK('Resumen anual'!A19),\"\",'Resumen anual'!A19)","v":""},{"$f":"IF(ISBLANK('Resumen anual'!B19),\"\",'Resumen anual'!B19)","v":""},0,0,0]
[{"$f":"IF(ISBLANK('Resumen anual'!A20),\"\",'Resumen anual'!A20)","v":""},{"$f":"IF(ISBLANK('Resumen anual'!B20),\"\",'Resumen anual'!B20)","v":""},0,0,0]
[{"$f":"IF(ISBLANK('Resumen anual'!A21),\"\",'Resumen anual'!A21)","v":""},{"$f":"IF(ISBLANK('Resumen anual'!B21),\"\",'Resumen anual'!B21)","v":""},0,0,0]
[{"$f":"IF(ISBLANK('Resumen anual'!A22),\"\",'Resumen anual'!A22)","v":""},{"$f":"IF(ISBLANK('Resumen anual'!B22),\"\",'Resumen anual'!B22)","v":""},0,0,0]
[{"$f":"IF(ISBLANK('Resumen anual'!A23),\"\",'Resumen anual'!A23)","v":""},{"$f":"IF(ISBLANK('Resumen anual'!B23),\"\",'Resumen anual'!B23)","v":""},0,0,0]
[{"$f":"IF(ISBLANK('Resumen anual'!A24),\"\",'Resumen anual'!A24)","v":""},{"$f":"IF(ISBLANK('Resumen anual'!B24),\"\",'Resumen anual'!B24)","v":""},0,0,0]
[{"$f":"IF(ISBLANK('Resumen anual'!A25),\"\",'Resumen anual'!A25)","v":""},{"$f":"IF(ISBLANK('Resumen anual'!B25),\"\",'Resumen anual'!B25)","v":""},0,0,0]
[{"$f":"IF(ISBLANK('Resumen anual'!A26),\"\",'Resumen anual'!A26)","v":""},{"$f":"IF(ISBLANK('Resumen anual'!B26),\"\",'Resumen anual'!B26)","v":""},0,0,0]
[{"$f":"IF(ISBLANK('Resumen anual'!A27),\"\",'Resumen anual'!A27)","v":""},{"$f":"IF(ISBLANK('Resumen anual'!B27),\"\",'Resumen anual'!B27)","v":""},0,0,0]
[{"$f":"IF(ISBLANK('Resumen anual'!A28),\"\",'Resumen anual'!A28)","v":""},{"$f":"IF(ISBLANK('Resumen anual'!B28),\"\",'Resumen anual'!B28)","v":""},0,0,0]
[{"$f":"IF(ISBLANK('Resumen anual'!A29),\"\",'Resumen anual'!A29)","v":""},{"$f":"IF(ISBLANK('Resumen anual'!B29),\"\",'Resumen anual'!B29)","v":""},0,0,0]
[{"$f":"IF(ISBLANK('Resumen anual'!A30),\"\",'Resumen anual'!A30)","v":""},{"$f":"IF(ISBLANK('Resumen anual'!B30),\"\",'Resumen anual'!B30)","v":""},0,0,0]
[{"$f":"IF(ISBLANK('Resumen anual'!A31),\"\",'Resumen anual'!A31)","v":""},{"$f":"IF(ISBLANK('Resumen anual'!B31),\"\",'Resumen anual'!B31)","v":""},0,0,0]
[{"$f":"IF(ISBLANK('Resumen anual'!A32),\"\",'Resumen anual'!A32)","v":""},{"$f":"IF(ISBLANK('Resumen anual'!B32),\"\",'Resumen anual'!B32)","v":""},0,0,0]
[{"$f":"IF(ISBLANK('Resumen anual'!A33),\"\",'Resumen anual'!A33)","v":""},{"$f":"IF(ISBLANK('Resumen anual'!B33),\"\",'Resumen anual'!B33)","v":""},0,0,0]
[{"$f":"IF(ISBLANK('Resumen anual'!A34),\"\",'Resumen anual'!A34)","v":""},{"$f":"IF(ISBLANK('Resumen anual'!B34),\"\",'Resumen anual'!B34)","v":""},0,0,0]
[{"$f":"IF(ISBLANK('Resumen anual'!A35),\"\",'Resumen anual'!A35)","v":""},{"$f":"IF(ISBLANK('Resumen anual'!B35),\"\",'Resumen anual'!B35)","v":""},0,0,0]
[{"$f":"IF(ISBLANK('Resumen anual'!A36),\"\",'Resumen anual'!A36)","v":""},{"$f":"IF(ISBLANK('Resumen anual'!B36),\"\",'Resumen anual'!B36)","v":""},0,0,0]

{"sheet":"T 3","index":3,"n_rows":36,"n_cols":97,"rows_kept":36,"merged":[[3,0,3,6]]}
[{"$f":"Nombre_de_la_compañía","v":"Nombre de la empresa"}]
["Seguimiento de asistencia, tercer trimestre"]
["Fecha"]
[{"$f":"Nombre_de_la_compañía","v":"Nombre de la empresa"},{"$nulls":6},"CONFIDENCIAL"]
["Apellidos","Nombre","Vacaciones","Personal","Enfermedad","07/01","07/02","07/03","07/04","07/05","07/06","07/07","07/08","07/09","07/10","07/11","07/12","07/13","07/14","07/15","07/16","07/17","07/18","07/19","07/20","07/21","07/22","07/23","07/24","07/25","07/26","07/27","07/28","07/29","07/30","07/31","08/01","08/02","08/03","08/04","08/05","08/06","08/07","08/08","08/09","08/10","08/11","08/12","08/13","08/14","08/15","08/16","08/17","08/18","08/19","08/20","08/21","08/22","08/23","08/24","08/25","08/26","08/27","08/28","08/29","08/30","08/31","09/01","09/02","09/03","09/04","09/05","09/06","09/07","09/08","09/09","09/10","09/11","09/12","09/13","09/14","09/15","09/16","09/17","09/18","09/19","09/20","09/21","09/22","09/23","09/24","09/25","09/26","09/27","09/28","09/29","09/30"]
[{"$f":"IF(ISBLANK('Resumen anual'!A6),\"\",'Resumen anual'!A6)","v":"Apellidos"},{"$f":"IF(ISBLANK('Resumen anual'!B6),\"\",'Resumen anual'!B6)","v":"Nombre"},{"$f":"COUNTIF($F6:$CS6, \"V\")","v":0},{"$f":"COUNTIF($F6:$CS6, \"P\")","v":0},{"$f":"COUNTIF($F6:$CS6, \"E\")","v":0}]
[{"$f":"IF(ISBLANK('Resumen anual'!A7),\"\",'Resumen anual'!A7)","v":""},{"$f":"IF(ISBLANK('Resumen anual'!B7),\"\",'Resumen anual'!B7)","v":""},{"$f":"COUNTIF($F7:$CS7, \"V\")","v":0},{"$f":"COUNTIF($F7:$CS7, \"P\")","v":0},0]
[{"$f":"IF(ISBLANK('Resumen anual'!A8),\"\",'Resumen anual'!A8)","v":""},{"$f":"IF(ISBLANK('Resumen anual'!B8),\"\",'Resumen anual'!B8)","v":""},0,0,0]
[{"$f":"IF(ISBLANK('Resumen anual'!A9),\"\",'Resumen anual'!A9)","v":""},{"$f":"IF(ISBLANK('Resumen anual'!B9),\"\",'Resumen anual'!B9)","v":""},0,0,0]
[{"$f":"IF(ISBLANK('Resumen anual'!A10),\"\",'Resumen anual'!A10)","v":""},{"$f":"IF(ISBLANK('Resumen anual'!B10),\"\",'Resumen anual'!B10)","v":""},0,0,0]
[{"$f":"IF(ISBLANK('Resumen anual'!A11),\"\",'Resumen anual'!A11)","v":""},{"$f":"IF(ISBLANK('Resumen anual'!B11),\"\",'Resumen anual'!B11)","v":""},0,0,0]
[{"$f":"IF(ISBLANK('Resumen anual'!A12),\"\",'Resumen anual'!A12)","v":""},{"$f":"IF(ISBLANK('Resumen anual'!B12),\"\",'Resumen anual'!B12)","v":""},0,0,0]
[{"$f":"IF(ISBLANK('Resumen anual'!A13),\"\",'Resumen anual'!A13)","v":""},{"$f":"IF(ISBLANK('Resumen anual'!B13),\"\",'Resumen anual'!B13)","v":""},0,0,0]
[{"$f":"IF(ISBLANK('Resumen anual'!A14),\"\",'Resumen anual'!A14)","v":""},{"$f":"IF(ISBLANK('Resumen anual'!B14),\"\",'Resumen anual'!B14)","v":""},0,0,0]
[{"$f":"IF(ISBLANK('Resumen anual'!A15),\"\",'Resumen anual'!A15)","v":""},{"$f":"IF(ISBLANK('Resumen anual'!B15),\"\",'Resumen anual'!B15)","v":""},0,0,0]
[{"$f":"IF(ISBLANK('Resumen anual'!A16),\"\",'Resumen anual'!A16)","v":""},{"$f":"IF(ISBLANK('Resumen anual'!B16),\"\",'Resumen anual'!B16)","v":""},0,0,0]
[{"$f":"IF(ISBLANK('Resumen anual'!A17),\"\",'Resumen anual'!A17)","v":""},{"$f":"IF(ISBLANK('Resumen anual'!B17),\"\",'Resumen anual'!B17)","v":""},0,0,0]
[{"$f":"IF(ISBLANK('Resumen anual'!A18),\"\",'Resumen anual'!A18)","v":""},{"$f":"IF(ISBLANK('Resumen anual'!B18),\"\",'Resumen anual'!B18)","v":""},0,0,0]
[{"$f":"IF(ISBLANK('Resumen anual'!A19),\"\",'Resumen anual'!A19)","v":""},{"$f":"IF(ISBLANK('Resumen anual'!B19),\"\",'Resumen anual'!B19)","v":""},0,0,0]
[{"$f":"IF(ISBLANK('Resumen anual'!A20),\"\",'Resumen anual'!A20)","v":""},{"$f":"IF(ISBLANK('Resumen anual'!B20),\"\",'Resumen anual'!B20)","v":""},0,0,0]
[{"$f":"IF(ISBLANK('Resumen anual'!A21),\"\",'Resumen anual'!A21)","v":""},{"$f":"IF(ISBLANK('Resumen anual'!B21),\"\",'Resumen anual'!B21)","v":""},0,0,0]
[{"$f":"IF(ISBLANK('Resumen anual'!A22),\"\",'Resumen anual'!A22)","v":""},{"$f":"IF(ISBLANK('Resumen anual'!B22),\"\",'Resumen anual'!B22)","v":""},0,0,0]
[{"$f":"IF(ISBLANK('Resumen anual'!A23),\"\",'Resumen anual'!A23)","v":""},{"$f":"IF(ISBLANK('Resumen anual'!B23),\"\",'Resumen anual'!B23)","v":""},0,0,0]
[{"$f":"IF(ISBLANK('Resumen anual'!A24),\"\",'Resumen anual'!A24)","v":""},{"$f":"IF(ISBLANK('Resumen anual'!B24),\"\",'Resumen anual'!B24)","v":""},0,0,0]
[{"$f":"IF(ISBLANK('Resumen anual'!A25),\"\",'Resumen anual'!A25)","v":""},{"$f":"IF(ISBLANK('Resumen anual'!B25),\"\",'Resumen anual'!B25)","v":""},0,0,0]
[{"$f":"IF(ISBLANK('Resumen anual'!A26),\"\",'Resumen anual'!A26)","v":""},{"$f":"IF(ISBLANK('Resumen anual'!B26),\"\",'Resumen anual'!B26)","v":""},0,0,0]
[{"$f":"IF(ISBLANK('Resumen anual'!A27),\"\",'Resumen anual'!A27)","v":""},{"$f":"IF(ISBLANK('Resumen anual'!B27),\"\",'Resumen anual'!B27)","v":""},0,0,0]
[{"$f":"IF(ISBLANK('Resumen anual'!A28),\"\",'Resumen anual'!A28)","v":""},{"$f":"IF(ISBLANK('Resumen anual'!B28),\"\",'Resumen anual'!B28)","v":""},0,0,0]
[{"$f":"IF(ISBLANK('Resumen anual'!A29),\"\",'Resumen anual'!A29)","v":""},{"$f":"IF(ISBLANK('Resumen anual'!B29),\"\",'Resumen anual'!B29)","v":""},0,0,0]
[{"$f":"IF(ISBLANK('Resumen anual'!A30),\"\",'Resumen anual'!A30)","v":""},{"$f":"IF(ISBLANK('Resumen anual'!B30),\"\",'Resumen anual'!B30)","v":""},0,0,0]
[{"$f":"IF(ISBLANK('Resumen anual'!A31),\"\",'Resumen anual'!A31)","v":""},{"$f":"IF(ISBLANK('Resumen anual'!B31),\"\",'Resumen anual'!B31)","v":""},0,0,0]
[{"$f":"IF(ISBLANK('Resumen anual'!A32),\"\",'Resumen anual'!A32)","v":""},{"$f":"IF(ISBLANK('Resumen anual'!B32),\"\",'Resumen anual'!B32)","v":""},0,0,0]
[{"$f":"IF(ISBLANK('Resumen anual'!A33),\"\",'Resumen anual'!A33)","v":""},{"$f":"IF(ISBLANK('Resumen anual'!B33),\"\",'Resumen anual'!B33)","v":""},0,0,0]
[{"$f":"IF(ISBLANK('Resumen anual'!A34),\"\",'Resumen anual'!A34)","v":""},{"$f":"IF(ISBLANK('Resumen anual'!B34),\"\",'Resumen anual'!B34)","v":""},0,0,0]
[{"$f":"IF(ISBLANK('Resumen anual'!A35),\"\",'Resumen anual'!A35)","v":""},{"$f":"IF(ISBLANK('Resumen anual'!B35),\"\",'Resumen anual'!B35)","v":""},0,0,0]
[{"$f":"IF(ISBLANK('Resumen anual'!A36),\"\",'Resumen anual'!A36)","v":""},{"$f":"IF(ISBLANK('Resumen anual'!B36),\"\",'Resumen anual'!B36)","v":""},0,0,0]

{"sheet":"T 4","index":4,"n_rows":36,"n_cols":97,"rows_kept":36,"merged":[[3,0,3,6]]}
[{"$f":"Nombre_de_la_compañía","v":"Nombre de la empresa"}]
["Seguimiento de asistencia, cuarto trimestre"]
["Fecha"]
[{"$f":"Nombre_de_la_compañía","v":"Nombre de la empresa"},{"$nulls":6},"CONFIDENCIAL"]
["Apellidos","Nombre","Vacaciones","Personal","Enfermedad","10/01","10/02","10/03","10/04","10/05","10/06","10/07","10/08","10/09","10/10","10/11","10/12","10/13","10/14","10/15","10/16","10/17","10/18","10/19","10/20","10/21","10/22","10/23","10/24","10/25","10/26","10/27","10/28","10/29","10/30","10/31","11/01","11/02","11/03","11/04","11/05","11/06","11/07","11/08","11/09","11/10","11/11","11/12","11/13","11/14","11/15","11/16","11/17","11/18","11/19","11/20","11/21","11/22","11/23","11/24","11/25","11/26","11/27","11/28","11/29","11/30","12/01","12/02","12/03","12/04","12/05","12/06","12/07","12/08","12/09","12/10","12/11","12/12","12/13","12/14","12/15","12/16","12/17","12/18","12/19","12/20","12/21","12/22","12/23","12/24","12/25","12/26","12/27","12/28","12/29","12/30","12/31"]
[{"$f":"IF(ISBLANK('Resumen anual'!A6),\"\",'Resumen anual'!A6)","v":"Apellidos"},{"$f":"IF(ISBLANK('Resumen anual'!B6),\"\",'Resumen anual'!B6)","v":"Nombre"},{"$f":"COUNTIF($F6:$CS6, \"V\")","v":0},{"$f":"COUNTIF($F6:CS6, \"P\")","v":0},{"$f":"COUNTIF($F6:CS6, \"E\")","v":0}]
[{"$f":"IF(ISBLANK('Resumen anual'!A7),\"\",'Resumen anual'!A7)","v":""},{"$f":"IF(ISBLANK('Resumen anual'!B7),\"\",'Resumen anual'!B7)","v":""},0,{"$f":"COUNTIF($F7:CS7, \"P\")","v":0},{"$f":"COUNTIF($F7:CS7, \"E\")","v":0}]
[{"$f":"IF(ISBLANK('Resumen anual'!A8),\"\",'Resumen anual'!A8)","v":""},{"$f":"IF(ISBLANK('Resumen anual'!B8),\"\",'Resumen anual'!B8)","v":""},0,{"$f":"COUNTIF($F8:CS8, \"P\")","v":0},{"$f":"COUNTIF($F8:CS8, \"E\")","v":0}]
[{"$f":"IF(ISBLANK('Resumen anual'!A9),\"\",'Resumen anual'!A9)","v":""},{"$f":"IF(ISBLANK('Resumen anual'!B9),\"\",'Resumen anual'!B9)","v":""},0,{"$f":"COUNTIF($F9:CS9, \"P\")","v":0},{"$f":"COUNTIF($F9:CS9, \"E\")","v":0}]
[{"$f":"IF(ISBLANK('Resumen anual'!A10),\"\",'Resumen anual'!A10)","v":""},{"$f":"IF(ISBLANK('Resumen anual'!B10),\"\",'Resumen anual'!B10)","v":""},0,{"$f":"COUNTIF($F10:CS10, \"P\")","v":0},{"$f":"COUNTIF($F10:CS10, \"E\")","v":0}]
[{"$f":"IF(ISBLANK('Resumen anual'!A11),\"\",'Resumen anual'!A11)","v":""},{"$f":"IF(ISBLANK('Resumen anual'!B11),\"\",'Resumen anual'!B11)","v":""},0,{"$f":"COUNTIF($F11:CS11, \"P\")","v":0},{"$f":"COUNTIF($F11:CS11, \"E\")","v":0}]
[{"$f":"IF(ISBLANK('Resumen anual'!A12),\"\",'Resumen anual'!A12)","v":""},{"$f":"IF(ISBLANK('Resumen anual'!B12),\"\",'Resumen anual'!B12)","v":""},0,{"$f":"COUNTIF($F12:CS12, \"P\")","v":0},{"$f":"COUNTIF($F12:CS12, \"E\")","v":0}]
[{"$f":"IF(ISBLANK('Resumen anual'!A13),\"\",'Resumen anual'!A13)","v":""},{"$f":"IF(ISBLANK('Resumen anual'!B13),\"\",'Resumen anual'!B13)","v":""},0,{"$f":"COUNTIF($F13:CS13, \"P\")","v":0},{"$f":"COUNTIF($F13:CS13, \"E\")","v":0}]
[{"$f":"IF(ISBLANK('Resumen anual'!A14),\"\",'Resumen anual'!A14)","v":""},{"$f":"IF(ISBLANK('Resumen anual'!B14),\"\",'Resumen anual'!B14)","v":""},0,{"$f":"COUNTIF($F14:CS14, \"P\")","v":0},{"$f":"COUNTIF($F14:CS14, \"E\")","v":0}]
[{"$f":"IF(ISBLANK('Resumen anual'!A15),\"\",'Resumen anual'!A15)","v":""},{"$f":"IF(ISBLANK('Resumen anual'!B15),\"\",'Resumen anual'!B15)","v":""},0,{"$f":"COUNTIF($F15:CS15, \"P\")","v":0},{"$f":"COUNTIF($F15:CS15, \"E\")","v":0}]
[{"$f":"IF(ISBLANK('Resumen anual'!A16),\"\",'Resumen anual'!A16)","v":""},{"$f":"IF(ISBLANK('Resumen anual'!B16),\"\",'Resumen anual'!B16)","v":""},0,{"$f":"COUNTIF($F16:CS16, \"P\")","v":0},{"$f":"COUNTIF($F16:CS16, \"E\")","v":0}]
[{"$f":"IF(ISBLANK('Resumen anual'!A17),\"\",'Resumen anual'!A17)","v":""},{"$f":"IF(ISBLANK('Resumen anual'!B17),\"\",'Resumen anual'!B17)","v":""},0,{"$f":"COUNTIF($F17:CS17, \"P\")","v":0},{"$f":"COUNTIF($F17:CS17, \"E\")","v":0}]
[{"$f":"IF(ISBLANK('Resumen anual'!A18),\"\",'Resumen anual'!A18)","v":""},{"$f":"IF(ISBLANK('Resumen anual'!B18),\"\",'Resumen anual'!B18)","v":""},0,{"$f":"COUNTIF($F18:CS18, \"P\")","v":0},{"$f":"COUNTIF($F18:CS18, \"E\")","v":0}]
[{"$f":"IF(ISBLANK('Resumen anual'!A19),\"\",'Resumen anual'!A19)","v":""},{"$f":"IF(ISBLANK('Resumen anual'!B19),\"\",'Resumen anual'!B19)","v":""},0,{"$f":"COUNTIF($F19:CS19, \"P\")","v":0},{"$f":"COUNTIF($F19:CS19, \"E\")","v":0}]
[{"$f":"IF(ISBLANK('Resumen anual'!A20),\"\",'Resumen anual'!A20)","v":""},{"$f":"IF(ISBLANK('Resumen anual'!B20),\"\",'Resumen anual'!B20)","v":""},0,{"$f":"COUNTIF($F20:CS20, \"P\")","v":0},{"$f":"COUNTIF($F20:CS20, \"E\")","v":0}]
[{"$f":"IF(ISBLANK('Resumen anual'!A21),\"\",'Resumen anual'!A21)","v":""},{"$f":"IF(ISBLANK('Resumen anual'!B21),\"\",'Resumen anual'!B21)","v":""},0,{"$f":"COUNTIF($F21:CS21, \"P\")","v":0},{"$f":"COUNTIF($F21:CS21, \"E\")","v":0}]
[{"$f":"IF(ISBLANK('Resumen anual'!A22),\"\",'Resumen anual'!A22)","v":""},{"$f":"IF(ISBLANK('Resumen anual'!B22),\"\",'Resumen anual'!B22)","v":""},0,{"$f":"COUNTIF($F22:CS22, \"P\")","v":0},{"$f":"COUNTIF($F22:CS22, \"E\")","v":0}]
[{"$f":"IF(ISBLANK('Resumen anual'!A23),\"\",'Resumen anual'!A23)","v":""},{"$f":"IF(ISBLANK('Resumen anual'!B23),\"\",'Resumen anual'!B23)","v":""},0,{"$f":"COUNTIF($F23:CS23, \"P\")","v":0},{"$f":"COUNTIF($F23:CS23, \"E\")","v":0}]
[{"$f":"IF(ISBLANK('Resumen anual'!A24),\"\",'Resumen anual'!A24)","v":""},{"$f":"IF(ISBLANK('Resumen anual'!B24),\"\",'Resumen anual'!B24)","v":""},0,{"$f":"COUNTIF($F24:CS24, \"P\")","v":0},{"$f":"COUNTIF($F24:CS24, \"E\")","v":0}]
[{"$f":"IF(ISBLANK('Resumen anual'!A25),\"\",'Resumen anual'!A25)","v":""},{"$f":"IF(ISBLANK('Resumen anual'!B25),\"\",'Resumen anual'!B25)","v":""},0,{"$f":"COUNTIF($F25:CS25, \"P\")","v":0},{"$f":"COUNTIF($F25:CS25, \"E\")","v":0}]
[{"$f":"IF(ISBLANK('Resumen anual'!A26),\"\",'Resumen anual'!A26)","v":""},{"$f":"IF(ISBLANK('Resumen anual'!B26),\"\",'Resumen anual'!B26)","v":""},0,{"$f":"COUNTIF($F26:CS26, \"P\")","v":0},{"$f":"COUNTIF($F26:CS26, \"E\")","v":0}]
[{"$f":"IF(ISBLANK('Resumen anual'!A27),\"\",'Resumen anual'!A27)","v":""},{"$f":"IF(ISBLANK('Resumen anual'!B27),\"\",'Resumen anual'!B27)","v":""},0,{"$f":"COUNTIF($F27:CS27, \"P\")","v":0},{"$f":"COUNTIF($F27:CS27, \"E\")","v":0}]
[{"$f":"IF(ISBLANK('Resumen anual'!A28),\"\",'Resumen anual'!A28)","v":""},{"$f":"IF(ISBLANK('Resumen anual'!B28),\"\",'Resumen anual'!B28)","v":""},0,{"$f":"COUNTIF($F28:CS28, \"P\")","v":0},{"$f":"COUNTIF($F28:CS28, \"E\")","v":0}]
[{"$f":"IF(ISBLANK('Resumen anual'!A29),\"\",'Resumen anual'!A29)","v":""},{"$f":"IF(ISBLANK('Resumen anual'!B29),\"\",'Resumen anual'!B29)","v":""},0,{"$f":"COUNTIF($F29:CS29, \"P\")","v":0},{"$f":"COUNTIF($F29:CS29, \"E\")","v":0}]
[{"$f":"IF(ISBLANK('Resumen anual'!A30),\"\",'Resumen anual'!A30)","v":""},{"$f":"IF(ISBLANK('Resumen anual'!B30),\"\",'Resumen anual'!B30)","v":""},0,{"$f":"COUNTIF($F30:CS30, \"P\")","v":0},{"$f":"COUNTIF($F30:CS30, \"E\")","v":0}]
[{"$f":"IF(ISBLANK('Resumen anual'!A31),\"\",'Resumen anual'!A31)","v":""},{"$f":"IF(ISBLANK('Resumen anual'!B31),\"\",'Resumen anual'!B31)","v":""},0,{"$f":"COUNTIF($F31:CS31, \"P\")","v":0},{"$f":"COUNTIF($F31:CS31, \"E\")","v":0}]
[{"$f":"IF(ISBLANK('Resumen anual'!A32),\"\",'Resumen anual'!A32)","v":""},{"$f":"IF(ISBLANK('Resumen anual'!B32),\"\",'Resumen anual'!B32)","v":""},0,{"$f":"COUNTIF($F32:CS32, \"P\")","v":0},{"$f":"COUNTIF($F32:CS32, \"E\")","v":0}]
[{"$f":"IF(ISBLANK('Resumen anual'!A33),\"\",'Resumen anual'!A33)","v":""},{"$f":"IF(ISBLANK('Resumen anual'!B33),\"\",'Resumen anual'!B33)","v":""},0,{"$f":"COUNTIF($F33:CS33, \"P\")","v":0},{"$f":"COUNTIF($F33:CS33, \"E\")","v":0}]
[{"$f":"IF(ISBLANK('Resumen anual'!A34),\"\",'Resumen anual'!A34)","v":""},{"$f":"IF(ISBLANK('Resumen anual'!B34),\"\",'Resumen anual'!B34)","v":""},0,{"$f":"COUNTIF($F34:CS34, \"P\")","v":0},{"$f":"COUNTIF($F34:CS34, \"E\")","v":0}]
[{"$f":"IF(ISBLANK('Resumen anual'!A35),\"\",'Resumen anual'!A35)","v":""},{"$f":"IF(ISBLANK('Resumen anual'!B35),\"\",'Resumen anual'!B35)","v":""},0,{"$f":"COUNTIF($F35:CS35, \"P\")","v":0},{"$f":"COUNTIF($F35:CS35, \"E\")","v":0}]
[{"$f":"IF(ISBLANK('Resumen anual'!A36),\"\",'Resumen anual'!A36)","v":""},{"$f":"IF(ISBLANK('Resumen anual'!B36),\"\",'Resumen anual'!B36)","v":""},0,{"$f":"COUNTIF($F36:CS36, \"P\")","v":0},{"$f":"COUNTIF($F36:CS36, \"E\")","v":0}]