{"text_format":"3","workbook":"xlsx","n_sheets":4,"sheets":["INICIO","PARÁMETROS DEL PROYECTO","DETALLES DEL PROYECTO","TOTALES DEL PROYECTO"],"not_rendered":{"charts":2,"defined_names":3,"pivot_tables":1},"read":"whole","date_system":"1900"}

{"sheet":"INICIO","index":0,"n_rows":7,"n_cols":2,"rows_kept":7}
[null,"INFORMACIÓN SOBRE ESTA PLANTILLA"]
[null,"Realice un seguimiento de los parámetros, detalles y totales del proyecto en este libro Seguimiento de planificación de eventos."]
[null,"Escriba la información en la hoja de cálculo Parámetros del proyecto para actualizar los gráficos de columnas y la hoja de cálculo Detalles del proyecto. La tabla dinámica en la hoja de cálculo Totales del proyecto se actualiza automáticamente."]
[null,"Rellene el nombre de la empresa en la hoja de cálculo Parámetros y se actualizará automáticamente en otras hojas de cálculo."]
[null,"Nota:  "]
[null,"Se facilitan instrucciones adicionales en la columna A de cada hoja de cálculo del libro SEGUIMIENTO DE PLANIFICACIÓN. Este texto se ha ocultado de forma intencionada. Para eliminar el texto, seleccione la columna A y, a continuación, ELIMINAR. Para mostrar el texto, seleccione la columna A y, a continuación, cambie el color de fuente."]
{"$rows_left_out":2}
{"sheet":"PARÁMETROS DEL PROYECTO","index":1,"n_rows":24,"n_cols":9,"rows_kept":24,"merged":[[13,5,13,8],[23,1,42,3]]}
["Cree los Parámetros del proyecto en esta hoja de cálculo. Escriba el nombre de la empresa en la celda de la derecha. En las celdas de esta columna encontrará instrucciones útiles. Presione la flecha abajo para empezar.","Nombre de la empresa"]
["El título de esta hoja de cálculo se encuentra en la celda de la derecha.","Seguimiento de proyecto de administración de eventos"]
["El mensaje de confidencialidad está en la celda a la derecha.",{"$f":"B1&\" confidencial\"","v":"Nombre de la empresa confidencial"}]
["Hay una sugerencia en la celda de la derecha.","Las celdas sombreadas se calculan automáticamente. No es necesario que escriba nada en ellas."]
["Escriba la información en la tabla Parámetros que comienza en la celda de la derecha. La instrucción siguiente se encuentra en la celda A12.","TIPO DE PROYECTO","ADMINISTRADOR DE CUENTAS","JEFE DE PROYECTO","ADMINISTRADOR DE ESTRATEGIAS","ESPECIALISTA DE DISEÑO","PERSONAL DEL EVENTO","PERSONAL DE ADMINISTRACIÓN","Total"]
[null,"Desarrollo de la estrategia del evento",{"v":0.2,"d":"20%"},{"v":0.1,"d":"10%"},{"v":0.6,"d":"60%"},{"v":0,"d":"0%"},{"v":0,"d":"0%"},{"v":0.1,"d":"10%"},{"$f":"SUM(Parámetros[[#This Row],[ADMINISTRADOR DE CUENTAS]:[PERSONAL DE ADMINISTRACIÓN]])","v":{"v":1,"d":"100%"}}]
{"$rows_left_out":19}
{"sheet":"DETALLES DEL PROYECTO","index":2,"n_rows":10,"n_cols":23,"rows_kept":10}
["Cree los Detalles del proyecto en esta hoja de cálculo. El nombre de la empresa se actualiza automáticamente en la celda de la derecha. En las celdas de esta columna encontrará instrucciones útiles. Presione la flecha abajo para empezar.",{"$f":"'PARÁMETROS DEL PROYECTO'!B1","v":"Nombre de la empresa"}]
["El título de esta hoja de cálculo se encuentra en la celda de la derecha.","Seguimiento de proyecto de administración de eventos"]
["El mensaje de confidencialidad está en la celda a la derecha.",{"$f":"'PARÁMETROS DEL PROYECTO'!B3","v":"Nombre de la empresa confidencial"}]
["Escriba la información en la tabla Detalles del proyecto que comienza en la celda de la derecha.\nINFORMACIÓN\nPara agregar una fila en la tabla a la derecha, seleccione la celda inferior derecha en el cuerpo de la tabla (no en la fila totales) y presione la tecla Tab, o bien, presione la tecla MAYÚS y F10 donde quiere que la fila se inserte y seleccione Insertar | Filas de tabla encima o debajo.\nAsegúrese de que se eliminan todas las filas sin usar, ya que la tabla dinámica TOTALES DEL PROYECTO usará todas las celdas de tablas y, en caso contrario, podría proporcionar resultados erróneos.","NOMBRE DEL PROYECTO","TIPO DE PROYECTO","FECHA DE INICIO ESTIMADA","FECHA DE FIN ESTIMADA","INICIO REAL","FECHA DE FIN REAL","HORAS DE TRABAJO ESTIMADAS","HORAS DE TRABAJO REALES","DURACIÓN ESTIMADA","DURACIÓN REAL","ADMINISTRADOR DE CUENTAS","JEFE DE PROYECTO","ADMINISTRADOR DE ESTRATEGIAS","ESPECIALISTA DE DISEÑO","PERSONAL DEL EVENTO","PERSONAL DE ADMINISTRACIÓN","ADMINISTRADOR DE CUENTAS ","JEFE DE PROYECTO ","ADMINISTRADOR DE ESTRATEGIAS ","ESPECIALISTA DE DISEÑO ","PERSONAL DEL EVENTO ","PERSONAL DE ADMINISTRACIÓN "]
[null,"Proyecto 1","Desarrollo de la estrategia del evento",{"$f":"DATE(YEAR(TODAY()),6,9)","v":"2019-06-09"},{"$f":"DATE(YEAR(TODAY()),8,7)","v":"2019-08-07"},{"$f":"DATE(YEAR(TODAY()),6,29)","v":"2019-06-29"},{"$f":"DATE(YEAR(TODAY()),9,3)","v":"2019-09-03"},200,220,{"$f":"DAYS360(DetallesDelProyecto[[#This Row],[FECHA DE INICIO ESTIMADA]],DetallesDelProyecto[[#This Row],[FECHA DE FIN ESTIMADA]],FALSE)","v":58},{"$f":"DAYS360(DetallesDelProyecto[[#This Row],[INICIO REAL]],DetallesDelProyecto[[#This Row],[FECHA DE FIN REAL]],FALSE)","v":64},{"$f":"INDEX(Parámetros[],MATCH(DetallesDelProyecto[[#This Row],[TIPO DE PROYECTO]],Parámetros[TIPO DE PROYECTO],0),MATCH(DetallesDelProyecto[[#Headers],[ADMINISTRADOR DE CUENTAS]],Parámetros[#Headers],0))*INDEX('PARÁMETROS DEL PROYECTO'!$B$12:$H$12,1,MATCH(DetallesDelProyecto[[#Headers],[ADMINISTRADOR DE CUENTAS]],Parámetros[#Headers],0))*DetallesDelProyecto[[#This Row],[HORAS DE TRABAJO ESTIMADAS]]","v":{"v":7200,"d":"7,200.00 €"}},{"$f":"INDEX(Parámetros[],MATCH(DetallesDelProyecto[[#This Row],[TIPO DE PROYECTO]],Parámetros[TIPO DE PROYECTO],0),MATCH(DetallesDelProyecto[[#Headers],[JEFE DE PROYECTO]],Parámetros[#Headers],0))*INDEX('PARÁMETROS DEL PROYECTO'!$B$12:$H$12,1,MATCH(DetallesDelProyecto[[#Headers],[JEFE DE PROYECTO]],Parámetros[#Headers],0))*DetallesDelProyecto[[#This Row],[HORAS DE TRABAJO ESTIMADAS]]","v":{"v":2400,"d":"2,400.00 €"}},{"$f":"INDEX(Parámetros[],MATCH(DetallesDelProyecto[[#This Row],[TIPO DE PROYECTO]],Parámetros[TIPO DE PROYECTO],0),MATCH(DetallesDelProyecto[[#Headers],[ADMINISTRADOR DE ESTRATEGIAS]],Parámetros[#Headers],0))*INDEX('PARÁMETROS DEL PROYECTO'!$B$12:$H$12,1,MATCH(DetallesDelProyecto[[#Headers],[ADMINISTRADOR DE ESTRATEGIAS]],Parámetros[#Headers],0))*DetallesDelProyecto[[#This Row],[HORAS DE TRABAJO ESTIMADAS]]","v":{"v":18000,"d":"18,000.00 €"}},{"$f":"INDEX(Parámetros[],MATCH(DetallesDelProyecto[[#This Row],[TIPO DE PROYECTO]],Parámetros[TIPO DE PROYECTO],0),MATCH(DetallesDelProyecto[[#Headers],[ESPECIALISTA DE DISEÑO]],Parámetros[#Headers],0))*INDEX('PARÁMETROS DEL PROYECTO'!$B$12:$H$12,1,MATCH(DetallesDelProyecto[[#Headers],[ESPECIALISTA DE DISEÑO]],Parámetros[#Headers],0))*DetallesDelProyecto[[#This Row],[HORAS DE TRABAJO ESTIMADAS]]","v":{"v":0,"d":"0.00 €"}},{"$f":"INDEX(Parámetros[],MATCH(DetallesDelProyecto[[#This Row],[TIPO DE PROYECTO]],Parámetros[TIPO DE PROYECTO],0),MATCH(DetallesDelProyecto[[#Headers],[PERSONAL DEL EVENTO]],Parámetros[#Headers],0))*INDEX('PARÁMETROS DEL PROYECTO'!$B$12:$H$12,1,MATCH(DetallesDelProyecto[[#Headers],[PERSONAL DEL EVENTO]],Parámetros[#Headers],0))*DetallesDelProyecto[[#This Row],[HORAS DE TRABAJO ESTIMADAS]]","v":{"v":0,"d":"0.00 €"}},{"$f":"INDEX(Parámetros[],MATCH(DetallesDelProyecto[[#This Row],[TIPO DE PROYECTO]],Parámetros[TIPO DE PROYECTO],0),MATCH(DetallesDelProyecto[[#Headers],[PERSONAL DE ADMINISTRACIÓN]],Parámetros[#Headers],0))*INDEX('PARÁMETROS DEL PROYECTO'!$B$12:$H$12,1,MATCH(DetallesDelProyecto[[#Headers],[PERSONAL DE ADMINISTRACIÓN]],Parámetros[#Headers],0))*DetallesDelProyecto[[#This Row],[HORAS DE TRABAJO ESTIMADAS]]","v":{"v":1200,"d":"1,200.00 €"}},{"$f":"INDEX(Parámetros[],MATCH(DetallesDelProyecto[[#This Row],[TIPO DE PROYECTO]],Parámetros[TIPO DE PROYECTO],0),MATCH(DetallesDelProyecto[[#Headers],[ADMINISTRADOR DE CUENTAS]],Parámetros[#Headers],0))*INDEX('PARÁMETROS DEL PROYECTO'!$B$12:$H$12,1,MATCH(DetallesDelProyecto[[#Headers],[ADMINISTRADOR DE CUENTAS]],Parámetros[#Headers],0))*DetallesDelProyecto[[#This Row],[HORAS DE TRABAJO REALES]]","v":{"v":7920,"d":"7,920.00 €"}},{"$f":"INDEX(Parámetros[],MATCH(DetallesDelProyecto[[#This Row],[TIPO DE PROYECTO]],Parámetros[TIPO DE PROYECTO],0),MATCH(DetallesDelProyecto[[#Headers],[JEFE DE PROYECTO]],Parámetros[#Headers],0))*INDEX('PARÁMETROS DEL PROYECTO'!$B$12:$H$12,1,MATCH(DetallesDelProyecto[[#Headers],[JEFE DE PROYECTO]],Parámetros[#Headers],0))*DetallesDelProyecto[[#This Row],[HORAS DE TRABAJO REALES]]","v":{"v":2640,"d":"2,640.00 €"}},{"$f":"INDEX(Parámetros[],MATCH(DetallesDelProyecto[[#This Row],[TIPO DE PROYECTO]],Parámetros[TIPO DE PROYECTO],0),MATCH(DetallesDelProyecto[[#Headers],[ADMINISTRADOR DE ESTRATEGIAS]],Parámetros[#Headers],0))*INDEX('PARÁMETROS DEL PROYECTO'!$B$12:$H$12,1,MATCH(DetallesDelProyecto[[#Headers],[ADMINISTRADOR DE ESTRATEGIAS]],Parámetros[#Headers],0))*DetallesDelProyecto[[#This Row],[HORAS DE TRABAJO REALES]]","v":{"v":19800,"d":"19,800.00 €"}},{"$f":"INDEX(Parámetros[],MATCH(DetallesDelProyecto[[#This Row],[TIPO DE PROYECTO]],Parámetros[TIPO DE PROYECTO],0),MATCH(DetallesDelProyecto[[#Headers],[ESPECIALISTA DE DISEÑO]],Parámetros[#Headers],0))*INDEX('PARÁMETROS DEL PROYECTO'!$B$12:$H$12,1,MATCH(DetallesDelProyecto[[#Headers],[ESPECIALISTA DE DISEÑO]],Parámetros[#Headers],0))*DetallesDelProyecto[[#This Row],[HORAS DE TRABAJO REALES]]","v":{"v":0,"d":"0.00 €"}},{"$f":"INDEX(Parámetros[],MATCH(DetallesDelProyecto[[#This Row],[TIPO DE PROYECTO]],Parámetros[TIPO DE PROYECTO],0),MATCH(DetallesDelProyecto[[#Headers],[PERSONAL DEL EVENTO]],Parámetros[#Headers],0))*INDEX('PARÁMETROS DEL PROYECTO'!$B$12:$H$12,1,MATCH(DetallesDelProyecto[[#Headers],[PERSONAL DEL EVENTO]],Parámetros[#Headers],0))*DetallesDelProyecto[[#This Row],[HORAS DE TRABAJO REALES]]","v":{"v":0,"d":"0.00 €"}},{"$f":"INDEX(Parámetros[],MATCH(DetallesDelProyecto[[#This Row],[TIPO DE PROYECTO]],Parámetros[TIPO DE PROYECTO],0),MATCH(DetallesDelProyecto[[#Headers],[PERSONAL DE ADMINISTRACIÓN]],Parámetros[#Headers],0))*INDEX('PARÁMETROS DEL PROYECTO'!$B$12:$H$12,1,MATCH(DetallesDelProyecto[[#Headers],[PERSONAL DE ADMINISTRACIÓN]],Parámetros[#Headers],0))*DetallesDelProyecto[[#This Row],[HORAS DE TRABAJO REALES]]","v":{"v":1320,"d":"1,320.00 €"}}]
[null,"Proyecto 2","Planificación de evento",{"$f":"DATE(YEAR(TODAY())+1,6,25)","v":"2020-06-25"},{"$f":"DATE(YEAR(TODAY())+1,7,27)","v":"2020-07-27"},{"$f":"DATE(YEAR(TODAY()),7,15)","v":"2019-07-15"},{"$f":"DATE(YEAR(TODAY())+1,8,25)","v":"2020-08-25"},400,390,{"$f":"DAYS360(DetallesDelProyecto[[#This Row],[FECHA DE INICIO ESTIMADA]],DetallesDelProyecto[[#This Row],[FECHA DE FIN ESTIMADA]],FALSE)","v":32},{"$f":"DAYS360(DetallesDelProyecto[[#This Row],[INICIO REAL]],DetallesDelProyecto[[#This Row],[FECHA DE FIN REAL]],FALSE)","v":400},{"$f":"INDEX(Parámetros[],MATCH(DetallesDelProyecto[[#This Row],[TIPO DE PROYECTO]],Parámetros[TIPO DE PROYECTO],0),MATCH(DetallesDelProyecto[[#Headers],[ADMINISTRADOR DE CUENTAS]],Parámetros[#Headers],0))*INDEX('PARÁMETROS DEL PROYECTO'!$B$12:$H$12,1,MATCH(DetallesDelProyecto[[#Headers],[ADMINISTRADOR DE CUENTAS]],Parámetros[#Headers],0))*DetallesDelProyecto[[#This Row],[HORAS DE TRABAJO ESTIMADAS]]","v":{"v":14400,"d":"14,400.00 €"}},{"$f":"INDEX(Parámetros[],MATCH(DetallesDelProyecto[[#This Row],[TIPO DE PROYECTO]],Parámetros[TIPO DE PROYECTO],0),MATCH(DetallesDelProyecto[[#Headers],[JEFE DE PROYECTO]],Parámetros[#Headers],0))*INDEX('PARÁMETROS DEL PROYECTO'!$B$12:$H$12,1,MATCH(DetallesDelProyecto[[#Headers],[JEFE DE PROYECTO]],Parámetros[#Headers],0))*DetallesDelProyecto[[#This Row],[HORAS DE TRABAJO ESTIMADAS]]","v":{"v":24000,"d":"24,000.00 €"}},{"$f":"INDEX(Parámetros[],MATCH(DetallesDelProyecto[[#This Row],[TIPO DE PROYECTO]],Parámetros[TIPO DE PROYECTO],0),MATCH(DetallesDelProyecto[[#Headers],[ADMINISTRADOR DE ESTRATEGIAS]],Parámetros[#Headers],0))*INDEX('PARÁMETROS DEL PROYECTO'!$B$12:$H$12,1,MATCH(DetallesDelProyecto[[#Headers],[ADMINISTRADOR DE ESTRATEGIAS]],Parámetros[#Headers],0))*DetallesDelProyecto[[#This Row],[HORAS DE TRABAJO ESTIMADAS]]","v":{"v":6000,"d":"6,000.00 €"}},{"$f":"INDEX(Parámetros[],MATCH(DetallesDelProyecto[[#This Row],[TIPO DE PROYECTO]],Parámetros[TIPO DE PROYECTO],0),MATCH(DetallesDelProyecto[[#Headers],[ESPECIALISTA DE DISEÑO]],Parámetros[#Headers],0))*INDEX('PARÁMETROS DEL PROYECTO'!$B$12:$H$12,1,MATCH(DetallesDelProyecto[[#Headers],[ESPECIALISTA DE DISEÑO]],Parámetros[#Headers],0))*DetallesDelProyecto[[#This Row],[HORAS DE TRABAJO ESTIMADAS]]","v":{"v":4000,"d":"4,000.00 €"}},{"$f":"INDEX(Parámetros[],MATCH(DetallesDelProyecto[[#This Row],[TIPO DE PROYECTO]],Parámetros[TIPO DE PROYECTO],0),MATCH(DetallesDelProyecto[[#Headers],[PERSONAL DEL EVENTO]],Parámetros[#Headers],0))*INDEX('PARÁMETROS DEL PROYECTO'!$B$12:$H$12,1,MATCH(DetallesDelProyecto[[#Headers],[PERSONAL DEL EVENTO]],Parámetros[#Headers],0))*DetallesDelProyecto[[#This Row],[HORAS DE TRABAJO ESTIMADAS]]","v":{"v":0,"d":"0.00 €"}},{"$f":"INDEX(Parámetros[],MATCH(DetallesDelProyecto[[#This Row],[TIPO DE PROYECTO]],Parámetros[TIPO DE PROYECTO],0),MATCH(DetallesDelProyecto[[#Headers],[PERSONAL DE ADMINISTRACIÓN]],Parámetros[#Headers],0))*INDEX('PARÁMETROS DEL PROYECTO'!$B$12:$H$12,1,MATCH(DetallesDelProyecto[[#Headers],[PERSONAL DE ADMINISTRACIÓN]],Parámetros[#Headers],0))*DetallesDelProyecto[[#This Row],[HORAS DE TRABAJO ESTIMADAS]]","v":{"v":2400,"d":"2,400.00 €"}},{"$f":"INDEX(Parámetros[],MATCH(DetallesDelProyecto[[#This Row],[TIPO DE PROYECTO]],Parámetros[TIPO DE PROYECTO],0),MATCH(DetallesDelProyecto[[#Headers],[ADMINISTRADOR DE CUENTAS]],Parámetros[#Headers],0))*INDEX('PARÁMETROS DEL PROYECTO'!$B$12:$H$12,1,MATCH(DetallesDelProyecto[[#Headers],[ADMINISTRADOR DE CUENTAS]],Parámetros[#Headers],0))*DetallesDelProyecto[[#This Row],[HORAS DE TRABAJO REALES]]","v":{"v":14040,"d":"14,040.00 €"}},{"$f":"INDEX(Parámetros[],MATCH(DetallesDelProyecto[[#This Row],[TIPO DE PROYECTO]],Parámetros[TIPO DE PROYECTO],0),MATCH(DetallesDelProyecto[[#Headers],[JEFE DE PROYECTO]],Parámetros[#Headers],0))*INDEX('PARÁMETROS DEL PROYECTO'!$B$12:$H$12,1,MATCH(DetallesDelProyecto[[#Headers],[JEFE DE PROYECTO]],Parámetros[#Headers],0))*DetallesDelProyecto[[#This Row],[HORAS DE TRABAJO REALES]]","v":{"v":23400,"d":"23,400.00 €"}},{"$f":"INDEX(Parámetros[],MATCH(DetallesDelProyecto[[#This Row],[TIPO DE PROYECTO]],Parámetros[TIPO DE PROYECTO],0),MATCH(DetallesDelProyecto[[#Headers],[ADMINISTRADOR DE ESTRATEGIAS]],Parámetros[#Headers],0))*INDEX('PARÁMETROS DEL PROYECTO'!$B$12:$H$12,1,MATCH(DetallesDelProyecto[[#Headers],[ADMINISTRADOR DE ESTRATEGIAS]],Parámetros[#Headers],0))*DetallesDelProyecto[[#This Row],[HORAS DE TRABAJO REALES]]","v":{"v":5850,"d":"5,850.00 €"}},{"$f":"INDEX(Parámetros[],MATCH(DetallesDelProyecto[[#This Row],[TIPO DE PROYECTO]],Parámetros[TIPO DE PROYECTO],0),MATCH(DetallesDelProyecto[[#Headers],[ESPECIALISTA DE DISEÑO]],Parámetros[#Headers],0))*INDEX('PARÁMETROS DEL PROYECTO'!$B$12:$H$12,1,MATCH(DetallesDelProyecto[[#Headers],[ESPECIALISTA DE DISEÑO]],Parámetros[#Headers],0))*DetallesDelProyecto[[#This Row],[HORAS DE TRABAJO REALES]]","v":{"v":3900,"d":"3,900.00 €"}},{"$f":"INDEX(Parámetros[],MATCH(DetallesDelProyecto[[#This Row],[TIPO DE PROYECTO]],Parámetros[TIPO DE PROYECTO],0),MATCH(DetallesDelProyecto[[#Headers],[PERSONAL DEL EVENTO]],Parámetros[#Headers],0))*INDEX('PARÁMETROS DEL PROYECTO'!$B$12:$H$12,1,MATCH(DetallesDelProyecto[[#Headers],[PERSONAL DEL EVENTO]],Parámetros[#Headers],0))*DetallesDelProyecto[[#This Row],[HORAS DE TRABAJO REALES]]","v":{"v":0,"d":"0.00 €"}},{"$f":"INDEX(Parámetros[],MATCH(DetallesDelProyecto[[#This Row],[TIPO DE PROYECTO]],Parámetros[TIPO DE PROYECTO],0),MATCH(DetallesDelProyecto[[#Headers],[PERSONAL DE ADMINISTRACIÓN]],Parámetros[#Headers],0))*INDEX('PARÁMETROS DEL PROYECTO'!$B$12:$H$12,1,MATCH(DetallesDelProyecto[[#Headers],[PERSONAL DE ADMINISTRACIÓN]],Parámetros[#Headers],0))*DetallesDelProyecto[[#This Row],[HORAS DE TRABAJO REALES]]","v":{"v":2340,"d":"2,340.00 €"}}]
{"$rows_left_out":5}
{"sheet":"TOTALES DEL PROYECTO","index":3,"n_rows":10,"n_cols":14,"rows_kept":10}
["Obtenga los Totales del proyecto en esta hoja de cálculo. El nombre de la empresa se actualiza automáticamente en la celda de la derecha. En las celdas de esta columna encontrará instrucciones útiles. Presione la flecha abajo para empezar.",{"$f":"'PARÁMETROS DEL PROYECTO'!B1","v":"Nombre de la empresa"}]
["El título de esta hoja de cálculo se encuentra en la celda de la derecha.","Seguimiento de proyecto de administración de eventos"]
["El mensaje de confidencialidad está en la celda a la derecha.",{"$f":"'PARÁMETROS DEL PROYECTO'!B3","v":"Nombre de la empresa confidencial"}]
["La tabla dinámica que comienza en la celda de la derecha se actualiza automáticamente.\nINFORMACIÓN\nPara actualizar la tabla dinámica a la derecha, selecciónela (cualquier celda de la tabla dinámica), seleccione Actualizar en la pestaña de la cinta de opciones HERRAMIENTAS DE TABLA DINÁMICA | ANALIZAR o presione MAYÚS+F10 en cualquier celda de la tabla dinámica y luego seleccione Actualizar.","NOMBRE DEL PROYECTO","ESTIMACIÓN ADMINISTRADOR DE CUENTAS","ESTIMACIÓN JEFE DE PROYECTO","ESTIMACIÓN ADMINISTRADOR DE ESTRATEGIAS","ESTIMACIÓN ESPECIALISTA DE DISEÑO","ESTIMACIÓN PERSONAL DEL EVENTO","ESTIMACIÓN PERSONAL DE ADMINISTRACIÓN","ADMINISTRADOR DE LA CUENTA REAL","JEFE DE PROYECTO REAL","ADMINISTRADOR DE ESTRATEGIAS REAL","ESPECIALISTA DE DISEÑO REAL","PERSONAL DEL EVENTO REAL","PERSONAL DE ADMINISTRACIÓN REAL"]
[null,"Proyecto 1",{"v":7200,"d":"7,200.00 €"},{"v":2400,"d":"2,400.00 €"},{"v":18000,"d":"18,000.00 €"},{"v":0,"d":"0.00 €"},{"v":0,"d":"0.00 €"},{"v":1200,"d":"1,200.00 €"},{"v":7920,"d":"7,920.00 €"},{"v":2640,"d":"2,640.00 €"},{"v":19800,"d":"19,800.00 €"},{"v":0,"d":"0.00 €"},{"v":0,"d":"0.00 €"},{"v":1320,"d":"1,320.00 €"}]
[null,"Proyecto 2",{"v":14400,"d":"14,400.00 €"},{"v":24000,"d":"24,000.00 €"},{"v":6000,"d":"6,000.00 €"},{"v":4000,"d":"4,000.00 €"},{"v":0,"d":"0.00 €"},{"v":2400,"d":"2,400.00 €"},{"v":14040,"d":"14,040.00 €"},{"v":23400,"d":"23,400.00 €"},{"v":5850,"d":"5,850.00 €"},{"v":3900,"d":"3,900.00 €"},{"v":0,"d":"0.00 €"},{"v":2340,"d":"2,340.00 €"}]
{"$rows_left_out":4}