{"text_format":"3","workbook":"xlsx","n_sheets":4,"sheets":["Seguimiento de las puntuaciones","Su resultado","Configuración","Cálculos"],"not_rendered":{"defined_names":3,"comments":1},"read":"whole","date_system":"1900"}

{"sheet":"Seguimiento de las puntuaciones","index":0,"n_rows":14,"n_cols":6,"rows_kept":14}
[null,"Escriba aquí sus puntuaciones"]
[]
[null,null,"Asignatura","Tipo","Descripción","Puntuación"]
[null,null,"Francés moderno","Deberes","Historia de la Segunda Guerra Mundial",{"v":0.8,"d":"80%"}]
[null,null,"Programación avanzada en Java","Examen parcial",null,{"v":0.75,"d":"75%"}]
[null,null,"Español","Deberes",null,{"v":0.5,"d":"50%"}]
[null,null,"Física teórica","Deberes",null,{"v":0.95,"d":"95%"}]
[null,null,"Francés moderno","Deberes","Historia de la Primera Guerra Mundial",{"v":0.9,"d":"90%"}]
[null,null,"Francés moderno","Deberes","Páginas 30 - 41",{"v":0.8,"d":"80%"}]
[null,null,"Redacción","Redacción","Texto argumentativo",{"v":0.95,"d":"95%"}]
[null,null,"Matemáticas 1","Deberes","Páginas 21 y 26",{"v":0.8,"d":"80%"}]
[null,null,"Matemáticas 2","Deberes","Páginas 15 y 18",{"v":0.85,"d":"85%"}]
[null,null,"Matemáticas 1","Deberes","Páginas 34 - 36",{"v":0.8,"d":"80%"}]
[null,null,"Matemáticas 2","Concurso",null,{"v":0.95,"d":"95%"}]

{"sheet":"Su resultado","index":1,"n_rows":31,"n_cols":8,"rows_kept":31}
[null,"Su resultado"]
[]
[null,null,"Totales"]
[null,null,{"$f":"\"Horas: \"&SUM(tblAsignaturas[Créditos académicos])","v":"Horas: 24"},{"$f":"AVERAGE(D7:D31)","v":{"v":0.8104761904761906,"d":"81%"}},{"$f":"AVERAGE(E7:E31)","v":{"v":2.7142857142857144,"d":"2.71"}},{"$f":"SUM(F7:F31)","v":{"v":2.625,"d":"2.63"}},{"$f":"IFERROR(HLOOKUP(D4,lstAsignaciónPuntuaciones,2),\"\")","v":"Notable -"}]
[]
[null,null,"Asignaturas","%","Nota media","Nota media (p)","Calificación","Resultado global"]
[null,null,{"$f":"Cálculos!C6","v":"Francés moderno"},{"$f":"Cálculos!AL6","v":{"v":0.8333333333333334,"d":"83%"}},{"$f":"Cálculos!AM6","v":{"v":3,"d":"3.00"}},{"$f":"IFERROR(E7*Configuración!D9/SUM(tblAsignaturas[Créditos académicos]),\"\")","v":{"v":0.375,"d":"0.38"}},{"$f":"Cálculos!AN6","v":"Notable"}]
[null,null,{"$f":"Cálculos!C7","v":"Física teórica"},{"$f":"Cálculos!AL7","v":{"v":0.95,"d":"95%"}},{"$f":"Cálculos!AM7","v":{"v":4,"d":"4.00"}},{"$f":"IFERROR(E8*Configuración!D10/SUM(tblAsignaturas[Créditos académicos]),\"\")","v":{"v":0.5,"d":"0.50"}},{"$f":"Cálculos!AN7","v":"Sobresaliente"}]
[null,null,{"$f":"Cálculos!C8","v":"Matemáticas 1"},{"$f":"Cálculos!AL8","v":{"v":0.8000000000000002,"d":"80%"}},{"$f":"Cálculos!AM8","v":2.67},{"$f":"IFERROR(E9*Configuración!D11/SUM(tblAsignaturas[Créditos académicos]),\"\")","v":{"v":0.445,"d":"0.45"}},{"$f":"Cálculos!AN8","v":"Notable -"}]
[null,null,{"$f":"Cálculos!C9","v":"Matemáticas 2"},{"$f":"Cálculos!AL9","v":{"v":0.89,"d":"89%"}},{"$f":"Cálculos!AM9","v":3.33},{"$f":"IFERROR(E10*Configuración!D12/SUM(tblAsignaturas[Créditos académicos]),\"\")","v":{"v":0.555,"d":"0.56"}},{"$f":"Cálculos!AN9","v":"Notable +"}]
[null,null,{"$f":"Cálculos!C10","v":"Programación avanzada en Java"},{"$f":"Cálculos!AL10","v":{"v":0.7500000000000001,"d":"75%"}},{"$f":"Cálculos!AM10","v":{"v":2,"d":"2.00"}},{"$f":"IFERROR(E11*Configuración!D13/SUM(tblAsignaturas[Créditos académicos]),\"\")","v":{"v":0.4166666666666667,"d":"0.42"}},{"$f":"Cálculos!AN10","v":"Aprobado"}]
[null,null,{"$f":"Cálculos!C11","v":"Español"},{"$f":"Cálculos!AL11","v":{"v":0.5,"d":"50%"}},{"$f":"Cálculos!AM11","v":{"v":0,"d":"0.00"}},{"$f":"IFERROR(E12*Configuración!D14/SUM(tblAsignaturas[Créditos académicos]),\"\")","v":{"v":0,"d":"0.00"}},{"$f":"Cálculos!AN11","v":"Suspenso"}]
[null,null,{"$f":"Cálculos!C12","v":"Redacción"},{"$f":"Cálculos!AL12","v":{"v":0.95,"d":"95%"}},{"$f":"Cálculos!AM12","v":{"v":4,"d":"4.00"}},{"$f":"IFERROR(E13*Configuración!D15/SUM(tblAsignaturas[Créditos académicos]),\"\")","v":{"v":0.3333333333333333,"d":"0.33"}},{"$f":"Cálculos!AN12","v":"Sobresaliente"}]
[null,null,{"$f":"Cálculos!C13","v":""},{"$f":"Cálculos!AL13","v":""},{"$f":"Cálculos!AM13","v":""},{"$f":"IFERROR(E14*Configuración!D16/SUM(tblAsignaturas[Créditos académicos]),\"\")","v":""},{"$f":"Cálculos!AN13","v":""}]
[null,null,{"$f":"Cálculos!C14","v":""},{"$f":"Cálculos!AL14","v":""},{"$f":"Cálculos!AM14","v":""},{"$f":"IFERROR(E15*Configuración!D17/SUM(tblAsignaturas[Créditos académicos]),\"\")","v":""},{"$f":"Cálculos!AN14","v":""}]
{"$rows_left_out":17}
{"sheet":"Configuración","index":2,"n_rows":15,"n_cols":16,"rows_kept":15,"merged":[[5,2,5,15]]}
[null,"Configuración"]
[null,null,"Asignación de puntuaciones y notas medias"]
[null,null,"Porcentaje",{"v":0,"d":"0%"},{"v":0.6,"d":"60%"},{"v":0.63,"d":"63%"},{"v":0.67,"d":"67%"},{"v":0.7,"d":"70%"},{"v":0.73,"d":"73%"},{"v":0.77,"d":"77%"},{"v":0.8,"d":"80%"},{"v":0.83,"d":"83%"},{"v":0.87,"d":"87%"},{"v":0.9,"d":"90%"},{"v":0.93,"d":"93%"},{"v":0.97,"d":"97%"}]
[null,null,"Calificación","Suspenso","Aprobado -","Aprobado","Aprobado +","Aprobado -","Aprobado","Aprobado +","Notable -","Notable","Notable +","Sobresaliente -","Sobresaliente","Matrícula de Honor"]
[null,null,"Nota media",0,0.67,1,1.33,1.67,2,2.33,2.67,3,3.33,3.67,4,4]
[]
[null,null,"Puntuaciones ponderadas relativas a un máximo de 25 asignaturas"]
[null,null,"Asignaturas que está cursando","Créditos académicos","Deberes","Redacción","Concurso","Proyecto","Examen parcial","Examen final","Otros","% total"]
[null,null,"Francés moderno",{"v":3,"d":"3.0"},{"v":0.1,"d":"10%"},{"v":0.15,"d":"15%"},{"v":0.15,"d":"15%"},{"v":0.1,"d":"10%"},{"v":0.2,"d":"20%"},{"v":0.3,"d":"30%"},null,{"$f":"SUM(tblAsignaturas[[#This Row],[Deberes]:[Otros]])","v":{"v":1,"d":"100%"}}]
[null,null,"Física teórica",{"v":3,"d":"3.0"},{"v":0.15,"d":"15%"},{"v":0.15,"d":"15%"},{"v":0.1,"d":"10%"},{"v":0.1,"d":"10%"},{"v":0.15,"d":"15%"},{"v":0.3,"d":"30%"},{"v":0.05,"d":"5%"},{"$f":"SUM(tblAsignaturas[[#This Row],[Deberes]:[Otros]])","v":{"v":1,"d":"100%"}}]
[null,null,"Matemáticas 1",{"v":4,"d":"4.0"},{"v":0.1,"d":"10%"},{"v":0.15,"d":"15%"},{"v":0.15,"d":"15%"},{"v":0.1,"d":"10%"},{"v":0.2,"d":"20%"},{"v":0.3,"d":"30%"},null,{"$f":"SUM(tblAsignaturas[[#This Row],[Deberes]:[Otros]])","v":{"v":1,"d":"100%"}}]
[null,null,"Matemáticas 2",{"v":4,"d":"4.0"},{"v":0.15,"d":"15%"},{"v":0.15,"d":"15%"},{"v":0.1,"d":"10%"},{"v":0.1,"d":"10%"},{"v":0.15,"d":"15%"},{"v":0.3,"d":"30%"},{"v":0.05,"d":"5%"},{"$f":"SUM(tblAsignaturas[[#This Row],[Deberes]:[Otros]])","v":{"v":1,"d":"100%"}}]
[null,null,"Programación avanzada en Java",{"v":5,"d":"5.0"},{"v":0.15,"d":"15%"},{"v":0.15,"d":"15%"},{"v":0.1,"d":"10%"},{"v":0.1,"d":"10%"},{"v":0.2,"d":"20%"},{"v":0.3,"d":"30%"},null,{"$f":"SUM(tblAsignaturas[[#This Row],[Deberes]:[Otros]])","v":{"v":1,"d":"100%"}}]
[null,null,"Español",{"v":3,"d":"3.0"},{"v":0.1,"d":"10%"},{"v":0.15,"d":"15%"},{"v":0.17,"d":"17%"},{"v":0.13,"d":"13%"},{"v":0.2,"d":"20%"},{"v":0.2,"d":"20%"},{"v":0.05,"d":"5%"},{"$f":"SUM(tblAsignaturas[[#This Row],[Deberes]:[Otros]])","v":{"v":1,"d":"100%"}}]
[null,null,"Redacción",{"v":2,"d":"2.0"},{"v":0.15,"d":"15%"},{"v":0.15,"d":"15%"},{"v":0.12,"d":"12%"},{"v":0.15,"d":"15%"},{"v":0.15,"d":"15%"},{"v":0.25,"d":"25%"},{"v":0.03,"d":"3%"},{"$f":"SUM(tblAsignaturas[[#This Row],[Deberes]:[Otros]])","v":{"v":1,"d":"100%"}}]
{"$rows_left_out":1}
{"sheet":"Cálculos","index":3,"n_rows":657,"n_cols":40,"rows_kept":657,"hidden":true}
[null,"Cálculos"]
[null,null,"Esta hoja de cálculo, que le permite calcular las notas y la nota media, debe quedar oculta. Cualquier cambio que realice en ella puede ocasionar errores."]
[]
[null,null,"Lista de asignaturas actuales","Resultados (sobre 1)",{"$nulls":24},"Cálculo de las notas"]
[null,null,"Asignatura",1,2,3,4,5,6,7,8,9,10,11,12,13,14,15,16,17,18,19,20,21,22,23,24,25,{"$f":"tblAsignaturas[[#Headers],[Deberes]]","v":"Deberes"},{"$f":"tblAsignaturas[[#Headers],[Redacción]]","v":"Redacción"},{"$f":"tblAsignaturas[[#Headers],[Concurso]]","v":"Concurso"},{"$f":"tblAsignaturas[[#Headers],[Proyecto]]","v":"Proyecto"},{"$f":"tblAsignaturas[[#Headers],[Examen parcial]]","v":"Examen parcial"},{"$f":"tblAsignaturas[[#Headers],[Examen final]]","v":"Examen final"},{"$f":"tblAsignaturas[[#Headers],[Otros]]","v":"Otros"},"Total","Total de puntos posibles","% total","Calificación numérica","Calificación"]
[null,null,{"$f":"IF(Configuración!C9=\"\",\"\",Configuración!C9)","v":"Francés moderno"},{"$f":"IFERROR(INDEX(tblPuntuacionesAsignatura[],MATCH($C6:$C30&D$5:AB$5,Cálculos!$C$33:$C$657,0),4),\"\")","v":{"v":0.8,"d":"80%"}},{"v":0.9,"d":"90%"},{"v":0.8,"d":"80%"},"","","","","","","","","","","","","","","","","","","","","","",{"$f":"IFERROR(AVERAGEIFS(tblPuntuacionesAsignatura[Puntuación],tblPuntuacionesAsignatura[Asignatura],Cálculos!$C6,tblPuntuacionesAsignatura[Tipo],Cálculos!AC$5)*Configuración!E9,\"\")","v":0.08333333333333334},{"$f":"IFERROR(AVERAGEIFS(tblPuntuacionesAsignatura[Puntuación],tblPuntuacionesAsignatura[Asignatura],Cálculos!$C6,tblPuntuacionesAsignatura[Tipo],Cálculos!AD$5)*Configuración!F9,\"\")","v":""},{"$f":"IFERROR(AVERAGEIFS(tblPuntuacionesAsignatura[Puntuación],tblPuntuacionesAsignatura[Asignatura],Cálculos!$C6,tblPuntuacionesAsignatura[Tipo],Cálculos!AE$5)*Configuración!G9,\"\")","v":""},{"$f":"IFERROR(AVERAGEIFS(tblPuntuacionesAsignatura[Puntuación],tblPuntuacionesAsignatura[Asignatura],Cálculos!$C6,tblPuntuacionesAsignatura[Tipo],Cálculos!AF$5)*Configuración!H9,\"\")","v":""},{"$f":"IFERROR(AVERAGEIFS(tblPuntuacionesAsignatura[Puntuación],tblPuntuacionesAsignatura[Asignatura],Cálculos!$C6,tblPuntuacionesAsignatura[Tipo],Cálculos!AG$5)*Configuración!I9,\"\")","v":""},{"$f":"IFERROR(AVERAGEIFS(tblPuntuacionesAsignatura[Puntuación],tblPuntuacionesAsignatura[Asignatura],Cálculos!$C6,tblPuntuacionesAsignatura[Tipo],Cálculos!AH$5)*Configuración!J9,\"\")","v":""},{"$f":"IFERROR(AVERAGEIFS(tblPuntuacionesAsignatura[Puntuación],tblPuntuacionesAsignatura[Asignatura],Cálculos!$C6,tblPuntuacionesAsignatura[Tipo],Cálculos!AI$5)*Configuración!K9,\"\")","v":""},{"$f":"SUM(AC6:AI6)","v":0.08333333333333334},{"$f":"SUMIFS(Configuración!E9:K9,Cálculos!AC6:AI6,\">0\")","v":0.1},{"$f":"IFERROR(AJ6/AK6,\"\")","v":{"v":0.8333333333333334,"d":"83%"}},{"$f":"IFERROR(HLOOKUP(AL6,lstAsignaciónPuntuaciones,3),\"\")","v":3},{"$f":"IFERROR(HLOOKUP(AL6,lstAsignaciónPuntuaciones,2),\"\")","v":"Notable"}]
[null,null,{"$f":"IF(Configuración!C10=\"\",\"\",Configuración!C10)","v":"Física teórica"},{"v":0.95,"d":"95%"},"","","","","","","","","","","","","","","","","","","","","","","","",{"$f":"IFERROR(AVERAGEIFS(tblPuntuacionesAsignatura[Puntuación],tblPuntuacionesAsignatura[Asignatura],Cálculos!$C7,tblPuntuacionesAsignatura[Tipo],Cálculos!AC$5)*Configuración!E10,\"\")","v":0.1425},{"$f":"IFERROR(AVERAGEIFS(tblPuntuacionesAsignatura[Puntuación],tblPuntuacionesAsignatura[Asignatura],Cálculos!$C7,tblPuntuacionesAsignatura[Tipo],Cálculos!AD$5)*Configuración!F10,\"\")","v":""},{"$f":"IFERROR(AVERAGEIFS(tblPuntuacionesAsignatura[Puntuación],tblPuntuacionesAsignatura[Asignatura],Cálculos!$C7,tblPuntuacionesAsignatura[Tipo],Cálculos!AE$5)*Configuración!G10,\"\")","v":""},{"$f":"IFERROR(AVERAGEIFS(tblPuntuacionesAsignatura[Puntuación],tblPuntuacionesAsignatura[Asignatura],Cálculos!$C7,tblPuntuacionesAsignatura[Tipo],Cálculos!AF$5)*Configuración!H10,\"\")","v":""},{"$f":"IFERROR(AVERAGEIFS(tblPuntuacionesAsignatura[Puntuación],tblPuntuacionesAsignatura[Asignatura],Cálculos!$C7,tblPuntuacionesAsignatura[Tipo],Cálculos!AG$5)*Configuración!I10,\"\")","v":""},{"$f":"IFERROR(AVERAGEIFS(tblPuntuacionesAsignatura[Puntuación],tblPuntuacionesAsignatura[Asignatura],Cálculos!$C7,tblPuntuacionesAsignatura[Tipo],Cálculos!AH$5)*Configuración!J10,\"\")","v":""},{"$f":"IFERROR(AVERAGEIFS(tblPuntuacionesAsignatura[Puntuación],tblPuntuacionesAsignatura[Asignatura],Cálculos!$C7,tblPuntuacionesAsignatura[Tipo],Cálculos!AI$5)*Configuración!K10,\"\")","v":""},{"$f":"SUM(AC7:AI7)","v":0.1425},{"$f":"SUMIFS(Configuración!E10:K10,Cálculos!AC7:AI7,\">0\")","v":0.15},{"$f":"IFERROR(AJ7/AK7,\"\")","v":{"v":0.95,"d":"95%"}},4,"Sobresaliente"]
[null,null,{"$f":"IF(Configuración!C11=\"\",\"\",Configuración!C11)","v":"Matemáticas 1"},{"v":0.8,"d":"80%"},{"v":0.8,"d":"80%"},"","","","","","","","","","","","","","","","","","","","","","","",{"$f":"IFERROR(AVERAGEIFS(tblPuntuacionesAsignatura[Puntuación],tblPuntuacionesAsignatura[Asignatura],Cálculos!$C8,tblPuntuacionesAsignatura[Tipo],Cálculos!AC$5)*Configuración!E11,\"\")","v":0.08000000000000002},{"$f":"IFERROR(AVERAGEIFS(tblPuntuacionesAsignatura[Puntuación],tblPuntuacionesAsignatura[Asignatura],Cálculos!$C8,tblPuntuacionesAsignatura[Tipo],Cálculos!AD$5)*Configuración!F11,\"\")","v":""},{"$f":"IFERROR(AVERAGEIFS(tblPuntuacionesAsignatura[Puntuación],tblPuntuacionesAsignatura[Asignatura],Cálculos!$C8,tblPuntuacionesAsignatura[Tipo],Cálculos!AE$5)*Configuración!G11,\"\")","v":""},{"$f":"IFERROR(AVERAGEIFS(tblPuntuacionesAsignatura[Puntuación],tblPuntuacionesAsignatura[Asignatura],Cálculos!$C8,tblPuntuacionesAsignatura[Tipo],Cálculos!AF$5)*Configuración!H11,\"\")","v":""},{"$f":"IFERROR(AVERAGEIFS(tblPuntuacionesAsignatura[Puntuación],tblPuntuacionesAsignatura[Asignatura],Cálculos!$C8,tblPuntuacionesAsignatura[Tipo],Cálculos!AG$5)*Configuración!I11,\"\")","v":""},{"$f":"IFERROR(AVERAGEIFS(tblPuntuacionesAsignatura[Puntuación],tblPuntuacionesAsignatura[Asignatura],Cálculos!$C8,tblPuntuacionesAsignatura[Tipo],Cálculos!AH$5)*Configuración!J11,\"\")","v":""},{"$f":"IFERROR(AVERAGEIFS(tblPuntuacionesAsignatura[Puntuación],tblPuntuacionesAsignatura[Asignatura],Cálculos!$C8,tblPuntuacionesAsignatura[Tipo],Cálculos!AI$5)*Configuración!K11,\"\")","v":""},0.08000000000000002,{"$f":"SUMIFS(Configuración!E11:K11,Cálculos!AC8:AI8,\">0\")","v":0.1},{"v":0.8000000000000002,"d":"80%"},2.67,"Notable -"]
[null,null,{"$f":"IF(Configuración!C12=\"\",\"\",Configuración!C12)","v":"Matemáticas 2"},{"v":0.85,"d":"85%"},{"v":0.95,"d":"95%"},"","","","","","","","","","","","","","","","","","","","","","","",{"$f":"IFERROR(AVERAGEIFS(tblPuntuacionesAsignatura[Puntuación],tblPuntuacionesAsignatura[Asignatura],Cálculos!$C9,tblPuntuacionesAsignatura[Tipo],Cálculos!AC$5)*Configuración!E12,\"\")","v":0.1275},{"$f":"IFERROR(AVERAGEIFS(tblPuntuacionesAsignatura[Puntuación],tblPuntuacionesAsignatura[Asignatura],Cálculos!$C9,tblPuntuacionesAsignatura[Tipo],Cálculos!AD$5)*Configuración!F12,\"\")","v":""},{"$f":"IFERROR(AVERAGEIFS(tblPuntuacionesAsignatura[Puntuación],tblPuntuacionesAsignatura[Asignatura],Cálculos!$C9,tblPuntuacionesAsignatura[Tipo],Cálculos!AE$5)*Configuración!G12,\"\")","v":0.095},{"$f":"IFERROR(AVERAGEIFS(tblPuntuacionesAsignatura[Puntuación],tblPuntuacionesAsignatura[Asignatura],Cálculos!$C9,tblPuntuacionesAsignatura[Tipo],Cálculos!AF$5)*Configuración!H12,\"\")","v":""},{"$f":"IFERROR(AVERAGEIFS(tblPuntuacionesAsignatura[Puntuación],tblPuntuacionesAsignatura[Asignatura],Cálculos!$C9,tblPuntuacionesAsignatura[Tipo],Cálculos!AG$5)*Configuración!I12,\"\")","v":""},{"$f":"IFERROR(AVERAGEIFS(tblPuntuacionesAsignatura[Puntuación],tblPuntuacionesAsignatura[Asignatura],Cálculos!$C9,tblPuntuacionesAsignatura[Tipo],Cálculos!AH$5)*Configuración!J12,\"\")","v":""},{"$f":"IFERROR(AVERAGEIFS(tblPuntuacionesAsignatura[Puntuación],tblPuntuacionesAsignatura[Asignatura],Cálculos!$C9,tblPuntuacionesAsignatura[Tipo],Cálculos!AI$5)*Configuración!K12,\"\")","v":""},0.2225,{"$f":"SUMIFS(Configuración!E12:K12,Cálculos!AC9:AI9,\">0\")","v":0.25},{"v":0.89,"d":"89%"},3.33,"Notable +"]
[null,null,{"$f":"IF(Configuración!C13=\"\",\"\",Configuración!C13)","v":"Programación avanzada en Java"},{"v":0.75,"d":"75%"},"","","","","","","","","","","","","","","","","","","","","","","","",{"$f":"IFERROR(AVERAGEIFS(tblPuntuacionesAsignatura[Puntuación],tblPuntuacionesAsignatura[Asignatura],Cálculos!$C10,tblPuntuacionesAsignatura[Tipo],Cálculos!AC$5)*Configuración!E13,\"\")","v":""},{"$f":"IFERROR(AVERAGEIFS(tblPuntuacionesAsignatura[Puntuación],tblPuntuacionesAsignatura[Asignatura],Cálculos!$C10,tblPuntuacionesAsignatura[Tipo],Cálculos!AD$5)*Configuración!F13,\"\")","v":""},{"$f":"IFERROR(AVERAGEIFS(tblPuntuacionesAsignatura[Puntuación],tblPuntuacionesAsignatura[Asignatura],Cálculos!$C10,tblPuntuacionesAsignatura[Tipo],Cálculos!AE$5)*Configuración!G13,\"\")","v":""},{"$f":"IFERROR(AVERAGEIFS(tblPuntuacionesAsignatura[Puntuación],tblPuntuacionesAsignatura[Asignatura],Cálculos!$C10,tblPuntuacionesAsignatura[Tipo],Cálculos!AF$5)*Configuración!H13,\"\")","v":""},{"$f":"IFERROR(AVERAGEIFS(tblPuntuacionesAsignatura[Puntuación],tblPuntuacionesAsignatura[Asignatura],Cálculos!$C10,tblPuntuacionesAsignatura[Tipo],Cálculos!AG$5)*Configuración!I13,\"\")","v":0.15000000000000002},{"$f":"IFERROR(AVERAGEIFS(tblPuntuacionesAsignatura[Puntuación],tblPuntuacionesAsignatura[Asignatura],Cálculos!$C10,tblPuntuacionesAsignatura[Tipo],Cálculos!AH$5)*Configuración!J13,\"\")","v":""},{"$f":"IFERROR(AVERAGEIFS(tblPuntuacionesAsignatura[Puntuación],tblPuntuacionesAsignatura[Asignatura],Cálculos!$C10,tblPuntuacionesAsignatura[Tipo],Cálculos!AI$5)*Configuración!K13,\"\")","v":""},0.15000000000000002,{"$f":"SUMIFS(Configuración!E13:K13,Cálculos!AC10:AI10,\">0\")","v":0.2},{"v":0.7500000000000001,"d":"75%"},2,"Aprobado"]
[null,null,{"$f":"IF(Configuración!C14=\"\",\"\",Configuración!C14)","v":"Español"},{"v":0.5,"d":"50%"},"","","","","","","","","","","","","","","","","","","","","","","","",{"$f":"IFERROR(AVERAGEIFS(tblPuntuacionesAsignatura[Puntuación],tblPuntuacionesAsignatura[Asignatura],Cálculos!$C11,tblPuntuacionesAsignatura[Tipo],Cálculos!AC$5)*Configuración!E14,\"\")","v":0.05},{"$f":"IFERROR(AVERAGEIFS(tblPuntuacionesAsignatura[Puntuación],tblPuntuacionesAsignatura[Asignatura],Cálculos!$C11,tblPuntuacionesAsignatura[Tipo],Cálculos!AD$5)*Configuración!F14,\"\")","v":""},{"$f":"IFERROR(AVERAGEIFS(tblPuntuacionesAsignatura[Puntuación],tblPuntuacionesAsignatura[Asignatura],Cálculos!$C11,tblPuntuacionesAsignatura[Tipo],Cálculos!AE$5)*Configuración!G14,\"\")","v":""},{"$f":"IFERROR(AVERAGEIFS(tblPuntuacionesAsignatura[Puntuación],tblPuntuacionesAsignatura[Asignatura],Cálculos!$C11,tblPuntuacionesAsignatura[Tipo],Cálculos!AF$5)*Configuración!H14,\"\")","v":""},{"$f":"IFERROR(AVERAGEIFS(tblPuntuacionesAsignatura[Puntuación],tblPuntuacionesAsignatura[Asignatura],Cálculos!$C11,tblPuntuacionesAsignatura[Tipo],Cálculos!AG$5)*Configuración!I14,\"\")","v":""},{"$f":"IFERROR(AVERAGEIFS(tblPuntuacionesAsignatura[Puntuación],tblPuntuacionesAsignatura[Asignatura],Cálculos!$C11,tblPuntuacionesAsignatura[Tipo],Cálculos!AH$5)*Configuración!J14,\"\")","v":""},{"$f":"IFERROR(AVERAGEIFS(tblPuntuacionesAsignatura[Puntuación],tblPuntuacionesAsignatura[Asignatura],Cálculos!$C11,tblPuntuacionesAsignatura[Tipo],Cálculos!AI$5)*Configuración!K14,\"\")","v":""},0.05,{"$f":"SUMIFS(Configuración!E14:K14,Cálculos!AC11:AI11,\">0\")","v":0.1},{"v":0.5,"d":"50%"},0,"Suspenso"]
[null,null,{"$f":"IF(Configuración!C15=\"\",\"\",Configuración!C15)","v":"Redacción"},{"v":0.95,"d":"95%"},"","","","","","","","","","","","","","","","","","","","","","","","",{"$f":"IFERROR(AVERAGEIFS(tblPuntuacionesAsignatura[Puntuación],tblPuntuacionesAsignatura[Asignatura],Cálculos!$C12,tblPuntuacionesAsignatura[Tipo],Cálculos!AC$5)*Configuración!E15,\"\")","v":""},{"$f":"IFERROR(AVERAGEIFS(tblPuntuacionesAsignatura[Puntuación],tblPuntuacionesAsignatura[Asignatura],Cálculos!$C12,tblPuntuacionesAsignatura[Tipo],Cálculos!AD$5)*Configuración!F15,\"\")","v":0.1425},{"$f":"IFERROR(AVERAGEIFS(tblPuntuacionesAsignatura[Puntuación],tblPuntuacionesAsignatura[Asignatura],Cálculos!$C12,tblPuntuacionesAsignatura[Tipo],Cálculos!AE$5)*Configuración!G15,\"\")","v":""},{"$f":"IFERROR(AVERAGEIFS(tblPuntuacionesAsignatura[Puntuación],tblPuntuacionesAsignatura[Asignatura],Cálculos!$C12,tblPuntuacionesAsignatura[Tipo],Cálculos!AF$5)*Configuración!H15,\"\")","v":""},{"$f":"IFERROR(AVERAGEIFS(tblPuntuacionesAsignatura[Puntuación],tblPuntuacionesAsignatura[Asignatura],Cálculos!$C12,tblPuntuacionesAsignatura[Tipo],Cálculos!AG$5)*Configuración!I15,\"\")","v":""},{"$f":"IFERROR(AVERAGEIFS(tblPuntuacionesAsignatura[Puntuación],tblPuntuacionesAsignatura[Asignatura],Cálculos!$C12,tblPuntuacionesAsignatura[Tipo],Cálculos!AH$5)*Configuración!J15,\"\")","v":""},{"$f":"IFERROR(AVERAGEIFS(tblPuntuacionesAsignatura[Puntuación],tblPuntuacionesAsignatura[Asignatura],Cálculos!$C12,tblPuntuacionesAsignatura[Tipo],Cálculos!AI$5)*Configuración!K15,\"\")","v":""},0.1425,{"$f":"SUMIFS(Configuración!E15:K15,Cálculos!AC12:AI12,\">0\")","v":0.15},{"v":0.95,"d":"95%"},4,"Sobresaliente"]
[null,null,{"$f":"IF(Configuración!C16=\"\",\"\",Configuración!C16)","v":""},"","","","","","","","","","","","","","","","","","","","","","","","","",{"$f":"IFERROR(AVERAGEIFS(tblPuntuacionesAsignatura[Puntuación],tblPuntuacionesAsignatura[Asignatura],Cálculos!$C13,tblPuntuacionesAsignatura[Tipo],Cálculos!AC$5)*Configuración!E16,\"\")","v":""},{"$f":"IFERROR(AVERAGEIFS(tblPuntuacionesAsignatura[Puntuación],tblPuntuacionesAsignatura[Asignatura],Cálculos!$C13,tblPuntuacionesAsignatura[Tipo],Cálculos!AD$5)*Configuración!F16,\"\")","v":""},{"$f":"IFERROR(AVERAGEIFS(tblPuntuacionesAsignatura[Puntuación],tblPuntuacionesAsignatura[Asignatura],Cálculos!$C13,tblPuntuacionesAsignatura[Tipo],Cálculos!AE$5)*Configuración!G16,\"\")","v":""},{"$f":"IFERROR(AVERAGEIFS(tblPuntuacionesAsignatura[Puntuación],tblPuntuacionesAsignatura[Asignatura],Cálculos!$C13,tblPuntuacionesAsignatura[Tipo],Cálculos!AF$5)*Configuración!H16,\"\")","v":""},{"$f":"IFERROR(AVERAGEIFS(tblPuntuacionesAsignatura[Puntuación],tblPuntuacionesAsignatura[Asignatura],Cálculos!$C13,tblPuntuacionesAsignatura[Tipo],Cálculos!AG$5)*Configuración!I16,\"\")","v":""},{"$f":"IFERROR(AVERAGEIFS(tblPuntuacionesAsignatura[Puntuación],tblPuntuacionesAsignatura[Asignatura],Cálculos!$C13,tblPuntuacionesAsignatura[Tipo],Cálculos!AH$5)*Configuración!J16,\"\")","v":""},{"$f":"IFERROR(AVERAGEIFS(tblPuntuacionesAsignatura[Puntuación],tblPuntuacionesAsignatura[Asignatura],Cálculos!$C13,tblPuntuacionesAsignatura[Tipo],Cálculos!AI$5)*Configuración!K16,\"\")","v":""},0,{"$f":"SUMIFS(Configuración!E16:K16,Cálculos!AC13:AI13,\">0\")","v":0},"","",""]
[null,null,{"$f":"IF(Configuración!C17=\"\",\"\",Configuración!C17)","v":""},"","","","","","","","","","","","","","","","","","","","","","","","","",{"$f":"IFERROR(AVERAGEIFS(tblPuntuacionesAsignatura[Puntuación],tblPuntuacionesAsignatura[Asignatura],Cálculos!$C14,tblPuntuacionesAsignatura[Tipo],Cálculos!AC$5)*Configuración!E17,\"\")","v":""},{"$f":"IFERROR(AVERAGEIFS(tblPuntuacionesAsignatura[Puntuación],tblPuntuacionesAsignatura[Asignatura],Cálculos!$C14,tblPuntuacionesAsignatura[Tipo],Cálculos!AD$5)*Configuración!F17,\"\")","v":""},{"$f":"IFERROR(AVERAGEIFS(tblPuntuacionesAsignatura[Puntuación],tblPuntuacionesAsignatura[Asignatura],Cálculos!$C14,tblPuntuacionesAsignatura[Tipo],Cálculos!AE$5)*Configuración!G17,\"\")","v":""},{"$f":"IFERROR(AVERAGEIFS(tblPuntuacionesAsignatura[Puntuación],tblPuntuacionesAsignatura[Asignatura],Cálculos!$C14,tblPuntuacionesAsignatura[Tipo],Cálculos!AF$5)*Configuración!H17,\"\")","v":""},{"$f":"IFERROR(AVERAGEIFS(tblPuntuacionesAsignatura[Puntuación],tblPuntuacionesAsignatura[Asignatura],Cálculos!$C14,tblPuntuacionesAsignatura[Tipo],Cálculos!AG$5)*Configuración!I17,\"\")","v":""},{"$f":"IFERROR(AVERAGEIFS(tblPuntuacionesAsignatura[Puntuación],tblPuntuacionesAsignatura[Asignatura],Cálculos!$C14,tblPuntuacionesAsignatura[Tipo],Cálculos!AH$5)*Configuración!J17,\"\")","v":""},{"$f":"IFERROR(AVERAGEIFS(tblPuntuacionesAsignatura[Puntuación],tblPuntuacionesAsignatura[Asignatura],Cálculos!$C14,tblPuntuacionesAsignatura[Tipo],Cálculos!AI$5)*Configuración!K17,\"\")","v":""},0,{"$f":"SUMIFS(Configuración!E17:K17,Cálculos!AC14:AI14,\">0\")","v":0},"","",""]
[null,null,{"$f":"IF(Configuración!C18=\"\",\"\",Configuración!C18)","v":""},"","","","","","","","","","","","","","","","","","","","","","","","","",{"$f":"IFERROR(AVERAGEIFS(tblPuntuacionesAsignatura[Puntuación],tblPuntuacionesAsignatura[Asignatura],Cálculos!$C15,tblPuntuacionesAsignatura[Tipo],Cálculos!AC$5)*Configuración!E18,\"\")","v":""},{"$f":"IFERROR(AVERAGEIFS(tblPuntuacionesAsignatura[Puntuación],tblPuntuacionesAsignatura[Asignatura],Cálculos!$C15,tblPuntuacionesAsignatura[Tipo],Cálculos!AD$5)*Configuración!F18,\"\")","v":""},{"$f":"IFERROR(AVERAGEIFS(tblPuntuacionesAsignatura[Puntuación],tblPuntuacionesAsignatura[Asignatura],Cálculos!$C15,tblPuntuacionesAsignatura[Tipo],Cálculos!AE$5)*Configuración!G18,\"\")","v":""},{"$f":"IFERROR(AVERAGEIFS(tblPuntuacionesAsignatura[Puntuación],tblPuntuacionesAsignatura[Asignatura],Cálculos!$C15,tblPuntuacionesAsignatura[Tipo],Cálculos!AF$5)*Configuración!H18,\"\")","v":""},{"$f":"IFERROR(AVERAGEIFS(tblPuntuacionesAsignatura[Puntuación],tblPuntuacionesAsignatura[Asignatura],Cálculos!$C15,tblPuntuacionesAsignatura[Tipo],Cálculos!AG$5)*Configuración!I18,\"\")","v":""},{"$f":"IFERROR(AVERAGEIFS(tblPuntuacionesAsignatura[Puntuación],tblPuntuacionesAsignatura[Asignatura],Cálculos!$C15,tblPuntuacionesAsignatura[Tipo],Cálculos!AH$5)*Configuración!J18,\"\")","v":""},{"$f":"IFERROR(AVERAGEIFS(tblPuntuacionesAsignatura[Puntuación],tblPuntuacionesAsignatura[Asignatura],Cálculos!$C15,tblPuntuacionesAsignatura[Tipo],Cálculos!AI$5)*Configuración!K18,\"\")","v":""},0,{"$f":"SUMIFS(Configuración!E18:K18,Cálculos!AC15:AI15,\">0\")","v":0},"","",""]
{"$rows_left_out":642}